You are viewing a plain text version of this content. The canonical link for it is here.
Posted to dev@brooklyn.apache.org by Apache Jenkins Server <je...@builds.apache.org> on 2016/12/05 11:30:52 UTC

Build failed in Jenkins: brooklyn-server-master #380

See <https://builds.apache.org/job/brooklyn-server-master/380/>

------------------------------------------
[...truncated 48910 lines...]
[INFO] --- maven-surefire-plugin:2.18.1:test (default-test) @ brooklyn-karaf-httpcomponents-extension ---
[INFO] Skipping execution of surefire because it has already been run for this configuration
[JENKINS] Recording test results[INFO] 
[INFO] --- maven-site-plugin:3.4:attach-descriptor (attach-descriptor) @ brooklyn-karaf-httpcomponents-extension ---

[WARNING] Failed to getClass for org.apache.felix.bundleplugin.BundlePlugin
[INFO] 
[INFO] <<< maven-bundle-plugin:2.5.4:bundle (default-bundle) < package @ brooklyn-karaf-httpcomponents-extension <<<
[INFO] 
[INFO] --- maven-bundle-plugin:2.5.4:bundle (default-bundle) @ brooklyn-karaf-httpcomponents-extension ---
[WARNING] Bundle org.apache.brooklyn:brooklyn-karaf-httpcomponents-extension:bundle:0.11.0-SNAPSHOT : Unused Private-Package instructions, no such package(s) on the class path: [!*]
[INFO] 
[INFO] --- maven-site-plugin:3.4:attach-descriptor (attach-descriptor) @ brooklyn-karaf-httpcomponents-extension ---
[INFO] 
[INFO] --- maven-install-plugin:2.5.2:install (default-install) @ brooklyn-karaf-httpcomponents-extension ---
[INFO] Installing <https://builds.apache.org/job/brooklyn-server-master/ws/karaf/httpcomponent-extension/target/brooklyn-karaf-httpcomponents-extension-0.11.0-SNAPSHOT.jar> to /home/jenkins/jenkins-slave/maven-repositories/0/org/apache/brooklyn/brooklyn-karaf-httpcomponents-extension/0.11.0-SNAPSHOT/brooklyn-karaf-httpcomponents-extension-0.11.0-SNAPSHOT.jar
[INFO] Installing <https://builds.apache.org/job/brooklyn-server-master/ws/karaf/httpcomponent-extension/pom.xml> to /home/jenkins/jenkins-slave/maven-repositories/0/org/apache/brooklyn/brooklyn-karaf-httpcomponents-extension/0.11.0-SNAPSHOT/brooklyn-karaf-httpcomponents-extension-0.11.0-SNAPSHOT.pom
[WARNING] Failed to getClass for org.apache.felix.obrplugin.ObrInstall
[INFO] 
[INFO] <<< maven-bundle-plugin:2.5.4:install (default-install) < install @ brooklyn-karaf-httpcomponents-extension <<<
[INFO] 
[INFO] --- maven-bundle-plugin:2.5.4:install (default-install) @ brooklyn-karaf-httpcomponents-extension ---
[INFO] Installing org/apache/brooklyn/brooklyn-karaf-httpcomponents-extension/0.11.0-SNAPSHOT/brooklyn-karaf-httpcomponents-extension-0.11.0-SNAPSHOT.jar
[INFO] Writing OBR metadata
[INFO]                                                                         
[INFO] ------------------------------------------------------------------------
[INFO] Building Brooklyn Karaf Features 0.11.0-SNAPSHOT
[INFO] ------------------------------------------------------------------------
[INFO] 
[INFO] --- maven-clean-plugin:2.5:clean (default-clean) @ brooklyn-features ---
[INFO] Deleting <https://builds.apache.org/job/brooklyn-server-master/ws/karaf/features/target>
[INFO] 
[INFO] --- maven-remote-resources-plugin:1.5:process (default) @ brooklyn-features ---
[INFO] 
[INFO] --- karaf-maven-plugin:4.0.4:features-generate-descriptor (default-features-generate-descriptor) @ brooklyn-features ---
[INFO] Downloading: http://repository.apache.org/snapshots/org/apache/brooklyn/brooklyn-features/0.11.0-SNAPSHOT/maven-metadata.xml
[INFO] Generating feature descriptor file <https://builds.apache.org/job/brooklyn-server-master/ws/karaf/features/target/feature/feature.xml>
[INFO] ...done!
[INFO] 
[INFO] --- maven-site-plugin:3.4:attach-descriptor (attach-descriptor) @ brooklyn-features ---
[INFO] 
[INFO] --- maven-install-plugin:2.5.2:install (default-install) @ brooklyn-features ---
[INFO] No primary artifact to install, installing attached artifacts instead.
[INFO] Installing <https://builds.apache.org/job/brooklyn-server-master/ws/karaf/features/pom.xml> to /home/jenkins/jenkins-slave/maven-repositories/0/org/apache/brooklyn/brooklyn-features/0.11.0-SNAPSHOT/brooklyn-features-0.11.0-SNAPSHOT.pom
[INFO] Installing <https://builds.apache.org/job/brooklyn-server-master/ws/karaf/features/target/feature/feature.xml> to /home/jenkins/jenkins-slave/maven-repositories/0/org/apache/brooklyn/brooklyn-features/0.11.0-SNAPSHOT/brooklyn-features-0.11.0-SNAPSHOT-features.xml
[INFO]                                                                         
[INFO] ------------------------------------------------------------------------
[INFO] Building Brooklyn Karaf Shell Commands 0.11.0-SNAPSHOT
[INFO] ------------------------------------------------------------------------
[INFO] Downloading: http://svn.apache.org/repos/asf/servicemix/m2-repo/net/schmizz/sshj/maven-metadata.xml
[INFO] Downloading: https://oss.sonatype.org/content/repositories/snapshots/net/schmizz/sshj/maven-metadata.xml
[INFO] Downloading: https://repo.maven.apache.org/maven2/net/schmizz/sshj/maven-metadata.xml
[INFO] Downloading: http://repository.apache.org/snapshots/net/schmizz/sshj/maven-metadata.xml
[INFO] Downloading: https://repository.apache.org/content/repositories/snapshots/net/schmizz/sshj/maven-metadata.xml
[INFO] Downloading: https://oss.sonatype.org/content/repositories/snapshots/net/schmizz/sshj/maven-metadata.xml
[INFO] Downloaded: https://repo.maven.apache.org/maven2/net/schmizz/sshj/maven-metadata.xml (790 B at 2.3 KB/sec)
[INFO] Downloaded: https://oss.sonatype.org/content/repositories/snapshots/net/schmizz/sshj/maven-metadata.xml (398 B at 0.7 KB/sec)
[INFO] Downloaded: https://oss.sonatype.org/content/repositories/snapshots/net/schmizz/sshj/maven-metadata.xml (398 B at 1.0 KB/sec)
[INFO] Downloading: https://oss.sonatype.org/content/repositories/snapshots/net/schmizz/sshj/0.9.1-SNAPSHOT/maven-metadata.xml
[INFO] Downloading: http://repository.apache.org/snapshots/net/schmizz/sshj/0.9.1-SNAPSHOT/maven-metadata.xml
[INFO] Downloading: https://repository.apache.org/content/repositories/snapshots/net/schmizz/sshj/0.9.1-SNAPSHOT/maven-metadata.xml
[INFO] Downloading: https://oss.sonatype.org/content/repositories/snapshots/net/schmizz/sshj/0.9.1-SNAPSHOT/maven-metadata.xml
[INFO] Downloaded: https://oss.sonatype.org/content/repositories/snapshots/net/schmizz/sshj/0.9.1-SNAPSHOT/maven-metadata.xml (2 KB at 6.0 KB/sec)
[INFO] Downloaded: https://oss.sonatype.org/content/repositories/snapshots/net/schmizz/sshj/0.9.1-SNAPSHOT/maven-metadata.xml (2 KB at 5.9 KB/sec)
[INFO] Downloading: http://repository.apache.org/snapshots/net/schmizz/sshj/0.10.1-SNAPSHOT/maven-metadata.xml
[INFO] Downloading: https://oss.sonatype.org/content/repositories/snapshots/net/schmizz/sshj/0.10.1-SNAPSHOT/maven-metadata.xml
[INFO] Downloading: https://oss.sonatype.org/content/repositories/snapshots/net/schmizz/sshj/0.10.1-SNAPSHOT/maven-metadata.xml
[INFO] Downloading: https://repository.apache.org/content/repositories/snapshots/net/schmizz/sshj/0.10.1-SNAPSHOT/maven-metadata.xml
[INFO] Downloaded: https://oss.sonatype.org/content/repositories/snapshots/net/schmizz/sshj/0.10.1-SNAPSHOT/maven-metadata.xml (2 KB at 7.7 KB/sec)
[INFO] Downloaded: https://oss.sonatype.org/content/repositories/snapshots/net/schmizz/sshj/0.10.1-SNAPSHOT/maven-metadata.xml (2 KB at 7.7 KB/sec)
[INFO] 
[INFO] --- maven-clean-plugin:2.5:clean (default-clean) @ brooklyn-commands ---
[INFO] Deleting <https://builds.apache.org/job/brooklyn-server-master/ws/karaf/commands/target>
[INFO] 
[INFO] --- maven-remote-resources-plugin:1.5:process (default) @ brooklyn-commands ---
[INFO] artifact net.schmizz:sshj: checking for updates from servicemix
[INFO] artifact net.schmizz:sshj: checking for updates from central
[INFO] artifact net.schmizz:sshj: checking for updates from jclouds-sona-snapshots-nexus
[INFO] 
[INFO] --- maven-resources-plugin:2.7:resources (default-resources) @ brooklyn-commands ---
[INFO] Using 'UTF-8' encoding to copy filtered resources.
[INFO] skip non existing resourceDirectory <https://builds.apache.org/job/brooklyn-server-master/ws/karaf/commands/src/main/resources>
[INFO] Copying 3 resources
[INFO] 
[INFO] --- maven-compiler-plugin:3.2:compile (default-compile) @ brooklyn-commands ---
[INFO] Changes detected - recompiling the module!
[INFO] Compiling 11 source files to <https://builds.apache.org/job/brooklyn-server-master/ws/karaf/commands/target/classes>
[INFO] 
[INFO] --- maven-resources-plugin:2.7:testResources (default-testResources) @ brooklyn-commands ---
[INFO] Using 'UTF-8' encoding to copy filtered resources.
[INFO] skip non existing resourceDirectory <https://builds.apache.org/job/brooklyn-server-master/ws/karaf/commands/src/test/resources>
[INFO] Copying 3 resources
[INFO] 
[INFO] --- maven-compiler-plugin:3.2:testCompile (default-testCompile) @ brooklyn-commands ---
[INFO] No sources to compile
[INFO] 
[INFO] --- maven-surefire-plugin:2.18.1:test (default-test) @ brooklyn-commands ---
[JENKINS] Recording test results
[INFO] 
[INFO] --- maven-bundle-plugin:2.5.3:bundle (default-bundle) @ brooklyn-commands ---
[INFO] 
[INFO] --- maven-site-plugin:3.4:attach-descriptor (attach-descriptor) @ brooklyn-commands ---
[INFO] 
[INFO] --- maven-install-plugin:2.5.2:install (default-install) @ brooklyn-commands ---
[INFO] Installing <https://builds.apache.org/job/brooklyn-server-master/ws/karaf/commands/target/brooklyn-commands-0.11.0-SNAPSHOT.jar> to /home/jenkins/jenkins-slave/maven-repositories/0/org/apache/brooklyn/brooklyn-commands/0.11.0-SNAPSHOT/brooklyn-commands-0.11.0-SNAPSHOT.jar
[INFO] Installing <https://builds.apache.org/job/brooklyn-server-master/ws/karaf/commands/pom.xml> to /home/jenkins/jenkins-slave/maven-repositories/0/org/apache/brooklyn/brooklyn-commands/0.11.0-SNAPSHOT/brooklyn-commands-0.11.0-SNAPSHOT.pom
[INFO] 
[INFO] --- maven-bundle-plugin:2.5.3:install (default-install) @ brooklyn-commands ---
[INFO] Installing org/apache/brooklyn/brooklyn-commands/0.11.0-SNAPSHOT/brooklyn-commands-0.11.0-SNAPSHOT.jar
[INFO] Writing OBR metadata
[INFO] ------------------------------------------------------------------------
[INFO] Reactor Summary:
[INFO] 
[INFO] Brooklyn Server Root ............................... SUCCESS [ 11.933 s]
[INFO] Brooklyn Parent Project ............................ SUCCESS [  6.380 s]
[INFO] Brooklyn Test Support Utilities .................... SUCCESS [ 18.616 s]
[INFO] Brooklyn Logback Includable Configuration .......... SUCCESS [ 13.482 s]
[INFO] Brooklyn Common Utilities .......................... SUCCESS [01:04 min]
[INFO] Brooklyn API ....................................... SUCCESS [ 23.820 s]
[INFO] CAMP Server Parent Project ......................... SUCCESS [ 14.260 s]
[INFO] CAMP Base .......................................... SUCCESS [ 19.704 s]
[INFO] Brooklyn Test Support .............................. SUCCESS [  8.215 s]
[INFO] Brooklyn REST Swagger Apidoc Utilities ............. SUCCESS [ 12.131 s]
[INFO] Brooklyn Logback Configuration ..................... SUCCESS [  9.709 s]
[INFO] CAMP Server ........................................ SUCCESS [ 24.785 s]
[INFO] Brooklyn Felix Runtime ............................. SUCCESS [ 18.634 s]
[INFO] Brooklyn Groovy Utilities .......................... SUCCESS [  8.095 s]
[INFO] Brooklyn Core ...................................... SUCCESS [06:50 min]
[INFO] Brooklyn Policies .................................. SUCCESS [02:20 min]
[INFO] Brooklyn WinRM Software Entities ................... SUCCESS [ 18.916 s]
[INFO] Brooklyn Secure JMXMP Agent ........................ SUCCESS [ 22.602 s]
[INFO] Brooklyn JMX RMI Agent ............................. SUCCESS [  9.292 s]
[INFO] Brooklyn Jclouds Location Targets .................. SUCCESS [ 37.064 s]
[INFO] Brooklyn Software Base ............................. SUCCESS [04:07 min]
[INFO] Brooklyn CAMP ...................................... SUCCESS [11:30 min]
[INFO] Brooklyn Hazelcast Storage ......................... SUCCESS [ 14.625 s]
[INFO] Brooklyn Launcher Common ........................... SUCCESS [ 17.796 s]
[INFO] Brooklyn REST API .................................. SUCCESS [ 23.381 s]
[INFO] Brooklyn REST Resources ............................ SUCCESS [01:14 min]
[INFO] Brooklyn REST Server ............................... SUCCESS [ 43.606 s]
[INFO] Brooklyn Launcher .................................. SUCCESS [01:40 min]
[INFO] Brooklyn Command Line Interface .................... SUCCESS [ 42.006 s]
[INFO] Brooklyn Test Framework ............................ SUCCESS [01:13 min]
[INFO] Brooklyn OSGi init ................................. SUCCESS [ 13.401 s]
[INFO] Brooklyn Karaf ..................................... SUCCESS [  5.404 s]
[INFO] Jetty config fragment .............................. SUCCESS [ 12.386 s]
[INFO] Apache Http Component extension .................... SUCCESS [ 11.862 s]
[INFO] Brooklyn Karaf Features ............................ SUCCESS [  4.738 s]
[INFO] Brooklyn Karaf Shell Commands ...................... SUCCESS [ 14.102 s]
[INFO] ------------------------------------------------------------------------
[INFO] BUILD SUCCESS
[INFO] ------------------------------------------------------------------------
[INFO] Total time: 44:33 min
[INFO] Finished at: 2016-12-05T11:28:10+00:00
[INFO] Final Memory: 119M/677M
[INFO] ------------------------------------------------------------------------
Waiting for Jenkins to finish collecting data
[JENKINS] Archiving <https://builds.apache.org/job/brooklyn-server-master/ws/camp/pom.xml> to org.apache.brooklyn.camp/camp-parent/0.11.0-SNAPSHOT/camp-parent-0.11.0-SNAPSHOT.pom
No artifacts from brooklyn-server-master » CAMP Server Parent Project #379 to compare, so performing full copy of artifacts
[JENKINS] Archiving <https://builds.apache.org/job/brooklyn-server-master/ws/utils/rt-felix/pom.xml> to org.apache.brooklyn/brooklyn-rt-felix/0.11.0-SNAPSHOT/brooklyn-rt-felix-0.11.0-SNAPSHOT.pom
[JENKINS] Archiving <https://builds.apache.org/job/brooklyn-server-master/ws/utils/rt-felix/target/brooklyn-rt-felix-0.11.0-SNAPSHOT.jar> to org.apache.brooklyn/brooklyn-rt-felix/0.11.0-SNAPSHOT/brooklyn-rt-felix-0.11.0-SNAPSHOT.jar
[JENKINS] Archiving <https://builds.apache.org/job/brooklyn-server-master/ws/utils/rt-felix/target/brooklyn-rt-felix-0.11.0-SNAPSHOT-tests.jar> to org.apache.brooklyn/brooklyn-rt-felix/0.11.0-SNAPSHOT/brooklyn-rt-felix-0.11.0-SNAPSHOT-tests.jar
[JENKINS] Archiving <https://builds.apache.org/job/brooklyn-server-master/ws/utils/rt-felix/target/brooklyn-rt-felix-0.11.0-SNAPSHOT-sources.jar> to org.apache.brooklyn/brooklyn-rt-felix/0.11.0-SNAPSHOT/brooklyn-rt-felix-0.11.0-SNAPSHOT-sources.jar
[JENKINS] Archiving <https://builds.apache.org/job/brooklyn-server-master/ws/utils/rt-felix/target/brooklyn-rt-felix-0.11.0-SNAPSHOT-test-sources.jar> to org.apache.brooklyn/brooklyn-rt-felix/0.11.0-SNAPSHOT/brooklyn-rt-felix-0.11.0-SNAPSHOT-test-sources.jar
No artifacts from brooklyn-server-master » Brooklyn Felix Runtime #379 to compare, so performing full copy of artifacts
[JENKINS] Archiving <https://builds.apache.org/job/brooklyn-server-master/ws/test-framework/pom.xml> to org.apache.brooklyn/brooklyn-test-framework/0.11.0-SNAPSHOT/brooklyn-test-framework-0.11.0-SNAPSHOT.pom
[JENKINS] Archiving <https://builds.apache.org/job/brooklyn-server-master/ws/test-framework/target/brooklyn-test-framework-0.11.0-SNAPSHOT.jar> to org.apache.brooklyn/brooklyn-test-framework/0.11.0-SNAPSHOT/brooklyn-test-framework-0.11.0-SNAPSHOT.jar
[JENKINS] Archiving <https://builds.apache.org/job/brooklyn-server-master/ws/test-framework/target/brooklyn-test-framework-0.11.0-SNAPSHOT-tests.jar> to org.apache.brooklyn/brooklyn-test-framework/0.11.0-SNAPSHOT/brooklyn-test-framework-0.11.0-SNAPSHOT-tests.jar
[JENKINS] Archiving <https://builds.apache.org/job/brooklyn-server-master/ws/test-framework/target/brooklyn-test-framework-0.11.0-SNAPSHOT-sources.jar> to org.apache.brooklyn/brooklyn-test-framework/0.11.0-SNAPSHOT/brooklyn-test-framework-0.11.0-SNAPSHOT-sources.jar
[JENKINS] Archiving <https://builds.apache.org/job/brooklyn-server-master/ws/test-framework/target/brooklyn-test-framework-0.11.0-SNAPSHOT-test-sources.jar> to org.apache.brooklyn/brooklyn-test-framework/0.11.0-SNAPSHOT/brooklyn-test-framework-0.11.0-SNAPSHOT-test-sources.jar
[JENKINS] Archiving <https://builds.apache.org/job/brooklyn-server-master/ws/core/pom.xml> to org.apache.brooklyn/brooklyn-core/0.11.0-SNAPSHOT/brooklyn-core-0.11.0-SNAPSHOT.pom
[JENKINS] Archiving <https://builds.apache.org/job/brooklyn-server-master/ws/core/target/brooklyn-core-0.11.0-SNAPSHOT.jar> to org.apache.brooklyn/brooklyn-core/0.11.0-SNAPSHOT/brooklyn-core-0.11.0-SNAPSHOT.jar
[JENKINS] Archiving <https://builds.apache.org/job/brooklyn-server-master/ws/core/target/brooklyn-core-0.11.0-SNAPSHOT-tests.jar> to org.apache.brooklyn/brooklyn-core/0.11.0-SNAPSHOT/brooklyn-core-0.11.0-SNAPSHOT-tests.jar
[JENKINS] Archiving <https://builds.apache.org/job/brooklyn-server-master/ws/core/target/brooklyn-core-0.11.0-SNAPSHOT-sources.jar> to org.apache.brooklyn/brooklyn-core/0.11.0-SNAPSHOT/brooklyn-core-0.11.0-SNAPSHOT-sources.jar
[JENKINS] Archiving <https://builds.apache.org/job/brooklyn-server-master/ws/core/target/brooklyn-core-0.11.0-SNAPSHOT-test-sources.jar> to org.apache.brooklyn/brooklyn-core/0.11.0-SNAPSHOT/brooklyn-core-0.11.0-SNAPSHOT-test-sources.jar
No artifacts from brooklyn-server-master » Brooklyn Core #379 to compare, so performing full copy of artifacts
Build timed out (after 70 minutes). Marking the build as aborted.
ERROR: Failed to parse POMs
java.io.IOException: java.io.IOException: Failed to extract <https://builds.apache.org/job/brooklyn-server-master/ws/core/transfer> of 5 files
	at hudson.FilePath.readFromTar(FilePath.java:2328)
	at hudson.FilePath.copyRecursiveTo(FilePath.java:2237)
	at jenkins.model.StandardArtifactManager.archive(StandardArtifactManager.java:61)
	at com.cloudbees.jenkins.plugins.jsync.archiver.JSyncArtifactManager.remoteSync(JSyncArtifactManager.java:128)
	at com.cloudbees.jenkins.plugins.jsync.archiver.JSyncArtifactManager.archive(JSyncArtifactManager.java:76)
	at hudson.maven.MavenBuild$ProxyImpl.performArchiving(MavenBuild.java:483)
	at hudson.maven.MavenModuleSetBuild$MavenModuleSetBuildExecution.doRun(MavenModuleSetBuild.java:855)
	at hudson.model.AbstractBuild$AbstractBuildExecution.run(AbstractBuild.java:534)
	at hudson.model.Run.execute(Run.java:1741)
	at hudson.maven.MavenModuleSetBuild.run(MavenModuleSetBuild.java:531)
	at hudson.model.ResourceController.execute(ResourceController.java:98)
	at hudson.model.Executor.run(Executor.java:410)
Caused by: java.io.IOException: java.lang.InterruptedException
	at hudson.remoting.FastPipedInputStream.read(FastPipedInputStream.java:177)
	at hudson.util.HeadBufferingStream.read(HeadBufferingStream.java:61)
	at com.jcraft.jzlib.InflaterInputStream.fill(InflaterInputStream.java:175)
	at com.jcraft.jzlib.InflaterInputStream.read(InflaterInputStream.java:106)
	at org.apache.commons.compress.archivers.tar.TarArchiveInputStream.read(TarArchiveInputStream.java:614)
	at java.io.InputStream.read(InputStream.java:101)
	at org.apache.commons.io.IOUtils.copyLarge(IOUtils.java:1792)
	at org.apache.commons.io.IOUtils.copyLarge(IOUtils.java:1769)
	at org.apache.commons.io.IOUtils.copy(IOUtils.java:1744)
	at hudson.util.IOUtils.copy(IOUtils.java:40)
	at hudson.FilePath.readFromTar(FilePath.java:2318)
	... 11 more
Caused by: java.lang.InterruptedException
	at java.lang.Object.wait(Native Method)
	at hudson.remoting.FastPipedInputStream.read(FastPipedInputStream.java:175)
	... 21 more

	at hudson.FilePath.copyRecursiveTo(FilePath.java:2244)
	at jenkins.model.StandardArtifactManager.archive(StandardArtifactManager.java:61)
	at com.cloudbees.jenkins.plugins.jsync.archiver.JSyncArtifactManager.remoteSync(JSyncArtifactManager.java:128)
	at com.cloudbees.jenkins.plugins.jsync.archiver.JSyncArtifactManager.archive(JSyncArtifactManager.java:76)
	at hudson.maven.MavenBuild$ProxyImpl.performArchiving(MavenBuild.java:483)
	at hudson.maven.MavenModuleSetBuild$MavenModuleSetBuildExecution.doRun(MavenModuleSetBuild.java:855)
	at hudson.model.AbstractBuild$AbstractBuildExecution.run(AbstractBuild.java:534)
	at hudson.model.Run.execute(Run.java:1741)
	at hudson.maven.MavenModuleSetBuild.run(MavenModuleSetBuild.java:531)
	at hudson.model.ResourceController.execute(ResourceController.java:98)
	at hudson.model.Executor.run(Executor.java:410)
Caused by: java.util.concurrent.ExecutionException: java.io.IOException: This archives contains unclosed entries.
	at hudson.remoting.Channel$2.adapt(Channel.java:813)
	at hudson.remoting.Channel$2.adapt(Channel.java:808)
	at hudson.remoting.FutureAdapter.get(FutureAdapter.java:59)
	at hudson.FilePath.copyRecursiveTo(FilePath.java:2240)
	... 10 more
Caused by: java.io.IOException: This archives contains unclosed entries.
	at org.apache.commons.compress.archivers.tar.TarArchiveOutputStream.finish(TarArchiveOutputStream.java:225)
	at org.apache.commons.compress.archivers.tar.TarArchiveOutputStream.close(TarArchiveOutputStream.java:241)
	at hudson.util.io.TarArchiver.close(TarArchiver.java:111)
	at hudson.FilePath.writeToTar(FilePath.java:2291)
	at hudson.FilePath.access$2100(FilePath.java:195)
	at hudson.FilePath$45.invoke(FilePath.java:2230)
	at hudson.FilePath$45.invoke(FilePath.java:2226)
	at hudson.FilePath$FileCallableWrapper.call(FilePath.java:2772)
	at hudson.remoting.UserRequest.perform(UserRequest.java:153)
	at hudson.remoting.UserRequest.perform(UserRequest.java:50)
	at hudson.remoting.Request$2.run(Request.java:332)
	at hudson.remoting.InterceptingExecutorService$1.call(InterceptingExecutorService.java:68)
	at java.util.concurrent.FutureTask.run(FutureTask.java:262)
	at java.util.concurrent.ThreadPoolExecutor.runWorker(ThreadPoolExecutor.java:1145)
	at java.util.concurrent.ThreadPoolExecutor$Worker.run(ThreadPoolExecutor.java:615)
	at java.lang.Thread.run(Thread.java:745)
	at ......remote call to H11(Native Method)
	at hudson.remoting.Channel.attachCallSiteStackTrace(Channel.java:1416)
	at hudson.remoting.UserResponse.retrieve(UserRequest.java:253)
	at hudson.remoting.Channel$2.adapt(Channel.java:811)
	... 13 more
channel stopped