You are viewing a plain text version of this content. The canonical link for it is here.
Posted to builds@solr.apache.org by Apache Jenkins Server <je...@builds.apache.org> on 2025/02/12 22:08:17 UTC
[JENKINS] Solr » Solr-Test-main-s390x - Build # 876 - Still Failing!
Build: https://ci-builds.apache.org/job/Solr/job/Solr-Test-main-s390x/876/
No tests ran.
Build Log:
[...truncated 58 lines...]
BUILD FAILED in 50s
4 actionable tasks: 4 executed
Publishing build scan...
https://develocity.apache.org/s/flrb6u2fqwcnq
Build step 'Invoke Gradle script' changed build result to FAILURE
Build step 'Invoke Gradle script' marked build as failure
Archiving artifacts
Recording test results
ERROR: Step ‘Publish JUnit test result report’ failed: No test report files were found. Configuration error?
Email was triggered for: Failure - Any
Sending email for trigger: Failure - Any
[JENKINS] Solr » Solr-Test-main-s390x - Build # 879 - Still Failing!
Posted by Apache Jenkins Server <je...@builds.apache.org>.
Build: https://ci-builds.apache.org/job/Solr/job/Solr-Test-main-s390x/879/
No tests ran.
Build Log:
[...truncated 58 lines...]
BUILD FAILED in 1m 29s
4 actionable tasks: 4 executed
Publishing build scan...
https://develocity.apache.org/s/kjakvbvpqbf56
Build step 'Invoke Gradle script' changed build result to FAILURE
Build step 'Invoke Gradle script' marked build as failure
Archiving artifacts
Recording test results
ERROR: Step ‘Publish JUnit test result report’ failed: No test report files were found. Configuration error?
Email was triggered for: Failure - Any
Sending email for trigger: Failure - Any
[JENKINS] Solr » Solr-Test-main-s390x - Build # 878 - Still Failing!
Posted by Apache Jenkins Server <je...@builds.apache.org>.
Build: https://ci-builds.apache.org/job/Solr/job/Solr-Test-main-s390x/878/
No tests ran.
Build Log:
[...truncated 58 lines...]
BUILD FAILED in 4m 21s
4 actionable tasks: 4 executed
Publishing build scan...
https://develocity.apache.org/s/7bw5mhxc3gi26
Build step 'Invoke Gradle script' changed build result to FAILURE
Build step 'Invoke Gradle script' marked build as failure
Archiving artifacts
Recording test results
ERROR: Step ‘Publish JUnit test result report’ failed: No test report files were found. Configuration error?
Email was triggered for: Failure - Any
Sending email for trigger: Failure - Any
[JENKINS] Solr » Solr-Test-main-s390x - Build # 877 - Still Failing!
Posted by Apache Jenkins Server <je...@builds.apache.org>.
Build: https://ci-builds.apache.org/job/Solr/job/Solr-Test-main-s390x/877/
No tests ran.
Build Log:
[...truncated 58 lines...]
BUILD FAILED in 1m 12s
4 actionable tasks: 4 executed
Publishing build scan...
https://develocity.apache.org/s/jeub6sjrrfm7w
Build step 'Invoke Gradle script' changed build result to FAILURE
Build step 'Invoke Gradle script' marked build as failure
Archiving artifacts
Recording test results
ERROR: Step ‘Publish JUnit test result report’ failed: No test report files were found. Configuration error?
Email was triggered for: Failure - Any
Sending email for trigger: Failure - Any