You are viewing a plain text version of this content. The canonical link for it is here.
Posted to commits@struts.apache.org by Atlassian Open Source Bamboo <ba...@apache.org> on 2009/10/21 18:50:51 UTC
[OSS Bamboo] Struts 2 SVN - Main Build (Java 6) build 993 has
FAILED (3 tests failed, 1 failures were new). Change made by Musachy
Barroso
-----------------------------------------------------------
STRUTS-MAINJ6-993 failed.
-----------------------------------------------------------
Code has been updated by Musachy Barroso.
3/1128 tests failed.
http://opensource.bamboo.atlassian.com/browse/STRUTS-MAINJ6-993/
--------------
Code Changes
--------------
Musachy Barroso (828096):
>add test for the key in the servlet context
--------------
Tests
--------------
Failed Tests (3)
- EmbeddedJSPResultTest: Key in context (New)
- EmbeddedJSPResultTest: Embedded (Existing)
- EmbeddedJSPResultTest: Embedded absolute path (Existing)
--------------
Error Summary
--------------
[INFO] ------------------------------------------------------------------------
[ERROR] BUILD FAILURE
[INFO] ------------------------------------------------------------------------
[INFO] There are test failures.
[INFO] ------------------------------------------------------------------------
[INFO] For more information, run Maven with the -e switch
--
This message is automatically generated by Atlassian Bamboo