You are viewing a plain text version of this content. The canonical link for it is here.
Posted to dev@activemq.apache.org by Apache Jenkins Server <je...@builds.apache.org> on 2012/09/19 20:21:15 UTC
Jenkins build is still unstable: ActiveMQ-Java7 » ActiveMQ :: Core #8
See <https://builds.apache.org/job/ActiveMQ-Java7/org.apache.activemq$activemq-core/changes>
Build failed in Jenkins: ActiveMQ-Java7 » ActiveMQ :: Core #23
Posted by Apache Jenkins Server <je...@builds.apache.org>.
See <https://builds.apache.org/job/ActiveMQ-Java7/org.apache.activemq$activemq-core/23/changes>
Changes:
[gtully] ensure slow-tests profile overrides excludes and runs all tests - duplicate the config in that profile, so order is the same etc; don't see another way atm
------------------------------------------
[...truncated 230 lines...]
Tests run: 1, Failures: 0, Errors: 0, Skipped: 0, Time elapsed: 0.799 sec
Running org.apache.activemq.JmsTopicSendReceiveTest
Tests run: 1, Failures: 0, Errors: 0, Skipped: 0, Time elapsed: 0.807 sec
Running org.apache.activemq.JmsTopicSendReceiveWithTwoConnectionsTest
Tests run: 1, Failures: 0, Errors: 0, Skipped: 0, Time elapsed: 0.79 sec
Running org.apache.activemq.JmsTopicSendReceiveWithTwoConnectionsWithJMXTest
Tests run: 1, Failures: 0, Errors: 0, Skipped: 0, Time elapsed: 0.781 sec
Running org.apache.activemq.JmsTopicSendSameMessageTest
Tests run: 1, Failures: 0, Errors: 0, Skipped: 0, Time elapsed: 0.781 sec
Running org.apache.activemq.JmsTopicTransactionTest
Tests run: 14, Failures: 0, Errors: 0, Skipped: 0, Time elapsed: 20.369 sec
Running org.apache.activemq.JmsTopicWildcardSendReceiveTest
Tests run: 4, Failures: 0, Errors: 0, Skipped: 0, Time elapsed: 2.081 sec
Running org.apache.activemq.LargeStreamletTest
Tests run: 1, Failures: 0, Errors: 0, Skipped: 0, Time elapsed: 2.718 sec
Running org.apache.activemq.MessageEvictionTest
Tests run: 3, Failures: 0, Errors: 0, Skipped: 0, Time elapsed: 90.575 sec
Running org.apache.activemq.MessageListenerRedeliveryTest
Tests run: 4, Failures: 0, Errors: 0, Skipped: 0, Time elapsed: 17.102 sec
Running org.apache.activemq.MessageTransformationTest
Tests run: 2, Failures: 0, Errors: 0, Skipped: 0, Time elapsed: 0.175 sec
Running org.apache.activemq.OnePrefetchAsyncConsumerTest
Tests run: 1, Failures: 0, Errors: 0, Skipped: 0, Time elapsed: 6.651 sec
Running org.apache.activemq.OptimizedAckTest
Tests run: 3, Failures: 0, Errors: 0, Skipped: 0, Time elapsed: 15.986 sec
Running org.apache.activemq.PerDestinationStoreLimitTest
Tests run: 2, Failures: 0, Errors: 0, Skipped: 0, Time elapsed: 48.834 sec
Running org.apache.activemq.ProducerFlowControlSendFailTest
Tests run: 7, Failures: 0, Errors: 0, Skipped: 0, Time elapsed: 20.345 sec
Running org.apache.activemq.ProducerFlowControlTest
Tests run: 6, Failures: 0, Errors: 0, Skipped: 0, Time elapsed: 25.682 sec
Running org.apache.activemq.QueueConsumerPriorityTest
Tests run: 1, Failures: 0, Errors: 0, Skipped: 0, Time elapsed: 5.86 sec
Running org.apache.activemq.ReconnectWithSameClientIDTest
Tests run: 2, Failures: 0, Errors: 0, Skipped: 0, Time elapsed: 4.914 sec
Running org.apache.activemq.RedeliveryPolicyTest
Tests run: 10, Failures: 0, Errors: 0, Skipped: 0, Time elapsed: 14.99 sec
Running org.apache.activemq.RemoveDestinationTest
Tests run: 2, Failures: 0, Errors: 0, Skipped: 0, Time elapsed: 19.295 sec
Running org.apache.activemq.TimeStampTest
Tests run: 1, Failures: 0, Errors: 0, Skipped: 0, Time elapsed: 4.597 sec
Running org.apache.activemq.TransactionContextTest
Tests run: 2, Failures: 0, Errors: 0, Skipped: 0, Time elapsed: 2.267 sec
Running org.apache.activemq.ZeroPrefetchConsumerTest
Tests run: 11, Failures: 0, Errors: 0, Skipped: 0, Time elapsed: 22.855 sec
Running org.apache.activemq.advisory.ConsumerListenerTest
Tests run: 2, Failures: 0, Errors: 0, Skipped: 0, Time elapsed: 0.845 sec
Running org.apache.activemq.advisory.DestinationListenerTest
Tests run: 3, Failures: 0, Errors: 0, Skipped: 0, Time elapsed: 8.04 sec
Running org.apache.activemq.advisory.MasterSlaveTempQueueMemoryTest
Tests run: 6, Failures: 0, Errors: 0, Skipped: 0, Time elapsed: 44.69 sec
Running org.apache.activemq.advisory.ProducerListenerTest
Tests run: 2, Failures: 0, Errors: 0, Skipped: 0, Time elapsed: 0.822 sec
Running org.apache.activemq.advisory.TempDestDeleteTest
Tests run: 2, Failures: 0, Errors: 0, Skipped: 0, Time elapsed: 0.859 sec
Running org.apache.activemq.advisory.TempDestLoadTest
Tests run: 2, Failures: 0, Errors: 0, Skipped: 0, Time elapsed: 20.004 sec
Running org.apache.activemq.advisory.TempQueueMemoryTest
Tests run: 2, Failures: 0, Errors: 0, Skipped: 0, Time elapsed: 21.86 sec
Running org.apache.activemq.blob.BlobTransferPolicyUriTest
Tests run: 1, Failures: 0, Errors: 0, Skipped: 0, Time elapsed: 0.18 sec
Running org.apache.activemq.blob.FTPBlobDownloadStrategyTest
Tests run: 3, Failures: 0, Errors: 0, Skipped: 0, Time elapsed: 1.88 sec
Running org.apache.activemq.blob.FTPBlobTest
Tests run: 1, Failures: 0, Errors: 0, Skipped: 0, Time elapsed: 2.101 sec
Running org.apache.activemq.blob.FTPBlobUploadStrategyTest
Tests run: 2, Failures: 0, Errors: 0, Skipped: 0, Time elapsed: 1.064 sec
Running org.apache.activemq.blob.FilesystemBlobTest
Tests run: 1, Failures: 0, Errors: 0, Skipped: 0, Time elapsed: 1.757 sec
Running org.apache.activemq.broker.BrokerRedeliveryTest
Tests run: 1, Failures: 0, Errors: 0, Skipped: 0, Time elapsed: 8.425 sec
Running org.apache.activemq.broker.BrokerServiceTest
Tests run: 5, Failures: 0, Errors: 0, Skipped: 0, Time elapsed: 4.703 sec
Running org.apache.activemq.broker.BrokerTest
Tests run: 129, Failures: 0, Errors: 0, Skipped: 0, Time elapsed: 27.059 sec
Running org.apache.activemq.broker.ConcurrentConnectSimulationTest
Tests run: 1, Failures: 0, Errors: 0, Skipped: 0, Time elapsed: 0.676 sec
Running org.apache.activemq.broker.CreateDestinationsOnStartupViaXBeanTest
Tests run: 1, Failures: 0, Errors: 0, Skipped: 0, Time elapsed: 2.233 sec
Running org.apache.activemq.broker.DedicatedTaskRunnerBrokerTest
Tests run: 129, Failures: 0, Errors: 0, Skipped: 0, Time elapsed: 22.224 sec
Running org.apache.activemq.broker.DoubleSubscriptionTest
Tests run: 1, Failures: 0, Errors: 0, Skipped: 0, Time elapsed: 2.575 sec
Running org.apache.activemq.broker.DurablePersistentFalseRestartTest
Tests run: 1, Failures: 0, Errors: 0, Skipped: 0, Time elapsed: 6.775 sec
Running org.apache.activemq.broker.JdbcXARecoveryBrokerTest
Tests run: 16, Failures: 0, Errors: 0, Skipped: 0, Time elapsed: 64.616 sec
Running org.apache.activemq.broker.MessageExpirationTest
Tests run: 13, Failures: 0, Errors: 0, Skipped: 0, Time elapsed: 23.298 sec
Running org.apache.activemq.broker.OutOfOrderXMLTest
Tests run: 1, Failures: 0, Errors: 0, Skipped: 0, Time elapsed: 1.41 sec
Running org.apache.activemq.broker.QueueMbeanRestartTest
Tests run: 2, Failures: 0, Errors: 0, Skipped: 0, Time elapsed: 4.818 sec
Running org.apache.activemq.broker.QueueSubscriptionTest
Tests run: 8, Failures: 0, Errors: 0, Skipped: 0, Time elapsed: 4.907 sec
Running org.apache.activemq.broker.ReconnectWithJMXEnabledTest
Tests run: 1, Failures: 0, Errors: 0, Skipped: 0, Time elapsed: 4.657 sec
Running org.apache.activemq.broker.RecoveryBrokerTest
Tests run: 9, Failures: 0, Errors: 0, Skipped: 0, Time elapsed: 28.247 sec
Running org.apache.activemq.broker.RedeliveryRestartTest
Tests run: 2, Failures: 0, Errors: 0, Skipped: 0, Time elapsed: 11.713 sec
Running org.apache.activemq.broker.SpringTest
Tests run: 1, Failures: 0, Errors: 0, Skipped: 0, Time elapsed: 2.716 sec
Running org.apache.activemq.broker.TopicSubscriptionTest
Tests run: 8, Failures: 0, Errors: 0, Skipped: 0, Time elapsed: 7.752 sec
Running org.apache.activemq.broker.XARecoveryBrokerTest
Tests run: 16, Failures: 0, Errors: 0, Skipped: 0, Time elapsed: 69.041 sec
Running org.apache.activemq.broker.advisory.AdvisoryBrokerTest
Tests run: 6, Failures: 0, Errors: 0, Skipped: 0, Time elapsed: 0.96 sec
Running org.apache.activemq.broker.advisory.AdvisoryDuplexNetworkBridgeTest
Tests run: 2, Failures: 0, Errors: 0, Skipped: 0, Time elapsed: 11.283 sec
Running org.apache.activemq.broker.advisory.AdvisoryJmxTest
Tests run: 1, Failures: 0, Errors: 0, Skipped: 0, Time elapsed: 0.801 sec
Running org.apache.activemq.broker.advisory.AdvisoryNetworkBridgeTest
Tests run: 2, Failures: 0, Errors: 0, Skipped: 0, Time elapsed: 10.908 sec
Running org.apache.activemq.broker.ft.DbRestartJDBCQueueMasterSlaveLeaseQuiesceTest
Tests run: 3, Failures: 0, Errors: 0, Skipped: 0, Time elapsed: 46.264 sec
Running org.apache.activemq.broker.ft.DbRestartJDBCQueueMasterSlaveLeaseTest
Tests run: 2, Failures: 0, Errors: 0, Skipped: 0, Time elapsed: 24.631 sec
Running org.apache.activemq.broker.ft.DbRestartJDBCQueueMasterSlaveTest
Running org.apache.activemq.broker.ft.JDBCQueueMasterSlaveTest
Tests run: 2, Failures: 0, Errors: 0, Skipped: 0, Time elapsed: 15.276 sec
Running org.apache.activemq.broker.ft.MasterSlaveProducerFlowControlTest
Tests run: 6, Failures: 0, Errors: 0, Skipped: 0, Time elapsed: 25.802 sec
Running org.apache.activemq.broker.ft.MasterSlaveSlaveDieTest
Tests run: 1, Failures: 0, Errors: 0, Skipped: 0, Time elapsed: 2.475 sec
Running org.apache.activemq.broker.ft.MasterSlaveSlaveShutdownTest
Tests run: 1, Failures: 0, Errors: 0, Skipped: 0, Time elapsed: 32.342 sec
Running org.apache.activemq.broker.ft.QueueMasterSlaveSingleUrlTest
Tests run: 2, Failures: 0, Errors: 0, Skipped: 0, Time elapsed: 14.809 sec
Running org.apache.activemq.broker.ft.QueueMasterSlaveTest
Tests run: 2, Failures: 0, Errors: 0, Skipped: 0, Time elapsed: 15.579 sec
Running org.apache.activemq.broker.ft.QueueMasterSlaveTestUsingSharedFileTest
Tests run: 2, Failures: 0, Errors: 0, Skipped: 0, Time elapsed: 27.821 sec
Running org.apache.activemq.broker.ft.QueueMasterSlaveUsingMasterConnectorElementCompositeQueueTest
Tests run: 2, Failures: 0, Errors: 0, Skipped: 0, Time elapsed: 16.084 sec
Running org.apache.activemq.broker.ft.QueueMasterSlaveUsingMasterConnectorElementTest
Tests run: 2, Failures: 0, Errors: 0, Skipped: 0, Time elapsed: 16.114 sec
Running org.apache.activemq.broker.ft.TopicMasterSlaveTest
Tests run: 2, Failures: 0, Errors: 0, Skipped: 0, Time elapsed: 16.103 sec
Running org.apache.activemq.broker.ft.TransactedTopicMasterSlaveTest
Tests run: 15, Failures: 0, Errors: 0, Skipped: 0, Time elapsed: 76.12 sec
Running org.apache.activemq.broker.jmx.BrokerViewSlowStoreStartupTest
Tests run: 1, Failures: 0, Errors: 0, Skipped: 0, Time elapsed: 1.073 sec
Running org.apache.activemq.broker.jmx.MBeanOperationTimeoutTest
Tests run: 1, Failures: 0, Errors: 0, Skipped: 0, Time elapsed: 18.111 sec
Running org.apache.activemq.broker.jmx.MBeanTest
Tests run: 19, Failures: 0, Errors: 0, Skipped: 0, Time elapsed: 55.079 sec
Running org.apache.activemq.broker.jmx.PurgeTest
Tests run: 5, Failures: 0, Errors: 0, Skipped: 0, Time elapsed: 25.077 sec
Running org.apache.activemq.broker.jmx.TransportConnectorMBeanTest
Tests run: 2, Failures: 0, Errors: 0, Skipped: 0, Time elapsed: 4.695 sec
Running org.apache.activemq.broker.mKahaDBXARecoveryBrokerTest
Tests run: 16, Failures: 0, Errors: 0, Skipped: 0, Time elapsed: 70.443 sec
Running org.apache.activemq.broker.message.security.MessageAuthenticationTest
Tests run: 1, Failures: 0, Errors: 0, Skipped: 0, Time elapsed: 0.781 sec
Running org.apache.activemq.broker.policy.AbortSlowConsumerTest
Tests run: 19, Failures: 0, Errors: 0, Skipped: 0, Time elapsed: 113.923 sec
Running org.apache.activemq.broker.policy.DeadLetterTest
Tests run: 4, Failures: 0, Errors: 0, Skipped: 0, Time elapsed: 2.529 sec
Running org.apache.activemq.broker.policy.DestinationCursorConfigTest
Tests run: 2, Failures: 0, Errors: 0, Skipped: 0, Time elapsed: 1.653 sec
Running org.apache.activemq.broker.policy.IndividualDeadLetterTest
Tests run: 5, Failures: 0, Errors: 0, Skipped: 0, Time elapsed: 4.685 sec
Running org.apache.activemq.broker.policy.IndividualDeadLetterViaXmlTest
Tests run: 4, Failures: 0, Errors: 0, Skipped: 0, Time elapsed: 3.889 sec
Running org.apache.activemq.broker.policy.MessageListenerDeadLetterTest
Tests run: 4, Failures: 0, Errors: 0, Skipped: 0, Time elapsed: 3.487 sec
Running org.apache.activemq.broker.policy.NoConsumerDeadLetterTest
Tests run: 5, Failures: 0, Errors: 0, Skipped: 0, Time elapsed: 1.942 sec
Running org.apache.activemq.broker.policy.NoRetryDeadLetterTest
Tests run: 4, Failures: 0, Errors: 0, Skipped: 0, Time elapsed: 1.198 sec
Running org.apache.activemq.broker.policy.PerDurableConsumerDeadLetterTest
Tests run: 4, Failures: 0, Errors: 0, Skipped: 0, Time elapsed: 2.556 sec
Running org.apache.activemq.broker.policy.PriorityNetworkDispatchPolicyTest
Tests run: 1, Failures: 0, Errors: 0, Skipped: 0, Time elapsed: 0.211 sec
Running org.apache.activemq.broker.policy.RoundRobinDispatchPolicyTest
Tests run: 9, Failures: 0, Errors: 0, Skipped: 0, Time elapsed: 4.488 sec
Running org.apache.activemq.broker.policy.SimpleDispatchPolicyTest
Tests run: 8, Failures: 0, Errors: 0, Skipped: 0, Time elapsed: 4.328 sec
Running org.apache.activemq.broker.policy.StrictOrderDispatchPolicyTest
Tests run: 8, Failures: 0, Errors: 0, Skipped: 0, Time elapsed: 5.072 sec
Running org.apache.activemq.broker.region.DestinationGCTest
Tests run: 2, Failures: 0, Errors: 0, Skipped: 0, Time elapsed: 14.749 sec
Running org.apache.activemq.broker.region.DestinationRemoveRestartTest
Tests run: 2, Failures: 0, Errors: 0, Skipped: 0, Time elapsed: 3.475 sec
Running org.apache.activemq.broker.region.QueueDuplicatesFromStoreTest
Tests run: 2, Failures: 0, Errors: 0, Skipped: 0, Time elapsed: 15.183 sec
Running org.apache.activemq.broker.region.QueueOptimizedDispatchExceptionTest
Tests run: 1, Failures: 0, Errors: 0, Skipped: 0, Time elapsed: 0.433 sec
Running org.apache.activemq.broker.region.QueuePurgeTest
Tests run: 3, Failures: 0, Errors: 0, Skipped: 0, Time elapsed: 340.756 sec
Running org.apache.activemq.broker.region.UniquePropertyMessageEvictionStrategyTest
Tests run: 1, Failures: 0, Errors: 0, Skipped: 0, Time elapsed: 11.816 sec
Running org.apache.activemq.broker.region.cursors.CursorDurableTest
Tests run: 2, Failures: 0, Errors: 0, Skipped: 0, Time elapsed: 4.381 sec
Running org.apache.activemq.broker.region.cursors.CursorQueueStoreTest
Tests run: 5, Failures: 0, Errors: 0, Skipped: 0, Time elapsed: 103.111 sec
Running org.apache.activemq.broker.region.cursors.FilePendingMessageCursorTest
Tests run: 2, Failures: 0, Errors: 0, Skipped: 0, Time elapsed: 3.102 sec
Running org.apache.activemq.broker.region.cursors.NegativeQueueTest
Tests run: 4, Failures: 0, Errors: 0, Skipped: 0, Time elapsed: 109.751 sec
Running org.apache.activemq.broker.region.cursors.OrderPendingListTest
Tests run: 9, Failures: 0, Errors: 0, Skipped: 0, Time elapsed: 0.299 sec
Running org.apache.activemq.broker.region.cursors.PrioritizedPendingListTest
Tests run: 7, Failures: 0, Errors: 0, Skipped: 0, Time elapsed: 0.306 sec
Running org.apache.activemq.broker.region.cursors.StoreBasedCursorTest
Tests run: 5, Failures: 0, Errors: 0, Skipped: 0, Time elapsed: 14.636 sec
Running org.apache.activemq.broker.region.cursors.StoreQueueCursorJDBCNoDuplicateTest
Tests run: 1, Failures: 0, Errors: 0, Skipped: 0, Time elapsed: 3.359 sec
Running org.apache.activemq.broker.region.cursors.StoreQueueCursorJournalNoDuplicateTest
Tests run: 1, Failures: 0, Errors: 0, Skipped: 0, Time elapsed: 0.578 sec
Running org.apache.activemq.broker.region.cursors.StoreQueueCursorKahaDBNoDuplicateTest
Tests run: 1, Failures: 0, Errors: 0, Skipped: 0, Time elapsed: 1.221 sec
Running org.apache.activemq.broker.region.cursors.StoreQueueCursorMemoryNoDuplicateTest
Tests run: 1, Failures: 0, Errors: 0, Skipped: 0, Time elapsed: 0.392 sec
Running org.apache.activemq.broker.region.cursors.StoreQueueCursorNoDuplicateTest
Tests run: 1, Failures: 0, Errors: 0, Skipped: 0, Time elapsed: 1.223 sec
Running org.apache.activemq.broker.region.group.MessageGroupHashBucketTest
Tests run: 2, Failures: 0, Errors: 0, Skipped: 0, Time elapsed: 0.032 sec
Running org.apache.activemq.broker.region.group.MessageGroupMapTest
Tests run: 2, Failures: 0, Errors: 0, Skipped: 0, Time elapsed: 0.032 sec
Running org.apache.activemq.broker.region.group.MessageGroupTest
Tests run: 3, Failures: 0, Errors: 0, Skipped: 0, Time elapsed: 1.221 sec
Running org.apache.activemq.broker.scheduler.CronParserTest
Tests run: 13, Failures: 0, Errors: 0, Skipped: 0, Time elapsed: 0.202 sec
Running org.apache.activemq.broker.scheduler.JmsCronSchedulerTest
Tests run: 2, Failures: 0, Errors: 0, Skipped: 0, Time elapsed: 199.732 sec
Running org.apache.activemq.broker.scheduler.JmsSchedulerTest
Tests run: 5, Failures: 0, Errors: 0, Skipped: 0, Time elapsed: 88.824 sec
Running org.apache.activemq.broker.scheduler.JobSchedulerManagementTest
Tests run: 7, Failures: 0, Errors: 0, Skipped: 0, Time elapsed: 76.591 sec
Running org.apache.activemq.broker.scheduler.JobSchedulerStoreTest
Tests run: 1, Failures: 0, Errors: 0, Skipped: 0, Time elapsed: 6.797 sec
Running org.apache.activemq.broker.scheduler.JobSchedulerTest
Tests run: 9, Failures: 0, Errors: 0, Skipped: 0, Time elapsed: 9.333 sec
Running org.apache.activemq.broker.store.DefaultStoreRecoveryBrokerTest
Results :
Tests in error:
testCreateTcpConnectionUsingAllocatedPort(org.apache.activemq.ActiveMQConnectionFactoryTest): org.apache.activemq:BrokerName=localhost,Type=Broker
Tests run: 1161, Failures: 0, Errors: 1, Skipped: 0
mojoFailed org.apache.maven.plugins:maven-surefire-plugin:2.12.3(default-test)
[JENKINS] Recording test results
Tests run: 9, Failures: 0, Errors: 0, Skipped: 0, Time elapsed: 31.155 sec
projectFailed org.apache.activemq:activemq-core:5.8-SNAPSHOT
Build failed in Jenkins: ActiveMQ-Java7 » ActiveMQ :: Core #22
Posted by Apache Jenkins Server <je...@builds.apache.org>.
See <https://builds.apache.org/job/ActiveMQ-Java7/org.apache.activemq$activemq-core/22/changes>
Changes:
[gtully] remove dud import
[gtully] https://issues.apache.org/jira/browse/AMQ-4091 - apply destination policy to temp topics, allows a memory limit to be specified to partition temp dest usage and enable producer flow control
[dejanb] [maven-release-plugin] prepare for next development iteration
[dejanb] [maven-release-plugin] prepare release activemq-5.7.0
[dejanb] [maven-release-plugin] rollback the release of activemq-parent-5.7.0
[dejanb] [maven-release-plugin] prepare release activemq-parent-5.7.0
[gtully] add verification of blocking via full advisory - odd that advisory arrives late, hmm
[dejanb] [maven-release-plugin] rollback the release of activemq-5.7.0
[dejanb] [maven-release-plugin] prepare for next development iteration
[dejanb] [maven-release-plugin] prepare release activemq-5.7.0
[dejanb] rolling back version because of failed release:perform
[dejanb] [maven-release-plugin] prepare release activemq-5.7.0
[dejanb] [maven-release-plugin] prepare for next development iteration
[dejanb] [maven-release-plugin] prepare release activemq-5.7.0
------------------------------------------
[...truncated 270 lines...]
Tests run: 3, Failures: 0, Errors: 0, Skipped: 0, Time elapsed: 8.825 sec
Running org.apache.activemq.JmsTopicSendReceiveSubscriberTest
Tests run: 1, Failures: 0, Errors: 0, Skipped: 0, Time elapsed: 0.7 sec
Running org.apache.activemq.JmsTopicSendReceiveTest
Tests run: 1, Failures: 0, Errors: 0, Skipped: 0, Time elapsed: 0.708 sec
Running org.apache.activemq.JmsTopicSendReceiveWithTwoConnectionsTest
Tests run: 1, Failures: 0, Errors: 0, Skipped: 0, Time elapsed: 0.73 sec
Running org.apache.activemq.JmsTopicSendReceiveWithTwoConnectionsWithJMXTest
Tests run: 1, Failures: 0, Errors: 0, Skipped: 0, Time elapsed: 0.731 sec
Running org.apache.activemq.JmsTopicSendSameMessageTest
Tests run: 1, Failures: 0, Errors: 0, Skipped: 0, Time elapsed: 0.744 sec
Running org.apache.activemq.JmsTopicTransactionTest
Tests run: 14, Failures: 0, Errors: 0, Skipped: 0, Time elapsed: 20.136 sec
Running org.apache.activemq.JmsTopicWildcardSendReceiveTest
Tests run: 4, Failures: 0, Errors: 0, Skipped: 0, Time elapsed: 1.942 sec
Running org.apache.activemq.LargeStreamletTest
Tests run: 1, Failures: 0, Errors: 0, Skipped: 0, Time elapsed: 1.618 sec
Running org.apache.activemq.MessageEvictionTest
Tests run: 3, Failures: 0, Errors: 0, Skipped: 0, Time elapsed: 90.375 sec
Running org.apache.activemq.MessageListenerRedeliveryTest
Tests run: 4, Failures: 0, Errors: 0, Skipped: 0, Time elapsed: 16.999 sec
Running org.apache.activemq.MessageTransformationTest
Tests run: 2, Failures: 0, Errors: 0, Skipped: 0, Time elapsed: 0.173 sec
Running org.apache.activemq.OnePrefetchAsyncConsumerTest
Tests run: 1, Failures: 0, Errors: 0, Skipped: 0, Time elapsed: 6.602 sec
Running org.apache.activemq.OptimizedAckTest
Tests run: 3, Failures: 0, Errors: 0, Skipped: 0, Time elapsed: 15.842 sec
Running org.apache.activemq.PerDestinationStoreLimitTest
Tests run: 2, Failures: 0, Errors: 0, Skipped: 0, Time elapsed: 40.357 sec
Running org.apache.activemq.ProducerFlowControlSendFailTest
Tests run: 7, Failures: 0, Errors: 0, Skipped: 0, Time elapsed: 18.495 sec
Running org.apache.activemq.ProducerFlowControlTest
Tests run: 6, Failures: 0, Errors: 0, Skipped: 0, Time elapsed: 25.611 sec
Running org.apache.activemq.QueueConsumerPriorityTest
Tests run: 1, Failures: 0, Errors: 0, Skipped: 0, Time elapsed: 5.481 sec
Running org.apache.activemq.ReconnectWithSameClientIDTest
Tests run: 2, Failures: 0, Errors: 0, Skipped: 0, Time elapsed: 4.826 sec
Running org.apache.activemq.RedeliveryPolicyTest
Tests run: 10, Failures: 0, Errors: 0, Skipped: 0, Time elapsed: 14.846 sec
Running org.apache.activemq.RemoveDestinationTest
Tests run: 2, Failures: 0, Errors: 0, Skipped: 0, Time elapsed: 19.396 sec
Running org.apache.activemq.TimeStampTest
Tests run: 1, Failures: 0, Errors: 0, Skipped: 0, Time elapsed: 4.571 sec
Running org.apache.activemq.TransactionContextTest
Tests run: 2, Failures: 0, Errors: 0, Skipped: 0, Time elapsed: 2.332 sec
Running org.apache.activemq.ZeroPrefetchConsumerTest
Tests run: 11, Failures: 0, Errors: 0, Skipped: 0, Time elapsed: 22.765 sec
Running org.apache.activemq.advisory.ConsumerListenerTest
Tests run: 2, Failures: 0, Errors: 0, Skipped: 0, Time elapsed: 0.803 sec
Running org.apache.activemq.advisory.DestinationListenerTest
Tests run: 3, Failures: 0, Errors: 0, Skipped: 0, Time elapsed: 7.946 sec
Running org.apache.activemq.advisory.MasterSlaveTempQueueMemoryTest
Tests run: 6, Failures: 0, Errors: 0, Skipped: 0, Time elapsed: 46.662 sec
Running org.apache.activemq.advisory.ProducerListenerTest
Tests run: 2, Failures: 0, Errors: 0, Skipped: 0, Time elapsed: 0.773 sec
Running org.apache.activemq.advisory.TempDestDeleteTest
Tests run: 2, Failures: 0, Errors: 0, Skipped: 0, Time elapsed: 0.803 sec
Running org.apache.activemq.advisory.TempDestLoadTest
Tests run: 2, Failures: 0, Errors: 0, Skipped: 0, Time elapsed: 20.642 sec
Running org.apache.activemq.advisory.TempQueueMemoryTest
Tests run: 2, Failures: 0, Errors: 0, Skipped: 0, Time elapsed: 21.331 sec
Running org.apache.activemq.blob.BlobTransferPolicyUriTest
Tests run: 1, Failures: 0, Errors: 0, Skipped: 0, Time elapsed: 0.184 sec
Running org.apache.activemq.blob.FTPBlobDownloadStrategyTest
Tests run: 3, Failures: 0, Errors: 0, Skipped: 0, Time elapsed: 1.893 sec
Running org.apache.activemq.blob.FTPBlobTest
Tests run: 1, Failures: 0, Errors: 0, Skipped: 0, Time elapsed: 2.031 sec
Running org.apache.activemq.blob.FTPBlobUploadStrategyTest
Tests run: 2, Failures: 0, Errors: 0, Skipped: 0, Time elapsed: 0.981 sec
Running org.apache.activemq.blob.FilesystemBlobTest
Tests run: 1, Failures: 0, Errors: 0, Skipped: 0, Time elapsed: 1.709 sec
Running org.apache.activemq.broker.BrokerRedeliveryTest
Tests run: 1, Failures: 0, Errors: 0, Skipped: 0, Time elapsed: 8.411 sec
Running org.apache.activemq.broker.BrokerServiceTest
Tests run: 5, Failures: 0, Errors: 0, Skipped: 0, Time elapsed: 5.31 sec
Running org.apache.activemq.broker.BrokerTest
Tests run: 129, Failures: 0, Errors: 0, Skipped: 0, Time elapsed: 22.535 sec
Running org.apache.activemq.broker.ConcurrentConnectSimulationTest
Tests run: 1, Failures: 0, Errors: 0, Skipped: 0, Time elapsed: 0.594 sec
Running org.apache.activemq.broker.CreateDestinationsOnStartupViaXBeanTest
Tests run: 1, Failures: 0, Errors: 0, Skipped: 0, Time elapsed: 2.335 sec
Running org.apache.activemq.broker.DedicatedTaskRunnerBrokerTest
Tests run: 129, Failures: 0, Errors: 0, Skipped: 0, Time elapsed: 21.691 sec
Running org.apache.activemq.broker.DoubleSubscriptionTest
Tests run: 1, Failures: 0, Errors: 0, Skipped: 0, Time elapsed: 2.561 sec
Running org.apache.activemq.broker.DurablePersistentFalseRestartTest
Tests run: 1, Failures: 0, Errors: 0, Skipped: 0, Time elapsed: 6.73 sec
Running org.apache.activemq.broker.JdbcXARecoveryBrokerTest
Tests run: 16, Failures: 0, Errors: 0, Skipped: 0, Time elapsed: 64.005 sec
Running org.apache.activemq.broker.MessageExpirationTest
Tests run: 13, Failures: 0, Errors: 0, Skipped: 0, Time elapsed: 23.119 sec
Running org.apache.activemq.broker.OutOfOrderXMLTest
Tests run: 1, Failures: 0, Errors: 0, Skipped: 0, Time elapsed: 1.38 sec
Running org.apache.activemq.broker.QueueMbeanRestartTest
Tests run: 2, Failures: 0, Errors: 0, Skipped: 0, Time elapsed: 4.745 sec
Running org.apache.activemq.broker.QueueSubscriptionTest
Tests run: 8, Failures: 0, Errors: 0, Skipped: 0, Time elapsed: 3.594 sec
Running org.apache.activemq.broker.ReconnectWithJMXEnabledTest
Tests run: 1, Failures: 0, Errors: 0, Skipped: 0, Time elapsed: 4.626 sec
Running org.apache.activemq.broker.RecoveryBrokerTest
Tests run: 9, Failures: 0, Errors: 0, Skipped: 0, Time elapsed: 29.076 sec
Running org.apache.activemq.broker.RedeliveryRestartTest
Tests run: 2, Failures: 0, Errors: 0, Skipped: 0, Time elapsed: 10.795 sec
Running org.apache.activemq.broker.SpringTest
Tests run: 1, Failures: 0, Errors: 0, Skipped: 0, Time elapsed: 2.781 sec
Running org.apache.activemq.broker.TopicSubscriptionTest
Tests run: 8, Failures: 0, Errors: 0, Skipped: 0, Time elapsed: 5.054 sec
Running org.apache.activemq.broker.XARecoveryBrokerTest
Tests run: 16, Failures: 0, Errors: 0, Skipped: 0, Time elapsed: 69.063 sec
Running org.apache.activemq.broker.advisory.AdvisoryBrokerTest
Tests run: 6, Failures: 0, Errors: 0, Skipped: 0, Time elapsed: 0.893 sec
Running org.apache.activemq.broker.advisory.AdvisoryDuplexNetworkBridgeTest
Tests run: 2, Failures: 0, Errors: 0, Skipped: 0, Time elapsed: 11.227 sec
Running org.apache.activemq.broker.advisory.AdvisoryJmxTest
Tests run: 1, Failures: 0, Errors: 0, Skipped: 0, Time elapsed: 0.748 sec
Running org.apache.activemq.broker.advisory.AdvisoryNetworkBridgeTest
Tests run: 2, Failures: 0, Errors: 0, Skipped: 0, Time elapsed: 10.826 sec
Running org.apache.activemq.broker.ft.DbRestartJDBCQueueMasterSlaveLeaseQuiesceTest
Tests run: 3, Failures: 0, Errors: 0, Skipped: 0, Time elapsed: 46.169 sec
Running org.apache.activemq.broker.ft.DbRestartJDBCQueueMasterSlaveLeaseTest
Tests run: 2, Failures: 0, Errors: 0, Skipped: 0, Time elapsed: 24.023 sec
Running org.apache.activemq.broker.ft.DbRestartJDBCQueueMasterSlaveTest
Running org.apache.activemq.broker.ft.JDBCQueueMasterSlaveTest
Tests run: 2, Failures: 0, Errors: 0, Skipped: 0, Time elapsed: 15.586 sec
Running org.apache.activemq.broker.ft.MasterSlaveProducerFlowControlTest
Tests run: 6, Failures: 0, Errors: 0, Skipped: 0, Time elapsed: 26.498 sec
Running org.apache.activemq.broker.ft.MasterSlaveSlaveDieTest
Tests run: 1, Failures: 0, Errors: 0, Skipped: 0, Time elapsed: 2.46 sec
Running org.apache.activemq.broker.ft.MasterSlaveSlaveShutdownTest
Tests run: 1, Failures: 0, Errors: 0, Skipped: 0, Time elapsed: 32.343 sec
Running org.apache.activemq.broker.ft.QueueMasterSlaveSingleUrlTest
Tests run: 2, Failures: 0, Errors: 0, Skipped: 0, Time elapsed: 14.856 sec
Running org.apache.activemq.broker.ft.QueueMasterSlaveTest
Tests run: 2, Failures: 0, Errors: 0, Skipped: 0, Time elapsed: 14.459 sec
Running org.apache.activemq.broker.ft.QueueMasterSlaveTestUsingSharedFileTest
Tests run: 2, Failures: 0, Errors: 0, Skipped: 0, Time elapsed: 27.872 sec
Running org.apache.activemq.broker.ft.QueueMasterSlaveUsingMasterConnectorElementCompositeQueueTest
Tests run: 2, Failures: 0, Errors: 0, Skipped: 0, Time elapsed: 16.256 sec
Running org.apache.activemq.broker.ft.QueueMasterSlaveUsingMasterConnectorElementTest
Tests run: 2, Failures: 0, Errors: 0, Skipped: 0, Time elapsed: 14.24 sec
Running org.apache.activemq.broker.ft.TopicMasterSlaveTest
Tests run: 2, Failures: 0, Errors: 0, Skipped: 0, Time elapsed: 14.233 sec
Running org.apache.activemq.broker.ft.TransactedTopicMasterSlaveTest
Tests run: 15, Failures: 0, Errors: 0, Skipped: 0, Time elapsed: 78.321 sec
Running org.apache.activemq.broker.jmx.BrokerViewSlowStoreStartupTest
Tests run: 1, Failures: 0, Errors: 0, Skipped: 0, Time elapsed: 1.053 sec
Running org.apache.activemq.broker.jmx.MBeanOperationTimeoutTest
Tests run: 1, Failures: 0, Errors: 0, Skipped: 0, Time elapsed: 14.382 sec
Running org.apache.activemq.broker.jmx.MBeanTest
Tests run: 19, Failures: 0, Errors: 0, Skipped: 0, Time elapsed: 55.04 sec
Running org.apache.activemq.broker.jmx.PurgeTest
Tests run: 5, Failures: 0, Errors: 0, Skipped: 0, Time elapsed: 20.681 sec
Running org.apache.activemq.broker.jmx.TransportConnectorMBeanTest
Tests run: 2, Failures: 0, Errors: 0, Skipped: 0, Time elapsed: 4.605 sec
Running org.apache.activemq.broker.mKahaDBXARecoveryBrokerTest
Tests run: 16, Failures: 0, Errors: 0, Skipped: 0, Time elapsed: 80.45 sec
Running org.apache.activemq.broker.message.security.MessageAuthenticationTest
Tests run: 1, Failures: 0, Errors: 0, Skipped: 0, Time elapsed: 0.727 sec
Running org.apache.activemq.broker.policy.AbortSlowConsumerTest
Tests run: 19, Failures: 0, Errors: 0, Skipped: 0, Time elapsed: 113.784 sec
Running org.apache.activemq.broker.policy.DeadLetterTest
Tests run: 4, Failures: 0, Errors: 0, Skipped: 0, Time elapsed: 2.357 sec
Running org.apache.activemq.broker.policy.DestinationCursorConfigTest
Tests run: 2, Failures: 0, Errors: 0, Skipped: 0, Time elapsed: 1.542 sec
Running org.apache.activemq.broker.policy.IndividualDeadLetterTest
Tests run: 5, Failures: 0, Errors: 0, Skipped: 0, Time elapsed: 4.489 sec
Running org.apache.activemq.broker.policy.IndividualDeadLetterViaXmlTest
Tests run: 4, Failures: 0, Errors: 0, Skipped: 0, Time elapsed: 3.6 sec
Running org.apache.activemq.broker.policy.MessageListenerDeadLetterTest
Tests run: 4, Failures: 0, Errors: 0, Skipped: 0, Time elapsed: 3.056 sec
Running org.apache.activemq.broker.policy.NoConsumerDeadLetterTest
Tests run: 5, Failures: 0, Errors: 0, Skipped: 0, Time elapsed: 1.902 sec
Running org.apache.activemq.broker.policy.NoRetryDeadLetterTest
Tests run: 4, Failures: 0, Errors: 0, Skipped: 0, Time elapsed: 1.059 sec
Running org.apache.activemq.broker.policy.PerDurableConsumerDeadLetterTest
Tests run: 4, Failures: 0, Errors: 0, Skipped: 0, Time elapsed: 2.35 sec
Running org.apache.activemq.broker.policy.PriorityNetworkDispatchPolicyTest
Tests run: 1, Failures: 0, Errors: 0, Skipped: 0, Time elapsed: 0.211 sec
Running org.apache.activemq.broker.policy.RoundRobinDispatchPolicyTest
Tests run: 9, Failures: 0, Errors: 0, Skipped: 0, Time elapsed: 4.419 sec
Running org.apache.activemq.broker.policy.SimpleDispatchPolicyTest
Tests run: 8, Failures: 0, Errors: 0, Skipped: 0, Time elapsed: 3.559 sec
Running org.apache.activemq.broker.policy.StrictOrderDispatchPolicyTest
Tests run: 8, Failures: 0, Errors: 0, Skipped: 0, Time elapsed: 3.719 sec
Running org.apache.activemq.broker.region.DestinationGCTest
Tests run: 2, Failures: 0, Errors: 0, Skipped: 0, Time elapsed: 13.694 sec
Running org.apache.activemq.broker.region.DestinationRemoveRestartTest
Tests run: 2, Failures: 0, Errors: 0, Skipped: 0, Time elapsed: 3.598 sec
Running org.apache.activemq.broker.region.QueueDuplicatesFromStoreTest
Tests run: 2, Failures: 0, Errors: 0, Skipped: 0, Time elapsed: 15.303 sec
Running org.apache.activemq.broker.region.QueueOptimizedDispatchExceptionTest
Tests run: 1, Failures: 0, Errors: 0, Skipped: 0, Time elapsed: 0.448 sec
Running org.apache.activemq.broker.region.QueuePurgeTest
Tests run: 3, Failures: 0, Errors: 0, Skipped: 0, Time elapsed: 347.421 sec
Running org.apache.activemq.broker.region.UniquePropertyMessageEvictionStrategyTest
Tests run: 1, Failures: 0, Errors: 0, Skipped: 0, Time elapsed: 11.79 sec
Running org.apache.activemq.broker.region.cursors.CursorDurableTest
Tests run: 2, Failures: 0, Errors: 0, Skipped: 0, Time elapsed: 4.393 sec
Running org.apache.activemq.broker.region.cursors.CursorQueueStoreTest
Tests run: 5, Failures: 0, Errors: 0, Skipped: 0, Time elapsed: 104.386 sec
Running org.apache.activemq.broker.region.cursors.FilePendingMessageCursorTest
Tests run: 2, Failures: 0, Errors: 0, Skipped: 0, Time elapsed: 2.422 sec
Running org.apache.activemq.broker.region.cursors.NegativeQueueTest
Tests run: 4, Failures: 0, Errors: 0, Skipped: 0, Time elapsed: 107.424 sec
Running org.apache.activemq.broker.region.cursors.OrderPendingListTest
Tests run: 9, Failures: 0, Errors: 0, Skipped: 0, Time elapsed: 0.304 sec
Running org.apache.activemq.broker.region.cursors.PrioritizedPendingListTest
Tests run: 7, Failures: 0, Errors: 0, Skipped: 0, Time elapsed: 0.302 sec
Running org.apache.activemq.broker.region.cursors.StoreBasedCursorTest
Tests run: 5, Failures: 0, Errors: 0, Skipped: 0, Time elapsed: 14.966 sec
Running org.apache.activemq.broker.region.cursors.StoreQueueCursorJDBCNoDuplicateTest
Tests run: 1, Failures: 0, Errors: 0, Skipped: 0, Time elapsed: 3.091 sec
Running org.apache.activemq.broker.region.cursors.StoreQueueCursorJournalNoDuplicateTest
Tests run: 1, Failures: 0, Errors: 0, Skipped: 0, Time elapsed: 0.616 sec
Running org.apache.activemq.broker.region.cursors.StoreQueueCursorKahaDBNoDuplicateTest
Tests run: 1, Failures: 0, Errors: 0, Skipped: 0, Time elapsed: 1.251 sec
Running org.apache.activemq.broker.region.cursors.StoreQueueCursorMemoryNoDuplicateTest
Tests run: 1, Failures: 0, Errors: 0, Skipped: 0, Time elapsed: 0.38 sec
Running org.apache.activemq.broker.region.cursors.StoreQueueCursorNoDuplicateTest
Tests run: 1, Failures: 0, Errors: 0, Skipped: 0, Time elapsed: 1.259 sec
Running org.apache.activemq.broker.region.group.MessageGroupHashBucketTest
Tests run: 2, Failures: 0, Errors: 0, Skipped: 0, Time elapsed: 0.029 sec
Running org.apache.activemq.broker.region.group.MessageGroupMapTest
Tests run: 2, Failures: 0, Errors: 0, Skipped: 0, Time elapsed: 0.03 sec
Running org.apache.activemq.broker.region.group.MessageGroupTest
Tests run: 3, Failures: 0, Errors: 0, Skipped: 0, Time elapsed: 1.138 sec
Running org.apache.activemq.broker.scheduler.CronParserTest
Tests run: 13, Failures: 0, Errors: 0, Skipped: 0, Time elapsed: 0.198 sec
Running org.apache.activemq.broker.scheduler.JmsCronSchedulerTest
Tests run: 2, Failures: 0, Errors: 0, Skipped: 0, Time elapsed: 199.255 sec
Running org.apache.activemq.broker.scheduler.JmsSchedulerTest
Tests run: 5, Failures: 0, Errors: 0, Skipped: 0, Time elapsed: 88.512 sec
Running org.apache.activemq.broker.scheduler.JobSchedulerManagementTest
Tests run: 7, Failures: 0, Errors: 0, Skipped: 0, Time elapsed: 76.427 sec
Running org.apache.activemq.broker.scheduler.JobSchedulerStoreTest
Tests run: 1, Failures: 0, Errors: 0, Skipped: 0, Time elapsed: 6.412 sec
Running org.apache.activemq.broker.scheduler.JobSchedulerTest
Results :
Tests in error:
testCreateTcpConnectionUsingAllocatedPort(org.apache.activemq.ActiveMQConnectionFactoryTest): org.apache.activemq:BrokerName=localhost,Type=Broker
testCreateTcpConnectionUsingAllocatedPort(org.apache.activemq.ActiveMQXAConnectionFactoryTest): org.apache.activemq:BrokerName=localhost,Type=Broker
Tests run: 1152, Failures: 0, Errors: 2, Skipped: 0
mojoFailed org.apache.maven.plugins:maven-surefire-plugin:2.12.3(default-test)
[JENKINS] Recording test results
projectFailed org.apache.activemq:activemq-core:5.8-SNAPSHOT
Build failed in Jenkins: ActiveMQ-Java7 » ActiveMQ :: Core #21
Posted by Apache Jenkins Server <je...@builds.apache.org>.
See <https://builds.apache.org/job/ActiveMQ-Java7/org.apache.activemq$activemq-core/21/>
------------------------------------------
[...truncated 266 lines...]
at junit.framework.TestResult$1.protect(TestResult.java:110)
at junit.framework.TestResult.runProtected(TestResult.java:128)
at junit.framework.TestResult.run(TestResult.java:113)
at junit.framework.TestCase.run(TestCase.java:124)
at junit.framework.TestSuite.runTest(TestSuite.java:243)
at junit.framework.TestSuite.run(TestSuite.java:238)
at org.junit.internal.runners.JUnit38ClassRunner.run(JUnit38ClassRunner.java:83)
at org.apache.maven.surefire.junit4.JUnit4Provider.execute(JUnit4Provider.java:252)
at org.apache.maven.surefire.junit4.JUnit4Provider.executeTestSet(JUnit4Provider.java:141)
at org.apache.maven.surefire.junit4.JUnit4Provider.invoke(JUnit4Provider.java:112)
at sun.reflect.NativeMethodAccessorImpl.invoke0(Native Method)
at sun.reflect.NativeMethodAccessorImpl.invoke(NativeMethodAccessorImpl.java:57)
at sun.reflect.DelegatingMethodAccessorImpl.invoke(DelegatingMethodAccessorImpl.java:43)
at java.lang.reflect.Method.invoke(Method.java:601)
at org.apache.maven.surefire.util.ReflectionUtils.invokeMethodWithArray(ReflectionUtils.java:189)
at org.apache.maven.surefire.booter.ProviderFactory$ProviderProxy.invoke(ProviderFactory.java:165)
at org.apache.maven.surefire.booter.ProviderFactory.invokeProvider(ProviderFactory.java:85)
at org.apache.maven.surefire.booter.ForkedBooter.runSuitesInProcess(ForkedBooter.java:115)
at org.apache.maven.surefire.booter.ForkedBooter.main(ForkedBooter.java:75)
Running org.apache.activemq.OptimizedAckTest
Tests run: 3, Failures: 0, Errors: 0, Skipped: 0, Time elapsed: 15.842 sec
Running org.apache.activemq.PerDestinationStoreLimitTest
Tests run: 2, Failures: 0, Errors: 0, Skipped: 0, Time elapsed: 40.236 sec
Running org.apache.activemq.ProducerFlowControlSendFailTest
Tests run: 7, Failures: 0, Errors: 0, Skipped: 0, Time elapsed: 18.508 sec
Running org.apache.activemq.ProducerFlowControlTest
Tests run: 6, Failures: 0, Errors: 0, Skipped: 0, Time elapsed: 25.614 sec
Running org.apache.activemq.QueueConsumerPriorityTest
Tests run: 1, Failures: 0, Errors: 0, Skipped: 0, Time elapsed: 5.842 sec
Running org.apache.activemq.ReconnectWithSameClientIDTest
Tests run: 2, Failures: 0, Errors: 0, Skipped: 0, Time elapsed: 4.841 sec
Running org.apache.activemq.RedeliveryPolicyTest
Tests run: 10, Failures: 0, Errors: 0, Skipped: 0, Time elapsed: 14.775 sec
Running org.apache.activemq.RemoveDestinationTest
Tests run: 2, Failures: 0, Errors: 0, Skipped: 0, Time elapsed: 19.323 sec
Running org.apache.activemq.TimeStampTest
Tests run: 1, Failures: 0, Errors: 0, Skipped: 0, Time elapsed: 4.571 sec
Running org.apache.activemq.TransactionContextTest
Tests run: 2, Failures: 0, Errors: 0, Skipped: 0, Time elapsed: 2.324 sec
Running org.apache.activemq.ZeroPrefetchConsumerTest
Tests run: 11, Failures: 0, Errors: 0, Skipped: 0, Time elapsed: 22.754 sec
Running org.apache.activemq.advisory.ConsumerListenerTest
Tests run: 2, Failures: 0, Errors: 0, Skipped: 0, Time elapsed: 0.778 sec
Running org.apache.activemq.advisory.DestinationListenerTest
Tests run: 3, Failures: 0, Errors: 0, Skipped: 0, Time elapsed: 7.937 sec
Running org.apache.activemq.advisory.MasterSlaveTempQueueMemoryTest
Tests run: 6, Failures: 0, Errors: 0, Skipped: 0, Time elapsed: 44.708 sec
Running org.apache.activemq.advisory.ProducerListenerTest
Tests run: 2, Failures: 0, Errors: 0, Skipped: 0, Time elapsed: 0.773 sec
Running org.apache.activemq.advisory.TempDestDeleteTest
Tests run: 2, Failures: 0, Errors: 0, Skipped: 0, Time elapsed: 0.792 sec
Running org.apache.activemq.advisory.TempDestLoadTest
Tests run: 2, Failures: 0, Errors: 0, Skipped: 0, Time elapsed: 18.109 sec
Running org.apache.activemq.advisory.TempQueueMemoryTest
Tests run: 2, Failures: 0, Errors: 0, Skipped: 0, Time elapsed: 19.938 sec
Running org.apache.activemq.blob.BlobTransferPolicyUriTest
Tests run: 1, Failures: 0, Errors: 0, Skipped: 0, Time elapsed: 0.195 sec
Running org.apache.activemq.blob.FTPBlobDownloadStrategyTest
Tests run: 3, Failures: 0, Errors: 0, Skipped: 0, Time elapsed: 1.816 sec
Running org.apache.activemq.blob.FTPBlobTest
Tests run: 1, Failures: 0, Errors: 0, Skipped: 0, Time elapsed: 2.034 sec
Running org.apache.activemq.blob.FTPBlobUploadStrategyTest
Tests run: 2, Failures: 0, Errors: 0, Skipped: 0, Time elapsed: 0.999 sec
Running org.apache.activemq.blob.FilesystemBlobTest
Tests run: 1, Failures: 0, Errors: 0, Skipped: 0, Time elapsed: 1.71 sec
Running org.apache.activemq.broker.BrokerRedeliveryTest
Tests run: 1, Failures: 0, Errors: 0, Skipped: 0, Time elapsed: 8.397 sec
Running org.apache.activemq.broker.BrokerServiceTest
Tests run: 5, Failures: 0, Errors: 0, Skipped: 0, Time elapsed: 4.623 sec
Running org.apache.activemq.broker.BrokerTest
Tests run: 129, Failures: 0, Errors: 0, Skipped: 0, Time elapsed: 21.236 sec
Running org.apache.activemq.broker.ConcurrentConnectSimulationTest
Tests run: 1, Failures: 0, Errors: 0, Skipped: 0, Time elapsed: 0.614 sec
Running org.apache.activemq.broker.CreateDestinationsOnStartupViaXBeanTest
Tests run: 1, Failures: 0, Errors: 0, Skipped: 0, Time elapsed: 2.228 sec
Running org.apache.activemq.broker.DedicatedTaskRunnerBrokerTest
Tests run: 129, Failures: 0, Errors: 0, Skipped: 0, Time elapsed: 21.384 sec
Running org.apache.activemq.broker.DoubleSubscriptionTest
Tests run: 1, Failures: 0, Errors: 0, Skipped: 0, Time elapsed: 2.552 sec
Running org.apache.activemq.broker.DurablePersistentFalseRestartTest
Tests run: 1, Failures: 0, Errors: 0, Skipped: 0, Time elapsed: 6.786 sec
Running org.apache.activemq.broker.JdbcXARecoveryBrokerTest
Tests run: 16, Failures: 0, Errors: 0, Skipped: 0, Time elapsed: 57.873 sec
Running org.apache.activemq.broker.MessageExpirationTest
Tests run: 13, Failures: 0, Errors: 0, Skipped: 0, Time elapsed: 23.111 sec
Running org.apache.activemq.broker.OutOfOrderXMLTest
Tests run: 1, Failures: 0, Errors: 0, Skipped: 0, Time elapsed: 1.363 sec
Running org.apache.activemq.broker.QueueMbeanRestartTest
Tests run: 2, Failures: 0, Errors: 0, Skipped: 0, Time elapsed: 3.887 sec
Running org.apache.activemq.broker.QueueSubscriptionTest
Tests run: 8, Failures: 0, Errors: 0, Skipped: 0, Time elapsed: 3.949 sec
Running org.apache.activemq.broker.ReconnectWithJMXEnabledTest
Tests run: 1, Failures: 0, Errors: 0, Skipped: 0, Time elapsed: 4.626 sec
Running org.apache.activemq.broker.RecoveryBrokerTest
Tests run: 9, Failures: 0, Errors: 0, Skipped: 0, Time elapsed: 28.77 sec
Running org.apache.activemq.broker.RedeliveryRestartTest
Tests run: 2, Failures: 0, Errors: 0, Skipped: 0, Time elapsed: 11.941 sec
Running org.apache.activemq.broker.SpringTest
Tests run: 1, Failures: 0, Errors: 0, Skipped: 0, Time elapsed: 1.696 sec
Running org.apache.activemq.broker.TopicSubscriptionTest
Tests run: 8, Failures: 0, Errors: 0, Skipped: 0, Time elapsed: 4.927 sec
Running org.apache.activemq.broker.XARecoveryBrokerTest
Tests run: 16, Failures: 0, Errors: 0, Skipped: 0, Time elapsed: 68.667 sec
Running org.apache.activemq.broker.advisory.AdvisoryBrokerTest
Tests run: 6, Failures: 0, Errors: 0, Skipped: 0, Time elapsed: 0.856 sec
Running org.apache.activemq.broker.advisory.AdvisoryDuplexNetworkBridgeTest
Tests run: 2, Failures: 0, Errors: 0, Skipped: 0, Time elapsed: 11.258 sec
Running org.apache.activemq.broker.advisory.AdvisoryJmxTest
Tests run: 1, Failures: 0, Errors: 0, Skipped: 0, Time elapsed: 0.726 sec
Running org.apache.activemq.broker.advisory.AdvisoryNetworkBridgeTest
Tests run: 2, Failures: 0, Errors: 0, Skipped: 0, Time elapsed: 10.827 sec
Running org.apache.activemq.broker.ft.DbRestartJDBCQueueMasterSlaveLeaseQuiesceTest
Tests run: 3, Failures: 0, Errors: 0, Skipped: 0, Time elapsed: 40.273 sec
Running org.apache.activemq.broker.ft.DbRestartJDBCQueueMasterSlaveLeaseTest
Tests run: 2, Failures: 0, Errors: 0, Skipped: 0, Time elapsed: 21.501 sec
Running org.apache.activemq.broker.ft.DbRestartJDBCQueueMasterSlaveTest
Running org.apache.activemq.broker.ft.JDBCQueueMasterSlaveTest
Tests run: 2, Failures: 0, Errors: 0, Skipped: 0, Time elapsed: 12.664 sec
Running org.apache.activemq.broker.ft.MasterSlaveProducerFlowControlTest
Tests run: 6, Failures: 0, Errors: 0, Skipped: 0, Time elapsed: 25.713 sec
Running org.apache.activemq.broker.ft.MasterSlaveSlaveDieTest
Tests run: 1, Failures: 0, Errors: 0, Skipped: 0, Time elapsed: 2.464 sec
Running org.apache.activemq.broker.ft.MasterSlaveSlaveShutdownTest
Tests run: 1, Failures: 0, Errors: 0, Skipped: 0, Time elapsed: 32.349 sec
Running org.apache.activemq.broker.ft.QueueMasterSlaveSingleUrlTest
Tests run: 2, Failures: 0, Errors: 0, Skipped: 0, Time elapsed: 13.712 sec
Running org.apache.activemq.broker.ft.QueueMasterSlaveTest
Tests run: 2, Failures: 0, Errors: 0, Skipped: 0, Time elapsed: 13.534 sec
Running org.apache.activemq.broker.ft.QueueMasterSlaveTestUsingSharedFileTest
Tests run: 2, Failures: 0, Errors: 0, Skipped: 0, Time elapsed: 27.862 sec
Running org.apache.activemq.broker.ft.QueueMasterSlaveUsingMasterConnectorElementCompositeQueueTest
Tests run: 2, Failures: 0, Errors: 0, Skipped: 0, Time elapsed: 14.212 sec
Running org.apache.activemq.broker.ft.QueueMasterSlaveUsingMasterConnectorElementTest
Tests run: 2, Failures: 0, Errors: 0, Skipped: 0, Time elapsed: 14.214 sec
Running org.apache.activemq.broker.ft.TopicMasterSlaveTest
Tests run: 2, Failures: 0, Errors: 0, Skipped: 0, Time elapsed: 14.201 sec
Running org.apache.activemq.broker.ft.TransactedTopicMasterSlaveTest
Tests run: 15, Failures: 0, Errors: 0, Skipped: 0, Time elapsed: 77.402 sec
Running org.apache.activemq.broker.jmx.BrokerViewSlowStoreStartupTest
Tests run: 1, Failures: 0, Errors: 0, Skipped: 0, Time elapsed: 1.01 sec
Running org.apache.activemq.broker.jmx.MBeanOperationTimeoutTest
Tests run: 1, Failures: 0, Errors: 0, Skipped: 0, Time elapsed: 13.312 sec
Running org.apache.activemq.broker.jmx.MBeanTest
Tests run: 19, Failures: 0, Errors: 0, Skipped: 0, Time elapsed: 54.898 sec
Running org.apache.activemq.broker.jmx.PurgeTest
Tests run: 5, Failures: 0, Errors: 0, Skipped: 0, Time elapsed: 16.038 sec
Running org.apache.activemq.broker.jmx.TransportConnectorMBeanTest
Tests run: 2, Failures: 0, Errors: 0, Skipped: 0, Time elapsed: 4.614 sec
Running org.apache.activemq.broker.mKahaDBXARecoveryBrokerTest
Tests run: 16, Failures: 0, Errors: 0, Skipped: 0, Time elapsed: 79.389 sec
Running org.apache.activemq.broker.message.security.MessageAuthenticationTest
Tests run: 1, Failures: 0, Errors: 0, Skipped: 0, Time elapsed: 0.711 sec
Running org.apache.activemq.broker.policy.AbortSlowConsumerTest
Tests run: 19, Failures: 0, Errors: 0, Skipped: 0, Time elapsed: 113.569 sec
Running org.apache.activemq.broker.policy.DeadLetterTest
Tests run: 4, Failures: 0, Errors: 0, Skipped: 0, Time elapsed: 2.343 sec
Running org.apache.activemq.broker.policy.DestinationCursorConfigTest
Tests run: 2, Failures: 0, Errors: 0, Skipped: 0, Time elapsed: 1.57 sec
Running org.apache.activemq.broker.policy.IndividualDeadLetterTest
Tests run: 5, Failures: 0, Errors: 0, Skipped: 0, Time elapsed: 4.451 sec
Running org.apache.activemq.broker.policy.IndividualDeadLetterViaXmlTest
Tests run: 4, Failures: 0, Errors: 0, Skipped: 0, Time elapsed: 3.621 sec
Running org.apache.activemq.broker.policy.MessageListenerDeadLetterTest
Tests run: 4, Failures: 0, Errors: 0, Skipped: 0, Time elapsed: 3.007 sec
Running org.apache.activemq.broker.policy.NoConsumerDeadLetterTest
Tests run: 5, Failures: 0, Errors: 0, Skipped: 0, Time elapsed: 1.89 sec
Running org.apache.activemq.broker.policy.NoRetryDeadLetterTest
Tests run: 4, Failures: 0, Errors: 0, Skipped: 0, Time elapsed: 1.067 sec
Running org.apache.activemq.broker.policy.PerDurableConsumerDeadLetterTest
Tests run: 4, Failures: 0, Errors: 0, Skipped: 0, Time elapsed: 2.332 sec
Running org.apache.activemq.broker.policy.PriorityNetworkDispatchPolicyTest
Tests run: 1, Failures: 0, Errors: 0, Skipped: 0, Time elapsed: 0.213 sec
Running org.apache.activemq.broker.policy.RoundRobinDispatchPolicyTest
Tests run: 9, Failures: 0, Errors: 0, Skipped: 0, Time elapsed: 4.368 sec
Running org.apache.activemq.broker.policy.SimpleDispatchPolicyTest
Tests run: 8, Failures: 0, Errors: 0, Skipped: 0, Time elapsed: 3.548 sec
Running org.apache.activemq.broker.policy.StrictOrderDispatchPolicyTest
Tests run: 8, Failures: 0, Errors: 0, Skipped: 0, Time elapsed: 7.572 sec
Running org.apache.activemq.broker.region.DestinationGCTest
Tests run: 2, Failures: 0, Errors: 0, Skipped: 0, Time elapsed: 13.697 sec
Running org.apache.activemq.broker.region.DestinationRemoveRestartTest
Tests run: 2, Failures: 0, Errors: 0, Skipped: 0, Time elapsed: 3.538 sec
Running org.apache.activemq.broker.region.QueueDuplicatesFromStoreTest
Tests run: 2, Failures: 0, Errors: 0, Skipped: 0, Time elapsed: 7.143 sec
Running org.apache.activemq.broker.region.QueueOptimizedDispatchExceptionTest
Tests run: 1, Failures: 0, Errors: 0, Skipped: 0, Time elapsed: 0.437 sec
Running org.apache.activemq.broker.region.QueuePurgeTest
Tests run: 3, Failures: 0, Errors: 0, Skipped: 0, Time elapsed: 99.965 sec
Running org.apache.activemq.broker.region.UniquePropertyMessageEvictionStrategyTest
Tests run: 1, Failures: 0, Errors: 0, Skipped: 0, Time elapsed: 11.768 sec
Running org.apache.activemq.broker.region.cursors.CursorDurableTest
Tests run: 2, Failures: 0, Errors: 0, Skipped: 0, Time elapsed: 3.871 sec
Running org.apache.activemq.broker.region.cursors.CursorQueueStoreTest
Tests run: 5, Failures: 0, Errors: 0, Skipped: 0, Time elapsed: 103.44 sec
Running org.apache.activemq.broker.region.cursors.FilePendingMessageCursorTest
Tests run: 2, Failures: 0, Errors: 0, Skipped: 0, Time elapsed: 2.448 sec
Running org.apache.activemq.broker.region.cursors.NegativeQueueTest
Tests run: 4, Failures: 0, Errors: 0, Skipped: 0, Time elapsed: 101.589 sec
Running org.apache.activemq.broker.region.cursors.OrderPendingListTest
Tests run: 9, Failures: 0, Errors: 0, Skipped: 0, Time elapsed: 0.298 sec
Running org.apache.activemq.broker.region.cursors.PrioritizedPendingListTest
Tests run: 7, Failures: 0, Errors: 0, Skipped: 0, Time elapsed: 0.305 sec
Running org.apache.activemq.broker.region.cursors.StoreBasedCursorTest
Tests run: 5, Failures: 0, Errors: 0, Skipped: 0, Time elapsed: 14.862 sec
Running org.apache.activemq.broker.region.cursors.StoreQueueCursorJDBCNoDuplicateTest
Tests run: 1, Failures: 0, Errors: 0, Skipped: 0, Time elapsed: 2.701 sec
Running org.apache.activemq.broker.region.cursors.StoreQueueCursorJournalNoDuplicateTest
Tests run: 1, Failures: 0, Errors: 0, Skipped: 0, Time elapsed: 0.541 sec
Running org.apache.activemq.broker.region.cursors.StoreQueueCursorKahaDBNoDuplicateTest
Tests run: 1, Failures: 0, Errors: 0, Skipped: 0, Time elapsed: 1.272 sec
Running org.apache.activemq.broker.region.cursors.StoreQueueCursorMemoryNoDuplicateTest
Tests run: 1, Failures: 0, Errors: 0, Skipped: 0, Time elapsed: 0.394 sec
Running org.apache.activemq.broker.region.cursors.StoreQueueCursorNoDuplicateTest
Tests run: 1, Failures: 0, Errors: 0, Skipped: 0, Time elapsed: 1.25 sec
Running org.apache.activemq.broker.region.group.MessageGroupHashBucketTest
Tests run: 2, Failures: 0, Errors: 0, Skipped: 0, Time elapsed: 0.032 sec
Running org.apache.activemq.broker.region.group.MessageGroupMapTest
Tests run: 2, Failures: 0, Errors: 0, Skipped: 0, Time elapsed: 0.031 sec
Running org.apache.activemq.broker.region.group.MessageGroupTest
Tests run: 3, Failures: 0, Errors: 0, Skipped: 0, Time elapsed: 1.123 sec
Running org.apache.activemq.broker.scheduler.CronParserTest
Tests run: 13, Failures: 0, Errors: 0, Skipped: 0, Time elapsed: 0.201 sec
Running org.apache.activemq.broker.scheduler.JmsCronSchedulerTest
Tests run: 2, Failures: 0, Errors: 0, Skipped: 0, Time elapsed: 197.733 sec
Running org.apache.activemq.broker.scheduler.JmsSchedulerTest
Tests run: 5, Failures: 0, Errors: 0, Skipped: 0, Time elapsed: 86.796 sec
Running org.apache.activemq.broker.scheduler.JobSchedulerManagementTest
Tests run: 7, Failures: 0, Errors: 0, Skipped: 0, Time elapsed: 75.962 sec
Running org.apache.activemq.broker.scheduler.JobSchedulerStoreTest
Tests run: 1, Failures: 0, Errors: 0, Skipped: 0, Time elapsed: 2.25 sec
Running org.apache.activemq.broker.scheduler.JobSchedulerTest
Tests run: 9, Failures: 0, Errors: 0, Skipped: 0, Time elapsed: 33.442 sec
Running org.apache.activemq.broker.store.DefaultStoreRecoveryBrokerTest
Tests run: 9, Failures: 0, Errors: 0, Skipped: 0, Time elapsed: 30.514 sec
Running org.apache.activemq.broker.store.RecoverExpiredMessagesTest
mojoFailed org.apache.maven.plugins:maven-surefire-plugin:2.12.3(default-test)
Results :
Failed tests: testPrefetchExtension(org.apache.activemq.OnePrefetchAsyncConsumerTest): completed on time
Tests in error:
testCreateTcpConnectionUsingAllocatedPort(org.apache.activemq.ActiveMQXAConnectionFactoryTest): org.apache.activemq:BrokerName=localhost,Type=Broker
Tests run: 1170, Failures: 1, Errors: 1, Skipped: 0
[JENKINS] Recording test results
projectFailed org.apache.activemq:activemq-core:5.8-SNAPSHOT
Build failed in Jenkins: ActiveMQ-Java7 » ActiveMQ :: Core #20
Posted by Apache Jenkins Server <je...@builds.apache.org>.
See <https://builds.apache.org/job/ActiveMQ-Java7/org.apache.activemq$activemq-core/20/changes>
Changes:
[dejanb] [maven-release-plugin] prepare for next development iteration
[dejanb] [maven-release-plugin] prepare release activemq-5.7.0
------------------------------------------
[...truncated 183 lines...]
Running org.apache.activemq.JmsDurableTopicTransactionTest
Tests run: 14, Failures: 0, Errors: 0, Skipped: 0, Time elapsed: 21.004 sec
Running org.apache.activemq.JmsDurableTopicWildcardSendReceiveTest
Tests run: 1, Failures: 0, Errors: 0, Skipped: 0, Time elapsed: 1.719 sec
Running org.apache.activemq.JmsQueueBrowserTest
Tests run: 8, Failures: 0, Errors: 0, Skipped: 0, Time elapsed: 9.757 sec
Running org.apache.activemq.JmsQueueCompositeSendReceiveTest
Tests run: 2, Failures: 0, Errors: 0, Skipped: 0, Time elapsed: 2.017 sec
Running org.apache.activemq.JmsQueueRequestReplyTest
Tests run: 2, Failures: 0, Errors: 0, Skipped: 0, Time elapsed: 0.851 sec
Running org.apache.activemq.JmsQueueSelectorTest
Tests run: 3, Failures: 0, Errors: 0, Skipped: 0, Time elapsed: 3.805 sec
Running org.apache.activemq.JmsQueueSendReceiveTest
Tests run: 1, Failures: 0, Errors: 0, Skipped: 0, Time elapsed: 1.728 sec
Running org.apache.activemq.JmsQueueSendReceiveTwoConnectionsStartBeforeBrokerTest
Tests run: 1, Failures: 0, Errors: 0, Skipped: 0, Time elapsed: 3.466 sec
Running org.apache.activemq.JmsQueueSendReceiveTwoConnectionsTest
Tests run: 1, Failures: 0, Errors: 0, Skipped: 0, Time elapsed: 1.75 sec
Running org.apache.activemq.JmsQueueSendReceiveUsingTwoSessionsTest
Tests run: 1, Failures: 0, Errors: 0, Skipped: 0, Time elapsed: 1.727 sec
Running org.apache.activemq.JmsQueueTopicCompositeSendReceiveTest
Tests run: 1, Failures: 0, Errors: 0, Skipped: 0, Time elapsed: 1.782 sec
Running org.apache.activemq.JmsQueueTransactionTest
Tests run: 17, Failures: 0, Errors: 0, Skipped: 0, Time elapsed: 22.261 sec
Running org.apache.activemq.JmsQueueWildcardSendReceiveTest
Tests run: 4, Failures: 0, Errors: 0, Skipped: 0, Time elapsed: 1.998 sec
Running org.apache.activemq.JmsRedeliveredTest
Tests run: 18, Failures: 0, Errors: 0, Skipped: 0, Time elapsed: 13.539 sec
Running org.apache.activemq.JmsRollbackRedeliveryTest
Tests run: 9, Failures: 0, Errors: 0, Skipped: 0, Time elapsed: 10.993 sec
Running org.apache.activemq.JmsSendReceiveWithMessageExpirationTest
Tests run: 5, Failures: 0, Errors: 0, Skipped: 0, Time elapsed: 18.186 sec
Running org.apache.activemq.JmsSendWithAsyncCallbackTest
Tests run: 1, Failures: 0, Errors: 0, Skipped: 0, Time elapsed: 3.369 sec
Running org.apache.activemq.JmsSessionRecoverTest
Tests run: 6, Failures: 0, Errors: 0, Skipped: 0, Time elapsed: 6.973 sec
Running org.apache.activemq.JmsTempDestinationTest
Tests run: 8, Failures: 0, Errors: 0, Skipped: 0, Time elapsed: 38.101 sec
Running org.apache.activemq.JmsTopicCompositeSendReceiveTest
Tests run: 1, Failures: 0, Errors: 0, Skipped: 0, Time elapsed: 1.737 sec
Running org.apache.activemq.JmsTopicRedeliverTest
Tests run: 1, Failures: 0, Errors: 0, Skipped: 0, Time elapsed: 1.661 sec
Running org.apache.activemq.JmsTopicRequestReplyTest
Tests run: 2, Failures: 0, Errors: 0, Skipped: 0, Time elapsed: 0.776 sec
Running org.apache.activemq.JmsTopicSelectorTest
Tests run: 3, Failures: 0, Errors: 0, Skipped: 0, Time elapsed: 8.869 sec
Running org.apache.activemq.JmsTopicSendReceiveSubscriberTest
Tests run: 1, Failures: 0, Errors: 0, Skipped: 0, Time elapsed: 0.708 sec
Running org.apache.activemq.JmsTopicSendReceiveTest
Tests run: 1, Failures: 0, Errors: 0, Skipped: 0, Time elapsed: 0.702 sec
Running org.apache.activemq.JmsTopicSendReceiveWithTwoConnectionsTest
Tests run: 1, Failures: 0, Errors: 0, Skipped: 0, Time elapsed: 0.706 sec
Running org.apache.activemq.JmsTopicSendReceiveWithTwoConnectionsWithJMXTest
Tests run: 1, Failures: 0, Errors: 0, Skipped: 0, Time elapsed: 0.707 sec
Running org.apache.activemq.JmsTopicSendSameMessageTest
Tests run: 1, Failures: 0, Errors: 0, Skipped: 0, Time elapsed: 0.715 sec
Running org.apache.activemq.JmsTopicTransactionTest
Tests run: 14, Failures: 0, Errors: 0, Skipped: 0, Time elapsed: 20.097 sec
Running org.apache.activemq.JmsTopicWildcardSendReceiveTest
Tests run: 4, Failures: 0, Errors: 0, Skipped: 0, Time elapsed: 1.991 sec
Running org.apache.activemq.LargeStreamletTest
Tests run: 1, Failures: 0, Errors: 0, Skipped: 0, Time elapsed: 1.6 sec
Running org.apache.activemq.MessageEvictionTest
Tests run: 3, Failures: 0, Errors: 0, Skipped: 0, Time elapsed: 91.167 sec
Running org.apache.activemq.MessageListenerRedeliveryTest
Tests run: 4, Failures: 0, Errors: 0, Skipped: 0, Time elapsed: 16.983 sec
Running org.apache.activemq.MessageTransformationTest
Tests run: 2, Failures: 0, Errors: 0, Skipped: 0, Time elapsed: 0.175 sec
Running org.apache.activemq.OnePrefetchAsyncConsumerTest
Tests run: 1, Failures: 1, Errors: 0, Skipped: 0, Time elapsed: 315.752 sec <<< FAILURE!
testPrefetchExtension(org.apache.activemq.OnePrefetchAsyncConsumerTest) Time elapsed: 315588 sec <<< FAILURE!
junit.framework.AssertionFailedError: completed on time
at junit.framework.Assert.fail(Assert.java:50)
at junit.framework.Assert.assertTrue(Assert.java:20)
at org.apache.activemq.OnePrefetchAsyncConsumerTest.testPrefetchExtension(OnePrefetchAsyncConsumerTest.java:77)
at sun.reflect.NativeMethodAccessorImpl.invoke0(Native Method)
at sun.reflect.NativeMethodAccessorImpl.invoke(NativeMethodAccessorImpl.java:57)
at sun.reflect.DelegatingMethodAccessorImpl.invoke(DelegatingMethodAccessorImpl.java:43)
at java.lang.reflect.Method.invoke(Method.java:601)
at junit.framework.TestCase.runTest(TestCase.java:168)
at junit.framework.TestCase.runBare(TestCase.java:134)
at org.apache.activemq.CombinationTestSupport.runBare(CombinationTestSupport.java:90)
at org.apache.activemq.CombinationTestSupport.runBare(CombinationTestSupport.java:96)
at junit.framework.TestResult$1.protect(TestResult.java:110)
at junit.framework.TestResult.runProtected(TestResult.java:128)
at junit.framework.TestResult.run(TestResult.java:113)
at junit.framework.TestCase.run(TestCase.java:124)
at junit.framework.TestSuite.runTest(TestSuite.java:243)
at junit.framework.TestSuite.run(TestSuite.java:238)
at org.junit.internal.runners.JUnit38ClassRunner.run(JUnit38ClassRunner.java:83)
at org.apache.maven.surefire.junit4.JUnit4Provider.execute(JUnit4Provider.java:252)
at org.apache.maven.surefire.junit4.JUnit4Provider.executeTestSet(JUnit4Provider.java:141)
at org.apache.maven.surefire.junit4.JUnit4Provider.invoke(JUnit4Provider.java:112)
at sun.reflect.NativeMethodAccessorImpl.invoke0(Native Method)
at sun.reflect.NativeMethodAccessorImpl.invoke(NativeMethodAccessorImpl.java:57)
at sun.reflect.DelegatingMethodAccessorImpl.invoke(DelegatingMethodAccessorImpl.java:43)
at java.lang.reflect.Method.invoke(Method.java:601)
at org.apache.maven.surefire.util.ReflectionUtils.invokeMethodWithArray(ReflectionUtils.java:189)
at org.apache.maven.surefire.booter.ProviderFactory$ProviderProxy.invoke(ProviderFactory.java:165)
at org.apache.maven.surefire.booter.ProviderFactory.invokeProvider(ProviderFactory.java:85)
at org.apache.maven.surefire.booter.ForkedBooter.runSuitesInProcess(ForkedBooter.java:115)
at org.apache.maven.surefire.booter.ForkedBooter.main(ForkedBooter.java:75)
Running org.apache.activemq.OptimizedAckTest
Tests run: 3, Failures: 0, Errors: 0, Skipped: 0, Time elapsed: 15.836 sec
Running org.apache.activemq.PerDestinationStoreLimitTest
Tests run: 2, Failures: 0, Errors: 0, Skipped: 0, Time elapsed: 40.752 sec
Running org.apache.activemq.ProducerFlowControlSendFailTest
Tests run: 7, Failures: 0, Errors: 0, Skipped: 0, Time elapsed: 18.486 sec
Running org.apache.activemq.ProducerFlowControlTest
Tests run: 6, Failures: 0, Errors: 0, Skipped: 0, Time elapsed: 25.598 sec
Running org.apache.activemq.QueueConsumerPriorityTest
Tests run: 1, Failures: 0, Errors: 0, Skipped: 0, Time elapsed: 5.589 sec
Running org.apache.activemq.ReconnectWithSameClientIDTest
Tests run: 2, Failures: 0, Errors: 0, Skipped: 0, Time elapsed: 4.817 sec
Running org.apache.activemq.RedeliveryPolicyTest
Tests run: 10, Failures: 0, Errors: 0, Skipped: 0, Time elapsed: 14.749 sec
Running org.apache.activemq.RemoveDestinationTest
Tests run: 2, Failures: 0, Errors: 0, Skipped: 0, Time elapsed: 19.705 sec
Running org.apache.activemq.TimeStampTest
Tests run: 1, Failures: 0, Errors: 0, Skipped: 0, Time elapsed: 4.569 sec
Running org.apache.activemq.TransactionContextTest
Tests run: 2, Failures: 0, Errors: 0, Skipped: 0, Time elapsed: 2.489 sec
Running org.apache.activemq.ZeroPrefetchConsumerTest
Tests run: 11, Failures: 0, Errors: 0, Skipped: 0, Time elapsed: 22.745 sec
Running org.apache.activemq.advisory.ConsumerListenerTest
Tests run: 2, Failures: 0, Errors: 0, Skipped: 0, Time elapsed: 0.742 sec
Running org.apache.activemq.advisory.DestinationListenerTest
Tests run: 3, Failures: 0, Errors: 0, Skipped: 0, Time elapsed: 7.927 sec
Running org.apache.activemq.advisory.MasterSlaveTempQueueMemoryTest
Tests run: 6, Failures: 0, Errors: 0, Skipped: 0, Time elapsed: 42.632 sec
Running org.apache.activemq.advisory.ProducerListenerTest
Tests run: 2, Failures: 0, Errors: 0, Skipped: 0, Time elapsed: 0.741 sec
Running org.apache.activemq.advisory.TempDestDeleteTest
Tests run: 2, Failures: 0, Errors: 0, Skipped: 0, Time elapsed: 0.771 sec
Running org.apache.activemq.advisory.TempDestLoadTest
Tests run: 2, Failures: 0, Errors: 0, Skipped: 0, Time elapsed: 17.821 sec
Running org.apache.activemq.advisory.TempQueueMemoryTest
Tests run: 2, Failures: 0, Errors: 0, Skipped: 0, Time elapsed: 20.074 sec
Running org.apache.activemq.blob.BlobTransferPolicyUriTest
Tests run: 1, Failures: 0, Errors: 0, Skipped: 0, Time elapsed: 0.178 sec
Running org.apache.activemq.blob.FTPBlobDownloadStrategyTest
Tests run: 3, Failures: 0, Errors: 0, Skipped: 0, Time elapsed: 1.775 sec
Running org.apache.activemq.blob.FTPBlobTest
Tests run: 1, Failures: 0, Errors: 0, Skipped: 0, Time elapsed: 2.03 sec
Running org.apache.activemq.blob.FTPBlobUploadStrategyTest
Tests run: 2, Failures: 0, Errors: 0, Skipped: 0, Time elapsed: 0.938 sec
Running org.apache.activemq.blob.FilesystemBlobTest
Tests run: 1, Failures: 0, Errors: 0, Skipped: 0, Time elapsed: 1.681 sec
Running org.apache.activemq.broker.BrokerRedeliveryTest
Tests run: 1, Failures: 0, Errors: 0, Skipped: 0, Time elapsed: 9.187 sec
Running org.apache.activemq.broker.BrokerServiceTest
Tests run: 5, Failures: 0, Errors: 0, Skipped: 0, Time elapsed: 4.661 sec
Running org.apache.activemq.broker.BrokerTest
Tests run: 129, Failures: 0, Errors: 0, Skipped: 0, Time elapsed: 25.389 sec
Running org.apache.activemq.broker.ConcurrentConnectSimulationTest
Tests run: 1, Failures: 0, Errors: 0, Skipped: 0, Time elapsed: 0.579 sec
Running org.apache.activemq.broker.CreateDestinationsOnStartupViaXBeanTest
Tests run: 1, Failures: 0, Errors: 0, Skipped: 0, Time elapsed: 2.276 sec
Running org.apache.activemq.broker.DedicatedTaskRunnerBrokerTest
Tests run: 129, Failures: 0, Errors: 0, Skipped: 0, Time elapsed: 24.54 sec
Running org.apache.activemq.broker.DoubleSubscriptionTest
Tests run: 1, Failures: 0, Errors: 0, Skipped: 0, Time elapsed: 2.53 sec
Running org.apache.activemq.broker.DurablePersistentFalseRestartTest
Tests run: 1, Failures: 0, Errors: 0, Skipped: 0, Time elapsed: 6.726 sec
Running org.apache.activemq.broker.JdbcXARecoveryBrokerTest
Tests run: 16, Failures: 0, Errors: 0, Skipped: 0, Time elapsed: 130.973 sec
Running org.apache.activemq.broker.MessageExpirationTest
Tests run: 13, Failures: 0, Errors: 0, Skipped: 0, Time elapsed: 22.107 sec
Running org.apache.activemq.broker.OutOfOrderXMLTest
Tests run: 1, Failures: 0, Errors: 0, Skipped: 0, Time elapsed: 1.453 sec
Running org.apache.activemq.broker.QueueMbeanRestartTest
Tests run: 2, Failures: 0, Errors: 0, Skipped: 0, Time elapsed: 13.656 sec
Running org.apache.activemq.broker.QueueSubscriptionTest
Tests run: 8, Failures: 0, Errors: 0, Skipped: 0, Time elapsed: 3.828 sec
Running org.apache.activemq.broker.ReconnectWithJMXEnabledTest
Tests run: 1, Failures: 0, Errors: 0, Skipped: 0, Time elapsed: 4.601 sec
Running org.apache.activemq.broker.RecoveryBrokerTest
Tests run: 9, Failures: 0, Errors: 0, Skipped: 0, Time elapsed: 29.627 sec
Running org.apache.activemq.broker.RedeliveryRestartTest
Tests run: 2, Failures: 0, Errors: 0, Skipped: 0, Time elapsed: 11.824 sec
Running org.apache.activemq.broker.SpringTest
Tests run: 1, Failures: 0, Errors: 0, Skipped: 0, Time elapsed: 2.773 sec
Running org.apache.activemq.broker.TopicSubscriptionTest
Tests run: 8, Failures: 0, Errors: 0, Skipped: 0, Time elapsed: 7.236 sec
Running org.apache.activemq.broker.XARecoveryBrokerTest
Tests run: 16, Failures: 0, Errors: 0, Skipped: 0, Time elapsed: 70.425 sec
Running org.apache.activemq.broker.advisory.AdvisoryBrokerTest
Tests run: 6, Failures: 0, Errors: 0, Skipped: 0, Time elapsed: 0.832 sec
Running org.apache.activemq.broker.advisory.AdvisoryDuplexNetworkBridgeTest
Tests run: 2, Failures: 0, Errors: 0, Skipped: 0, Time elapsed: 11.368 sec
Running org.apache.activemq.broker.advisory.AdvisoryJmxTest
Tests run: 1, Failures: 0, Errors: 0, Skipped: 0, Time elapsed: 0.74 sec
Running org.apache.activemq.broker.advisory.AdvisoryNetworkBridgeTest
Tests run: 2, Failures: 0, Errors: 0, Skipped: 0, Time elapsed: 10.776 sec
Running org.apache.activemq.broker.ft.DbRestartJDBCQueueMasterSlaveLeaseQuiesceTest
Running org.apache.activemq.broker.ft.DbRestartJDBCQueueMasterSlaveLeaseTest
Tests run: 2, Failures: 0, Errors: 0, Skipped: 0, Time elapsed: 55.338 sec
Running org.apache.activemq.broker.ft.DbRestartJDBCQueueMasterSlaveTest
Running org.apache.activemq.broker.ft.JDBCQueueMasterSlaveTest
Tests run: 2, Failures: 0, Errors: 0, Skipped: 0, Time elapsed: 45.497 sec
Running org.apache.activemq.broker.ft.MasterSlaveProducerFlowControlTest
Tests run: 6, Failures: 0, Errors: 0, Skipped: 0, Time elapsed: 25.744 sec
Running org.apache.activemq.broker.ft.MasterSlaveSlaveDieTest
Tests run: 1, Failures: 0, Errors: 0, Skipped: 0, Time elapsed: 2.431 sec
Running org.apache.activemq.broker.ft.MasterSlaveSlaveShutdownTest
Tests run: 1, Failures: 0, Errors: 0, Skipped: 0, Time elapsed: 32.327 sec
Running org.apache.activemq.broker.ft.QueueMasterSlaveSingleUrlTest
Tests run: 2, Failures: 0, Errors: 0, Skipped: 0, Time elapsed: 15.158 sec
Running org.apache.activemq.broker.ft.QueueMasterSlaveTest
Tests run: 2, Failures: 0, Errors: 0, Skipped: 0, Time elapsed: 23.99 sec
Running org.apache.activemq.broker.ft.QueueMasterSlaveTestUsingSharedFileTest
Tests run: 2, Failures: 0, Errors: 0, Skipped: 0, Time elapsed: 30.295 sec
Running org.apache.activemq.broker.ft.QueueMasterSlaveUsingMasterConnectorElementCompositeQueueTest
Tests run: 2, Failures: 0, Errors: 0, Skipped: 0, Time elapsed: 34.782 sec
Running org.apache.activemq.broker.ft.QueueMasterSlaveUsingMasterConnectorElementTest
Tests run: 2, Failures: 0, Errors: 0, Skipped: 0, Time elapsed: 24.588 sec
Running org.apache.activemq.broker.ft.TopicMasterSlaveTest
Tests run: 2, Failures: 0, Errors: 0, Skipped: 0, Time elapsed: 24.744 sec
Running org.apache.activemq.broker.ft.TransactedTopicMasterSlaveTest
Tests run: 15, Failures: 0, Errors: 0, Skipped: 0, Time elapsed: 89.144 sec
Running org.apache.activemq.broker.jmx.BrokerViewSlowStoreStartupTest
Tests run: 1, Failures: 0, Errors: 0, Skipped: 0, Time elapsed: 1.167 sec
Running org.apache.activemq.broker.jmx.MBeanOperationTimeoutTest
Tests run: 1, Failures: 0, Errors: 0, Skipped: 0, Time elapsed: 34.283 sec
Running org.apache.activemq.broker.jmx.MBeanTest
Tests run: 19, Failures: 0, Errors: 0, Skipped: 0, Time elapsed: 54.961 sec
Running org.apache.activemq.broker.jmx.PurgeTest
Tests run: 5, Failures: 0, Errors: 0, Skipped: 0, Time elapsed: 89.42 sec
Running org.apache.activemq.broker.jmx.TransportConnectorMBeanTest
Tests run: 2, Failures: 0, Errors: 0, Skipped: 0, Time elapsed: 4.701 sec
Running org.apache.activemq.broker.mKahaDBXARecoveryBrokerTest
Tests run: 16, Failures: 0, Errors: 0, Skipped: 0, Time elapsed: 84.394 sec
Running org.apache.activemq.broker.message.security.MessageAuthenticationTest
Tests run: 1, Failures: 0, Errors: 0, Skipped: 0, Time elapsed: 0.695 sec
Running org.apache.activemq.broker.policy.AbortSlowConsumerTest
Results :
Failed tests: testPrefetchExtension(org.apache.activemq.OnePrefetchAsyncConsumerTest): completed on time
Tests in error:
testCreateTcpConnectionUsingAllocatedPort(org.apache.activemq.ActiveMQConnectionFactoryTest): org.apache.activemq:BrokerName=localhost,Type=Broker
Tests run: 987, Failures: 1, Errors: 1, Skipped: 0
mojoFailed org.apache.maven.plugins:maven-surefire-plugin:2.12.3(default-test)
[JENKINS] Recording test results
projectFailed org.apache.activemq:activemq-core:5.8-SNAPSHOT
Build failed in Jenkins: ActiveMQ-Java7 » ActiveMQ :: Core #19
Posted by Apache Jenkins Server <je...@builds.apache.org>.
See <https://builds.apache.org/job/ActiveMQ-Java7/org.apache.activemq$activemq-core/19/changes>
Changes:
[tabish] Polish the code, remove warnings fix spelling errors in the docs, add some new javadocs, etc.
[gtully] https://issues.apache.org/jira/browse/AMQ-2106 - Allow broker to evenly distribute message groups among consumers - have consumer order take number of assigned groups into account, such that priority is given to the least loaded consumers. When groups change frequently or are suspended this allows better distribution. When new consumer arrive they now have a good chance of getting the next available groups
------------------------------------------
[...truncated 215 lines...]
Running org.apache.activemq.JmsSendWithAsyncCallbackTest
Tests run: 1, Failures: 0, Errors: 0, Skipped: 0, Time elapsed: 3.061 sec
Running org.apache.activemq.JmsSessionRecoverTest
Tests run: 6, Failures: 0, Errors: 0, Skipped: 0, Time elapsed: 7.032 sec
Running org.apache.activemq.JmsTempDestinationTest
Tests run: 8, Failures: 0, Errors: 0, Skipped: 0, Time elapsed: 37.749 sec
Running org.apache.activemq.JmsTopicCompositeSendReceiveTest
Tests run: 1, Failures: 0, Errors: 0, Skipped: 0, Time elapsed: 1.743 sec
Running org.apache.activemq.JmsTopicRedeliverTest
Tests run: 1, Failures: 0, Errors: 0, Skipped: 0, Time elapsed: 1.642 sec
Running org.apache.activemq.JmsTopicRequestReplyTest
Tests run: 2, Failures: 0, Errors: 0, Skipped: 0, Time elapsed: 0.762 sec
Running org.apache.activemq.JmsTopicSelectorTest
Tests run: 3, Failures: 0, Errors: 0, Skipped: 0, Time elapsed: 8.784 sec
Running org.apache.activemq.JmsTopicSendReceiveSubscriberTest
Tests run: 1, Failures: 0, Errors: 0, Skipped: 0, Time elapsed: 0.697 sec
Running org.apache.activemq.JmsTopicSendReceiveTest
Tests run: 1, Failures: 0, Errors: 0, Skipped: 0, Time elapsed: 0.702 sec
Running org.apache.activemq.JmsTopicSendReceiveWithTwoConnectionsTest
Tests run: 1, Failures: 0, Errors: 0, Skipped: 0, Time elapsed: 0.713 sec
Running org.apache.activemq.JmsTopicSendReceiveWithTwoConnectionsWithJMXTest
Tests run: 1, Failures: 0, Errors: 0, Skipped: 0, Time elapsed: 0.707 sec
Running org.apache.activemq.JmsTopicSendSameMessageTest
Tests run: 1, Failures: 0, Errors: 0, Skipped: 0, Time elapsed: 0.716 sec
Running org.apache.activemq.JmsTopicTransactionTest
Tests run: 14, Failures: 0, Errors: 0, Skipped: 0, Time elapsed: 20.052 sec
Running org.apache.activemq.JmsTopicWildcardSendReceiveTest
Tests run: 4, Failures: 0, Errors: 0, Skipped: 0, Time elapsed: 1.895 sec
Running org.apache.activemq.LargeStreamletTest
Tests run: 1, Failures: 0, Errors: 0, Skipped: 0, Time elapsed: 1.601 sec
Running org.apache.activemq.MessageEvictionTest
Tests run: 3, Failures: 0, Errors: 0, Skipped: 0, Time elapsed: 91.183 sec
Running org.apache.activemq.MessageListenerRedeliveryTest
Tests run: 4, Failures: 0, Errors: 0, Skipped: 0, Time elapsed: 16.973 sec
Running org.apache.activemq.MessageTransformationTest
Tests run: 2, Failures: 0, Errors: 0, Skipped: 0, Time elapsed: 0.172 sec
Running org.apache.activemq.OnePrefetchAsyncConsumerTest
Tests run: 1, Failures: 0, Errors: 0, Skipped: 0, Time elapsed: 6.602 sec
Running org.apache.activemq.OptimizedAckTest
Tests run: 3, Failures: 0, Errors: 0, Skipped: 0, Time elapsed: 15.851 sec
Running org.apache.activemq.PerDestinationStoreLimitTest
Tests run: 2, Failures: 0, Errors: 0, Skipped: 0, Time elapsed: 40.655 sec
Running org.apache.activemq.ProducerFlowControlSendFailTest
Tests run: 7, Failures: 0, Errors: 0, Skipped: 0, Time elapsed: 18.546 sec
Running org.apache.activemq.ProducerFlowControlTest
Tests run: 6, Failures: 0, Errors: 0, Skipped: 0, Time elapsed: 25.603 sec
Running org.apache.activemq.QueueConsumerPriorityTest
Tests run: 1, Failures: 0, Errors: 0, Skipped: 0, Time elapsed: 5.691 sec
Running org.apache.activemq.ReconnectWithSameClientIDTest
Tests run: 2, Failures: 0, Errors: 0, Skipped: 0, Time elapsed: 4.824 sec
Running org.apache.activemq.RedeliveryPolicyTest
Tests run: 10, Failures: 0, Errors: 0, Skipped: 0, Time elapsed: 14.769 sec
Running org.apache.activemq.RemoveDestinationTest
Tests run: 2, Failures: 0, Errors: 0, Skipped: 0, Time elapsed: 19.849 sec
Running org.apache.activemq.TimeStampTest
Tests run: 1, Failures: 0, Errors: 0, Skipped: 0, Time elapsed: 4.654 sec
Running org.apache.activemq.TransactionContextTest
Tests run: 2, Failures: 0, Errors: 0, Skipped: 0, Time elapsed: 2.488 sec
Running org.apache.activemq.ZeroPrefetchConsumerTest
Tests run: 11, Failures: 0, Errors: 0, Skipped: 0, Time elapsed: 22.816 sec
Running org.apache.activemq.advisory.ConsumerListenerTest
Tests run: 2, Failures: 0, Errors: 0, Skipped: 0, Time elapsed: 0.753 sec
Running org.apache.activemq.advisory.DestinationListenerTest
Tests run: 3, Failures: 0, Errors: 0, Skipped: 0, Time elapsed: 7.92 sec
Running org.apache.activemq.advisory.MasterSlaveTempQueueMemoryTest
Tests run: 6, Failures: 0, Errors: 0, Skipped: 0, Time elapsed: 40.635 sec
Running org.apache.activemq.advisory.ProducerListenerTest
Tests run: 2, Failures: 0, Errors: 0, Skipped: 0, Time elapsed: 0.737 sec
Running org.apache.activemq.advisory.TempDestDeleteTest
Tests run: 2, Failures: 0, Errors: 0, Skipped: 0, Time elapsed: 0.773 sec
Running org.apache.activemq.advisory.TempDestLoadTest
Tests run: 2, Failures: 0, Errors: 0, Skipped: 0, Time elapsed: 18.349 sec
Running org.apache.activemq.advisory.TempQueueMemoryTest
Tests run: 2, Failures: 0, Errors: 0, Skipped: 0, Time elapsed: 19.714 sec
Running org.apache.activemq.blob.BlobTransferPolicyUriTest
Tests run: 1, Failures: 0, Errors: 0, Skipped: 0, Time elapsed: 0.177 sec
Running org.apache.activemq.blob.FTPBlobDownloadStrategyTest
Tests run: 3, Failures: 0, Errors: 0, Skipped: 0, Time elapsed: 1.783 sec
Running org.apache.activemq.blob.FTPBlobTest
Tests run: 1, Failures: 0, Errors: 0, Skipped: 0, Time elapsed: 2 sec
Running org.apache.activemq.blob.FTPBlobUploadStrategyTest
Tests run: 2, Failures: 0, Errors: 0, Skipped: 0, Time elapsed: 0.944 sec
Running org.apache.activemq.blob.FilesystemBlobTest
Tests run: 1, Failures: 0, Errors: 0, Skipped: 0, Time elapsed: 1.689 sec
Running org.apache.activemq.broker.BrokerRedeliveryTest
Tests run: 1, Failures: 0, Errors: 0, Skipped: 0, Time elapsed: 9.22 sec
Running org.apache.activemq.broker.BrokerServiceTest
Tests run: 5, Failures: 0, Errors: 0, Skipped: 0, Time elapsed: 4.602 sec
Running org.apache.activemq.broker.BrokerTest
Tests run: 129, Failures: 0, Errors: 0, Skipped: 0, Time elapsed: 22.345 sec
Running org.apache.activemq.broker.ConcurrentConnectSimulationTest
Tests run: 1, Failures: 0, Errors: 0, Skipped: 0, Time elapsed: 0.581 sec
Running org.apache.activemq.broker.CreateDestinationsOnStartupViaXBeanTest
Tests run: 1, Failures: 0, Errors: 0, Skipped: 0, Time elapsed: 2.322 sec
Running org.apache.activemq.broker.DedicatedTaskRunnerBrokerTest
Tests run: 129, Failures: 0, Errors: 0, Skipped: 0, Time elapsed: 21.338 sec
Running org.apache.activemq.broker.DoubleSubscriptionTest
Tests run: 1, Failures: 0, Errors: 0, Skipped: 0, Time elapsed: 2.536 sec
Running org.apache.activemq.broker.DurablePersistentFalseRestartTest
Tests run: 1, Failures: 0, Errors: 0, Skipped: 0, Time elapsed: 6.728 sec
Running org.apache.activemq.broker.JdbcXARecoveryBrokerTest
Tests run: 16, Failures: 0, Errors: 0, Skipped: 0, Time elapsed: 183.9 sec
Running org.apache.activemq.broker.MessageExpirationTest
Tests run: 13, Failures: 0, Errors: 0, Skipped: 0, Time elapsed: 22.145 sec
Running org.apache.activemq.broker.OutOfOrderXMLTest
Tests run: 1, Failures: 0, Errors: 0, Skipped: 0, Time elapsed: 1.532 sec
Running org.apache.activemq.broker.QueueMbeanRestartTest
Tests run: 2, Failures: 0, Errors: 0, Skipped: 0, Time elapsed: 15.919 sec
Running org.apache.activemq.broker.QueueSubscriptionTest
Tests run: 8, Failures: 0, Errors: 0, Skipped: 0, Time elapsed: 4.97 sec
Running org.apache.activemq.broker.ReconnectWithJMXEnabledTest
Tests run: 1, Failures: 0, Errors: 0, Skipped: 0, Time elapsed: 4.612 sec
Running org.apache.activemq.broker.RecoveryBrokerTest
Tests run: 9, Failures: 0, Errors: 0, Skipped: 0, Time elapsed: 30.05 sec
Running org.apache.activemq.broker.RedeliveryRestartTest
Tests run: 2, Failures: 0, Errors: 0, Skipped: 0, Time elapsed: 14.015 sec
Running org.apache.activemq.broker.SpringTest
Tests run: 1, Failures: 0, Errors: 0, Skipped: 0, Time elapsed: 2.846 sec
Running org.apache.activemq.broker.TopicSubscriptionTest
Tests run: 8, Failures: 0, Errors: 0, Skipped: 0, Time elapsed: 6.504 sec
Running org.apache.activemq.broker.XARecoveryBrokerTest
Tests run: 16, Failures: 0, Errors: 0, Skipped: 0, Time elapsed: 77.076 sec
Running org.apache.activemq.broker.advisory.AdvisoryBrokerTest
Tests run: 6, Failures: 0, Errors: 0, Skipped: 0, Time elapsed: 0.838 sec
Running org.apache.activemq.broker.advisory.AdvisoryDuplexNetworkBridgeTest
Tests run: 2, Failures: 0, Errors: 0, Skipped: 0, Time elapsed: 14.111 sec
Running org.apache.activemq.broker.advisory.AdvisoryJmxTest
Tests run: 1, Failures: 0, Errors: 0, Skipped: 0, Time elapsed: 0.711 sec
Running org.apache.activemq.broker.advisory.AdvisoryNetworkBridgeTest
Tests run: 2, Failures: 0, Errors: 0, Skipped: 0, Time elapsed: 10.803 sec
Running org.apache.activemq.broker.ft.DbRestartJDBCQueueMasterSlaveLeaseQuiesceTest
Running org.apache.activemq.broker.ft.DbRestartJDBCQueueMasterSlaveLeaseTest
Tests run: 2, Failures: 0, Errors: 0, Skipped: 0, Time elapsed: 61.17 sec
Running org.apache.activemq.broker.ft.DbRestartJDBCQueueMasterSlaveTest
Running org.apache.activemq.broker.ft.JDBCQueueMasterSlaveTest
Tests run: 2, Failures: 0, Errors: 0, Skipped: 0, Time elapsed: 56.19 sec
Running org.apache.activemq.broker.ft.MasterSlaveProducerFlowControlTest
Tests run: 6, Failures: 0, Errors: 0, Skipped: 0, Time elapsed: 25.661 sec
Running org.apache.activemq.broker.ft.MasterSlaveSlaveDieTest
Tests run: 1, Failures: 0, Errors: 0, Skipped: 0, Time elapsed: 2.547 sec
Running org.apache.activemq.broker.ft.MasterSlaveSlaveShutdownTest
Tests run: 1, Failures: 0, Errors: 0, Skipped: 0, Time elapsed: 32.354 sec
Running org.apache.activemq.broker.ft.QueueMasterSlaveSingleUrlTest
Tests run: 2, Failures: 0, Errors: 0, Skipped: 0, Time elapsed: 17.202 sec
Running org.apache.activemq.broker.ft.QueueMasterSlaveTest
Tests run: 2, Failures: 0, Errors: 0, Skipped: 0, Time elapsed: 24.94 sec
Running org.apache.activemq.broker.ft.QueueMasterSlaveTestUsingSharedFileTest
Tests run: 2, Failures: 0, Errors: 0, Skipped: 0, Time elapsed: 40.099 sec
Running org.apache.activemq.broker.ft.QueueMasterSlaveUsingMasterConnectorElementCompositeQueueTest
Tests run: 2, Failures: 0, Errors: 0, Skipped: 0, Time elapsed: 39.293 sec
Running org.apache.activemq.broker.ft.QueueMasterSlaveUsingMasterConnectorElementTest
Tests run: 2, Failures: 0, Errors: 0, Skipped: 0, Time elapsed: 26.717 sec
Running org.apache.activemq.broker.ft.TopicMasterSlaveTest
Tests run: 2, Failures: 0, Errors: 0, Skipped: 0, Time elapsed: 28.657 sec
Running org.apache.activemq.broker.ft.TransactedTopicMasterSlaveTest
Tests run: 15, Failures: 0, Errors: 0, Skipped: 0, Time elapsed: 89.768 sec
Running org.apache.activemq.broker.jmx.BrokerViewSlowStoreStartupTest
Tests run: 1, Failures: 0, Errors: 0, Skipped: 0, Time elapsed: 1.417 sec
Running org.apache.activemq.broker.jmx.MBeanOperationTimeoutTest
Tests run: 1, Failures: 0, Errors: 0, Skipped: 0, Time elapsed: 35.171 sec
Running org.apache.activemq.broker.jmx.MBeanTest
Tests run: 19, Failures: 0, Errors: 0, Skipped: 0, Time elapsed: 55.082 sec
Running org.apache.activemq.broker.jmx.PurgeTest
Tests run: 5, Failures: 0, Errors: 0, Skipped: 0, Time elapsed: 93.454 sec
Running org.apache.activemq.broker.jmx.TransportConnectorMBeanTest
Tests run: 2, Failures: 0, Errors: 0, Skipped: 0, Time elapsed: 4.683 sec
Running org.apache.activemq.broker.mKahaDBXARecoveryBrokerTest
Tests run: 16, Failures: 0, Errors: 0, Skipped: 0, Time elapsed: 88.372 sec
Running org.apache.activemq.broker.message.security.MessageAuthenticationTest
Tests run: 1, Failures: 0, Errors: 0, Skipped: 0, Time elapsed: 0.701 sec
Running org.apache.activemq.broker.policy.AbortSlowConsumerTest
Tests run: 19, Failures: 0, Errors: 0, Skipped: 0, Time elapsed: 136.893 sec
Running org.apache.activemq.broker.policy.DeadLetterTest
Tests run: 4, Failures: 0, Errors: 0, Skipped: 0, Time elapsed: 2.721 sec
Running org.apache.activemq.broker.policy.DestinationCursorConfigTest
Tests run: 2, Failures: 0, Errors: 0, Skipped: 0, Time elapsed: 2.286 sec
Running org.apache.activemq.broker.policy.IndividualDeadLetterTest
Tests run: 5, Failures: 0, Errors: 0, Skipped: 0, Time elapsed: 46.153 sec
Running org.apache.activemq.broker.policy.IndividualDeadLetterViaXmlTest
Tests run: 4, Failures: 0, Errors: 0, Skipped: 0, Time elapsed: 4.166 sec
Running org.apache.activemq.broker.policy.MessageListenerDeadLetterTest
Tests run: 4, Failures: 1, Errors: 0, Skipped: 0, Time elapsed: 9.835 sec <<< FAILURE!
testDurableTopicMessage(org.apache.activemq.broker.policy.MessageListenerDeadLetterTest) Time elapsed: 7269 sec <<< FAILURE!
junit.framework.AssertionFailedError: No message received for index: 156
at junit.framework.Assert.fail(Assert.java:50)
at junit.framework.Assert.assertTrue(Assert.java:20)
at junit.framework.Assert.assertNotNull(Assert.java:218)
at org.apache.activemq.broker.policy.DeadLetterTestSupport.assertMessage(DeadLetterTestSupport.java:151)
at org.apache.activemq.broker.policy.MessageListenerDeadLetterTest.doTest(MessageListenerDeadLetterTest.java:67)
at org.apache.activemq.broker.policy.DeadLetterTestSupport.testDurableTopicMessage(DeadLetterTestSupport.java:170)
at sun.reflect.NativeMethodAccessorImpl.invoke0(Native Method)
at sun.reflect.NativeMethodAccessorImpl.invoke(NativeMethodAccessorImpl.java:57)
at sun.reflect.DelegatingMethodAccessorImpl.invoke(DelegatingMethodAccessorImpl.java:43)
at java.lang.reflect.Method.invoke(Method.java:601)
at junit.framework.TestCase.runTest(TestCase.java:168)
at junit.framework.TestCase.runBare(TestCase.java:134)
at org.apache.activemq.CombinationTestSupport.runBare(CombinationTestSupport.java:90)
at org.apache.activemq.CombinationTestSupport.runBare(CombinationTestSupport.java:96)
at junit.framework.TestResult$1.protect(TestResult.java:110)
at junit.framework.TestResult.runProtected(TestResult.java:128)
at junit.framework.TestResult.run(TestResult.java:113)
at junit.framework.TestCase.run(TestCase.java:124)
at junit.framework.TestSuite.runTest(TestSuite.java:243)
at junit.framework.TestSuite.run(TestSuite.java:238)
at org.junit.internal.runners.JUnit38ClassRunner.run(JUnit38ClassRunner.java:83)
at org.apache.maven.surefire.junit4.JUnit4Provider.execute(JUnit4Provider.java:252)
at org.apache.maven.surefire.junit4.JUnit4Provider.executeTestSet(JUnit4Provider.java:141)
at org.apache.maven.surefire.junit4.JUnit4Provider.invoke(JUnit4Provider.java:112)
at sun.reflect.NativeMethodAccessorImpl.invoke0(Native Method)
at sun.reflect.NativeMethodAccessorImpl.invoke(NativeMethodAccessorImpl.java:57)
at sun.reflect.DelegatingMethodAccessorImpl.invoke(DelegatingMethodAccessorImpl.java:43)
at java.lang.reflect.Method.invoke(Method.java:601)
at org.apache.maven.surefire.util.ReflectionUtils.invokeMethodWithArray(ReflectionUtils.java:189)
at org.apache.maven.surefire.booter.ProviderFactory$ProviderProxy.invoke(ProviderFactory.java:165)
at org.apache.maven.surefire.booter.ProviderFactory.invokeProvider(ProviderFactory.java:85)
at org.apache.maven.surefire.booter.ForkedBooter.runSuitesInProcess(ForkedBooter.java:115)
at org.apache.maven.surefire.booter.ForkedBooter.main(ForkedBooter.java:75)
Running org.apache.activemq.broker.policy.NoConsumerDeadLetterTest
Tests run: 5, Failures: 0, Errors: 0, Skipped: 0, Time elapsed: 1.843 sec
Running org.apache.activemq.broker.policy.NoRetryDeadLetterTest
Tests run: 4, Failures: 0, Errors: 0, Skipped: 0, Time elapsed: 2.279 sec
Running org.apache.activemq.broker.policy.PerDurableConsumerDeadLetterTest
Tests run: 4, Failures: 0, Errors: 0, Skipped: 0, Time elapsed: 2.789 sec
Running org.apache.activemq.broker.policy.PriorityNetworkDispatchPolicyTest
Tests run: 1, Failures: 0, Errors: 0, Skipped: 0, Time elapsed: 0.204 sec
Running org.apache.activemq.broker.policy.RoundRobinDispatchPolicyTest
Tests run: 9, Failures: 0, Errors: 0, Skipped: 0, Time elapsed: 3.725 sec
Running org.apache.activemq.broker.policy.SimpleDispatchPolicyTest
Tests run: 8, Failures: 0, Errors: 0, Skipped: 0, Time elapsed: 3.594 sec
Running org.apache.activemq.broker.policy.StrictOrderDispatchPolicyTest
Tests run: 8, Failures: 0, Errors: 0, Skipped: 0, Time elapsed: 6.092 sec
Running org.apache.activemq.broker.region.DestinationGCTest
Tests run: 2, Failures: 0, Errors: 0, Skipped: 0, Time elapsed: 13.734 sec
Running org.apache.activemq.broker.region.DestinationRemoveRestartTest
Results :
Failed tests: testDurableTopicMessage(org.apache.activemq.broker.policy.MessageListenerDeadLetterTest): No message received for index: 156
Tests in error:
testCreateTcpConnectionUsingAllocatedPort(org.apache.activemq.ActiveMQXAConnectionFactoryTest): org.apache.activemq:BrokerName=localhost,Type=Broker
Tests run: 1066, Failures: 1, Errors: 1, Skipped: 0
mojoFailed org.apache.maven.plugins:maven-surefire-plugin:2.12.3(default-test)
[JENKINS] Recording test results
Tests run: 2, Failures: 0, Errors: 0, Skipped: 0, Time elapsed: 24.417 sec
projectFailed org.apache.activemq:activemq-core:5.7-SNAPSHOT
Build failed in Jenkins: ActiveMQ-Java7 » ActiveMQ :: Core #18
Posted by Apache Jenkins Server <je...@builds.apache.org>.
See <https://builds.apache.org/job/ActiveMQ-Java7/org.apache.activemq$activemq-core/18/changes>
Changes:
[gtully] ensure async dispatches temp advisory is present before verfication of temp usage
------------------------------------------
[...truncated 233 lines...]
Running org.apache.activemq.advisory.ConsumerListenerTest
Tests run: 2, Failures: 0, Errors: 0, Skipped: 0, Time elapsed: 0.767 sec
Running org.apache.activemq.advisory.DestinationListenerTest
Tests run: 3, Failures: 0, Errors: 0, Skipped: 0, Time elapsed: 7.992 sec
Running org.apache.activemq.advisory.MasterSlaveTempQueueMemoryTest
Tests run: 6, Failures: 0, Errors: 0, Skipped: 0, Time elapsed: 42.646 sec
Running org.apache.activemq.advisory.ProducerListenerTest
Tests run: 2, Failures: 0, Errors: 0, Skipped: 0, Time elapsed: 0.868 sec
Running org.apache.activemq.advisory.TempDestDeleteTest
Tests run: 2, Failures: 0, Errors: 0, Skipped: 0, Time elapsed: 0.882 sec
Running org.apache.activemq.advisory.TempDestLoadTest
Tests run: 2, Failures: 0, Errors: 0, Skipped: 0, Time elapsed: 21.205 sec
Running org.apache.activemq.advisory.TempQueueMemoryTest
Tests run: 2, Failures: 0, Errors: 0, Skipped: 0, Time elapsed: 21.022 sec
Running org.apache.activemq.blob.BlobTransferPolicyUriTest
Tests run: 1, Failures: 0, Errors: 0, Skipped: 0, Time elapsed: 0.146 sec
Running org.apache.activemq.blob.FTPBlobDownloadStrategyTest
Tests run: 3, Failures: 0, Errors: 0, Skipped: 0, Time elapsed: 1.801 sec
Running org.apache.activemq.blob.FTPBlobTest
Tests run: 1, Failures: 0, Errors: 0, Skipped: 0, Time elapsed: 2.12 sec
Running org.apache.activemq.blob.FTPBlobUploadStrategyTest
Tests run: 2, Failures: 0, Errors: 0, Skipped: 0, Time elapsed: 1.001 sec
Running org.apache.activemq.blob.FilesystemBlobTest
Tests run: 1, Failures: 0, Errors: 0, Skipped: 0, Time elapsed: 1.742 sec
Running org.apache.activemq.broker.BrokerRedeliveryTest
Tests run: 1, Failures: 0, Errors: 0, Skipped: 0, Time elapsed: 8.769 sec
Running org.apache.activemq.broker.BrokerServiceTest
Tests run: 5, Failures: 0, Errors: 0, Skipped: 0, Time elapsed: 4.618 sec
Running org.apache.activemq.broker.BrokerTest
Tests run: 129, Failures: 0, Errors: 0, Skipped: 0, Time elapsed: 22.12 sec
Running org.apache.activemq.broker.ConcurrentConnectSimulationTest
Tests run: 1, Failures: 0, Errors: 0, Skipped: 0, Time elapsed: 0.551 sec
Running org.apache.activemq.broker.CreateDestinationsOnStartupViaXBeanTest
Tests run: 1, Failures: 0, Errors: 0, Skipped: 0, Time elapsed: 2.362 sec
Running org.apache.activemq.broker.DedicatedTaskRunnerBrokerTest
Tests run: 129, Failures: 0, Errors: 0, Skipped: 0, Time elapsed: 21.06 sec
Running org.apache.activemq.broker.DoubleSubscriptionTest
Tests run: 1, Failures: 0, Errors: 0, Skipped: 0, Time elapsed: 2.475 sec
Running org.apache.activemq.broker.DurablePersistentFalseRestartTest
Tests run: 1, Failures: 0, Errors: 0, Skipped: 0, Time elapsed: 6.645 sec
Running org.apache.activemq.broker.JdbcXARecoveryBrokerTest
Tests run: 16, Failures: 0, Errors: 0, Skipped: 0, Time elapsed: 59.561 sec
Running org.apache.activemq.broker.MessageExpirationTest
Tests run: 13, Failures: 0, Errors: 0, Skipped: 0, Time elapsed: 22.033 sec
Running org.apache.activemq.broker.OutOfOrderXMLTest
Tests run: 1, Failures: 0, Errors: 0, Skipped: 0, Time elapsed: 1.182 sec
Running org.apache.activemq.broker.QueueMbeanRestartTest
Tests run: 2, Failures: 0, Errors: 0, Skipped: 0, Time elapsed: 3.503 sec
Running org.apache.activemq.broker.QueueSubscriptionTest
Tests run: 8, Failures: 0, Errors: 0, Skipped: 0, Time elapsed: 3.115 sec
Running org.apache.activemq.broker.ReconnectWithJMXEnabledTest
Tests run: 1, Failures: 0, Errors: 0, Skipped: 0, Time elapsed: 4.554 sec
Running org.apache.activemq.broker.RecoveryBrokerTest
Tests run: 9, Failures: 0, Errors: 0, Skipped: 0, Time elapsed: 25.258 sec
Running org.apache.activemq.broker.RedeliveryRestartTest
Tests run: 2, Failures: 0, Errors: 0, Skipped: 0, Time elapsed: 10.538 sec
Running org.apache.activemq.broker.SpringTest
Tests run: 1, Failures: 0, Errors: 0, Skipped: 0, Time elapsed: 2.657 sec
Running org.apache.activemq.broker.TopicSubscriptionTest
Tests run: 8, Failures: 0, Errors: 0, Skipped: 0, Time elapsed: 3.071 sec
Running org.apache.activemq.broker.XARecoveryBrokerTest
Tests run: 16, Failures: 0, Errors: 0, Skipped: 0, Time elapsed: 66.875 sec
Running org.apache.activemq.broker.advisory.AdvisoryBrokerTest
Tests run: 6, Failures: 0, Errors: 0, Skipped: 0, Time elapsed: 0.889 sec
Running org.apache.activemq.broker.advisory.AdvisoryDuplexNetworkBridgeTest
Tests run: 2, Failures: 0, Errors: 0, Skipped: 0, Time elapsed: 11.007 sec
Running org.apache.activemq.broker.advisory.AdvisoryJmxTest
Tests run: 1, Failures: 0, Errors: 0, Skipped: 0, Time elapsed: 0.726 sec
Running org.apache.activemq.broker.advisory.AdvisoryNetworkBridgeTest
Tests run: 2, Failures: 0, Errors: 0, Skipped: 0, Time elapsed: 10.559 sec
Running org.apache.activemq.broker.ft.DbRestartJDBCQueueMasterSlaveLeaseQuiesceTest
Tests run: 3, Failures: 0, Errors: 0, Skipped: 0, Time elapsed: 40.227 sec
Running org.apache.activemq.broker.ft.DbRestartJDBCQueueMasterSlaveLeaseTest
Tests run: 2, Failures: 0, Errors: 0, Skipped: 0, Time elapsed: 23.501 sec
Running org.apache.activemq.broker.ft.DbRestartJDBCQueueMasterSlaveTest
Running org.apache.activemq.broker.ft.JDBCQueueMasterSlaveTest
Tests run: 2, Failures: 0, Errors: 0, Skipped: 0, Time elapsed: 14.62 sec
Running org.apache.activemq.broker.ft.MasterSlaveProducerFlowControlTest
Tests run: 6, Failures: 0, Errors: 0, Skipped: 0, Time elapsed: 25.651 sec
Running org.apache.activemq.broker.ft.MasterSlaveSlaveDieTest
Tests run: 1, Failures: 0, Errors: 0, Skipped: 0, Time elapsed: 2.438 sec
Running org.apache.activemq.broker.ft.MasterSlaveSlaveShutdownTest
Tests run: 1, Failures: 0, Errors: 0, Skipped: 0, Time elapsed: 32.322 sec
Running org.apache.activemq.broker.ft.QueueMasterSlaveSingleUrlTest
Tests run: 2, Failures: 0, Errors: 0, Skipped: 0, Time elapsed: 14.75 sec
Running org.apache.activemq.broker.ft.QueueMasterSlaveTest
Tests run: 2, Failures: 0, Errors: 0, Skipped: 0, Time elapsed: 13.132 sec
Running org.apache.activemq.broker.ft.QueueMasterSlaveTestUsingSharedFileTest
Tests run: 2, Failures: 0, Errors: 0, Skipped: 0, Time elapsed: 27.234 sec
Running org.apache.activemq.broker.ft.QueueMasterSlaveUsingMasterConnectorElementCompositeQueueTest
Tests run: 2, Failures: 0, Errors: 0, Skipped: 0, Time elapsed: 13.431 sec
Running org.apache.activemq.broker.ft.QueueMasterSlaveUsingMasterConnectorElementTest
Tests run: 2, Failures: 0, Errors: 0, Skipped: 0, Time elapsed: 13.255 sec
Running org.apache.activemq.broker.ft.TopicMasterSlaveTest
Tests run: 2, Failures: 0, Errors: 0, Skipped: 0, Time elapsed: 13.2 sec
Running org.apache.activemq.broker.ft.TransactedTopicMasterSlaveTest
Tests run: 15, Failures: 0, Errors: 0, Skipped: 0, Time elapsed: 75.652 sec
Running org.apache.activemq.broker.jmx.BrokerViewSlowStoreStartupTest
Tests run: 1, Failures: 0, Errors: 0, Skipped: 0, Time elapsed: 1.085 sec
Running org.apache.activemq.broker.jmx.MBeanOperationTimeoutTest
Tests run: 1, Failures: 0, Errors: 0, Skipped: 0, Time elapsed: 8.663 sec
Running org.apache.activemq.broker.jmx.MBeanTest
Tests run: 19, Failures: 0, Errors: 0, Skipped: 0, Time elapsed: 54.901 sec
Running org.apache.activemq.broker.jmx.PurgeTest
Tests run: 5, Failures: 0, Errors: 0, Skipped: 0, Time elapsed: 17.965 sec
Running org.apache.activemq.broker.jmx.TransportConnectorMBeanTest
Tests run: 2, Failures: 0, Errors: 0, Skipped: 0, Time elapsed: 4.618 sec
Running org.apache.activemq.broker.mKahaDBXARecoveryBrokerTest
Tests run: 16, Failures: 0, Errors: 0, Skipped: 0, Time elapsed: 68.822 sec
Running org.apache.activemq.broker.message.security.MessageAuthenticationTest
Tests run: 1, Failures: 0, Errors: 0, Skipped: 0, Time elapsed: 0.824 sec
Running org.apache.activemq.broker.policy.AbortSlowConsumerTest
Tests run: 19, Failures: 0, Errors: 0, Skipped: 0, Time elapsed: 268.977 sec
Running org.apache.activemq.broker.policy.DeadLetterTest
Tests run: 4, Failures: 0, Errors: 0, Skipped: 0, Time elapsed: 2.722 sec
Running org.apache.activemq.broker.policy.DestinationCursorConfigTest
Tests run: 2, Failures: 0, Errors: 0, Skipped: 0, Time elapsed: 1.394 sec
Running org.apache.activemq.broker.policy.IndividualDeadLetterTest
Tests run: 5, Failures: 0, Errors: 0, Skipped: 0, Time elapsed: 4.958 sec
Running org.apache.activemq.broker.policy.IndividualDeadLetterViaXmlTest
Tests run: 4, Failures: 0, Errors: 0, Skipped: 0, Time elapsed: 3.951 sec
Running org.apache.activemq.broker.policy.MessageListenerDeadLetterTest
Tests run: 4, Failures: 0, Errors: 0, Skipped: 0, Time elapsed: 3.554 sec
Running org.apache.activemq.broker.policy.NoConsumerDeadLetterTest
Tests run: 5, Failures: 0, Errors: 0, Skipped: 0, Time elapsed: 2.024 sec
Running org.apache.activemq.broker.policy.NoRetryDeadLetterTest
Tests run: 4, Failures: 0, Errors: 0, Skipped: 0, Time elapsed: 1.293 sec
Running org.apache.activemq.broker.policy.PerDurableConsumerDeadLetterTest
Tests run: 4, Failures: 0, Errors: 0, Skipped: 0, Time elapsed: 2.749 sec
Running org.apache.activemq.broker.policy.PriorityNetworkDispatchPolicyTest
Tests run: 1, Failures: 0, Errors: 0, Skipped: 0, Time elapsed: 0.163 sec
Running org.apache.activemq.broker.policy.RoundRobinDispatchPolicyTest
Tests run: 9, Failures: 0, Errors: 0, Skipped: 0, Time elapsed: 3.65 sec
Running org.apache.activemq.broker.policy.SimpleDispatchPolicyTest
Tests run: 8, Failures: 0, Errors: 0, Skipped: 0, Time elapsed: 3.618 sec
Running org.apache.activemq.broker.policy.StrictOrderDispatchPolicyTest
Tests run: 8, Failures: 0, Errors: 0, Skipped: 0, Time elapsed: 3.036 sec
Running org.apache.activemq.broker.region.DestinationGCTest
Tests run: 2, Failures: 0, Errors: 0, Skipped: 0, Time elapsed: 14.816 sec
Running org.apache.activemq.broker.region.DestinationRemoveRestartTest
Tests run: 2, Failures: 0, Errors: 0, Skipped: 0, Time elapsed: 3.308 sec
Running org.apache.activemq.broker.region.QueueDuplicatesFromStoreTest
Tests run: 2, Failures: 0, Errors: 0, Skipped: 0, Time elapsed: 7.242 sec
Running org.apache.activemq.broker.region.QueueOptimizedDispatchExceptionTest
Tests run: 1, Failures: 0, Errors: 0, Skipped: 0, Time elapsed: 0.358 sec
Running org.apache.activemq.broker.region.QueuePurgeTest
Tests run: 3, Failures: 0, Errors: 0, Skipped: 0, Time elapsed: 87.833 sec
Running org.apache.activemq.broker.region.UniquePropertyMessageEvictionStrategyTest
Tests run: 1, Failures: 0, Errors: 0, Skipped: 0, Time elapsed: 11.859 sec
Running org.apache.activemq.broker.region.cursors.CursorDurableTest
Tests run: 2, Failures: 0, Errors: 0, Skipped: 0, Time elapsed: 4.166 sec
Running org.apache.activemq.broker.region.cursors.CursorQueueStoreTest
Tests run: 5, Failures: 0, Errors: 0, Skipped: 0, Time elapsed: 103.428 sec
Running org.apache.activemq.broker.region.cursors.FilePendingMessageCursorTest
Tests run: 2, Failures: 0, Errors: 0, Skipped: 0, Time elapsed: 2.08 sec
Running org.apache.activemq.broker.region.cursors.NegativeQueueTest
Tests run: 4, Failures: 0, Errors: 0, Skipped: 0, Time elapsed: 101.778 sec
Running org.apache.activemq.broker.region.cursors.OrderPendingListTest
Tests run: 9, Failures: 0, Errors: 0, Skipped: 0, Time elapsed: 0.264 sec
Running org.apache.activemq.broker.region.cursors.PrioritizedPendingListTest
Tests run: 7, Failures: 0, Errors: 0, Skipped: 0, Time elapsed: 0.272 sec
Running org.apache.activemq.broker.region.cursors.StoreBasedCursorTest
Tests run: 5, Failures: 0, Errors: 0, Skipped: 0, Time elapsed: 14.363 sec
Running org.apache.activemq.broker.region.cursors.StoreQueueCursorJDBCNoDuplicateTest
Tests run: 1, Failures: 0, Errors: 0, Skipped: 0, Time elapsed: 2.627 sec
Running org.apache.activemq.broker.region.cursors.StoreQueueCursorJournalNoDuplicateTest
Tests run: 1, Failures: 0, Errors: 0, Skipped: 0, Time elapsed: 0.533 sec
Running org.apache.activemq.broker.region.cursors.StoreQueueCursorKahaDBNoDuplicateTest
Tests run: 1, Failures: 0, Errors: 0, Skipped: 0, Time elapsed: 0.996 sec
Running org.apache.activemq.broker.region.cursors.StoreQueueCursorMemoryNoDuplicateTest
Tests run: 1, Failures: 0, Errors: 0, Skipped: 0, Time elapsed: 0.384 sec
Running org.apache.activemq.broker.region.cursors.StoreQueueCursorNoDuplicateTest
Tests run: 1, Failures: 0, Errors: 0, Skipped: 0, Time elapsed: 1 sec
Running org.apache.activemq.broker.region.group.MessageGroupHashBucketTest
Tests run: 2, Failures: 0, Errors: 0, Skipped: 0, Time elapsed: 0.025 sec
Running org.apache.activemq.broker.region.group.MessageGroupMapTest
Tests run: 2, Failures: 0, Errors: 0, Skipped: 0, Time elapsed: 0.024 sec
Running org.apache.activemq.broker.region.group.MessageGroupTest
Tests run: 3, Failures: 0, Errors: 0, Skipped: 0, Time elapsed: 1.275 sec
Running org.apache.activemq.broker.scheduler.CronParserTest
Tests run: 13, Failures: 0, Errors: 0, Skipped: 0, Time elapsed: 0.159 sec
Running org.apache.activemq.broker.scheduler.JmsCronSchedulerTest
Tests run: 2, Failures: 0, Errors: 0, Skipped: 0, Time elapsed: 198.014 sec
Running org.apache.activemq.broker.scheduler.JmsSchedulerTest
Tests run: 5, Failures: 0, Errors: 0, Skipped: 0, Time elapsed: 86.574 sec
Running org.apache.activemq.broker.scheduler.JobSchedulerManagementTest
Tests run: 7, Failures: 0, Errors: 0, Skipped: 0, Time elapsed: 75.846 sec
Running org.apache.activemq.broker.scheduler.JobSchedulerStoreTest
Tests run: 1, Failures: 0, Errors: 0, Skipped: 0, Time elapsed: 2.255 sec
Running org.apache.activemq.broker.scheduler.JobSchedulerTest
Tests run: 9, Failures: 0, Errors: 0, Skipped: 0, Time elapsed: 36.784 sec
Running org.apache.activemq.broker.store.DefaultStoreRecoveryBrokerTest
Tests run: 9, Failures: 0, Errors: 0, Skipped: 0, Time elapsed: 27.781 sec
Running org.apache.activemq.broker.store.RecoverExpiredMessagesTest
Tests run: 4, Failures: 0, Errors: 0, Skipped: 0, Time elapsed: 30.043 sec
Running org.apache.activemq.broker.store.TransactionStoreTest
Tests run: 1, Failures: 0, Errors: 0, Skipped: 0, Time elapsed: 0.282 sec
Running org.apache.activemq.broker.util.PluginBrokerTest
Tests run: 1, Failures: 0, Errors: 0, Skipped: 0, Time elapsed: 2.311 sec
Running org.apache.activemq.broker.util.RedeliveryPluginTest
Tests run: 1, Failures: 0, Errors: 0, Skipped: 0, Time elapsed: 0.147 sec
Running org.apache.activemq.broker.util.TimeStampingBrokerPluginTest
Tests run: 3, Failures: 0, Errors: 0, Skipped: 0, Time elapsed: 6.687 sec
Running org.apache.activemq.broker.util.TraceBrokerPathPluginTest
Tests run: 1, Failures: 0, Errors: 0, Skipped: 0, Time elapsed: 2.802 sec
Running org.apache.activemq.broker.virtual.CompositeQueueTest
Tests run: 1, Failures: 0, Errors: 0, Skipped: 0, Time elapsed: 1.09 sec
Running org.apache.activemq.broker.virtual.CompositeTopicTest
Tests run: 1, Failures: 0, Errors: 0, Skipped: 0, Time elapsed: 1.998 sec
Running org.apache.activemq.broker.virtual.FilteredQueueTest
Tests run: 1, Failures: 0, Errors: 0, Skipped: 0, Time elapsed: 1.751 sec
Running org.apache.activemq.broker.virtual.MirroredQueueCorrectMemoryUsageTest
Tests run: 1, Failures: 0, Errors: 0, Skipped: 0, Time elapsed: 8.958 sec
Running org.apache.activemq.broker.virtual.MirroredQueueTest
Tests run: 2, Failures: 0, Errors: 0, Skipped: 0, Time elapsed: 0.847 sec
Running org.apache.activemq.broker.virtual.MirroredQueueUsingVirtualTopicQueueTest
Tests run: 2, Failures: 0, Errors: 0, Skipped: 0, Time elapsed: 0.893 sec
Running org.apache.activemq.broker.virtual.VirtualTopicDLQTest
Tests run: 1, Failures: 0, Errors: 0, Skipped: 0, Time elapsed: 7.418 sec
Running org.apache.activemq.broker.virtual.VirtualTopicDisconnectSelectorTest
Tests run: 1, Failures: 0, Errors: 0, Skipped: 0, Time elapsed: 2.114 sec
Running org.apache.activemq.broker.virtual.VirtualTopicPubSubTest
Tests run: 2, Failures: 0, Errors: 0, Skipped: 0, Time elapsed: 2.906 sec
Running org.apache.activemq.broker.virtual.VirtualTopicPubSubUsingXBeanTest
Tests run: 2, Failures: 0, Errors: 0, Skipped: 0, Time elapsed: 1.077 sec
Running org.apache.activemq.broker.virtual.VirtualTopicSelectorTest
Tests run: 1, Failures: 0, Errors: 0, Skipped: 0, Time elapsed: 0.888 sec
Running org.apache.activemq.broker.virtual.VirtualTopicsAndDurableSubsTest
Tests run: 20, Failures: 0, Errors: 0, Skipped: 0, Time elapsed: 49.007 sec
Running org.apache.activemq.bugs.AMQ1687Test
Tests run: 1, Failures: 0, Errors: 0, Skipped: 0, Time elapsed: 2.584 sec
Running org.apache.activemq.bugs.AMQ1853Test
Tests run: 1, Failures: 0, Errors: 0, Skipped: 0, Time elapsed: 7.389 sec
Running org.apache.activemq.bugs.AMQ1893Test
Tests run: 1, Failures: 0, Errors: 0, Skipped: 0, Time elapsed: 18.721 sec
Running org.apache.activemq.bugs.AMQ1917Test
Tests run: 1, Failures: 0, Errors: 0, Skipped: 0, Time elapsed: 4.753 sec
Running org.apache.activemq.bugs.AMQ1936Test
Tests run: 1, Failures: 0, Errors: 0, Skipped: 0, Time elapsed: 39.226 sec
Running org.apache.activemq.bugs.AMQ2021Test
Results :
Tests run: 1221, Failures: 0, Errors: 0, Skipped: 0
mojoFailed org.apache.maven.plugins:maven-surefire-plugin:2.12.3(default-test)
[JENKINS] Recording test results
Tests run: 1, Failures: 0, Errors: 0, Skipped: 0, Time elapsed: 5.261 sec
projectFailed org.apache.activemq:activemq-core:5.7-SNAPSHOT
Build failed in Jenkins: ActiveMQ-Java7 » ActiveMQ :: Core #17
Posted by Apache Jenkins Server <je...@builds.apache.org>.
See <https://builds.apache.org/job/ActiveMQ-Java7/org.apache.activemq$activemq-core/17/changes>
Changes:
[gtully] add validation of request/reply over network with temp topic replyto, fine with duplex network connectors
[gtully] move http network test to options module so it can be run
[tabish] fix and tests for: https://issues.apache.org/jira/browse/AMQ-4083
Revert previous fix. We need to ack each expired message when we detect and not overload the usage of delivered acks for extending the prefetch window. The problem was an edge case where the broker detected a message as expired after the client had delivered it but before it ack'd it as consumed.
------------------------------------------
[...truncated 237 lines...]
Running org.apache.activemq.advisory.MasterSlaveTempQueueMemoryTest
Tests run: 6, Failures: 0, Errors: 0, Skipped: 0, Time elapsed: 44.665 sec
Running org.apache.activemq.advisory.ProducerListenerTest
Tests run: 2, Failures: 0, Errors: 0, Skipped: 0, Time elapsed: 0.764 sec
Running org.apache.activemq.advisory.TempDestDeleteTest
Tests run: 2, Failures: 0, Errors: 0, Skipped: 0, Time elapsed: 0.823 sec
Running org.apache.activemq.advisory.TempDestLoadTest
Tests run: 2, Failures: 0, Errors: 0, Skipped: 0, Time elapsed: 19.166 sec
Running org.apache.activemq.advisory.TempQueueMemoryTest
Tests run: 2, Failures: 0, Errors: 0, Skipped: 0, Time elapsed: 20.608 sec
Running org.apache.activemq.blob.BlobTransferPolicyUriTest
Tests run: 1, Failures: 0, Errors: 0, Skipped: 0, Time elapsed: 0.186 sec
Running org.apache.activemq.blob.FTPBlobDownloadStrategyTest
Tests run: 3, Failures: 0, Errors: 0, Skipped: 0, Time elapsed: 1.843 sec
Running org.apache.activemq.blob.FTPBlobTest
Tests run: 1, Failures: 0, Errors: 0, Skipped: 0, Time elapsed: 2.031 sec
Running org.apache.activemq.blob.FTPBlobUploadStrategyTest
Tests run: 2, Failures: 0, Errors: 0, Skipped: 0, Time elapsed: 1.002 sec
Running org.apache.activemq.blob.FilesystemBlobTest
Tests run: 1, Failures: 0, Errors: 0, Skipped: 0, Time elapsed: 1.729 sec
Running org.apache.activemq.broker.BrokerRedeliveryTest
Tests run: 1, Failures: 0, Errors: 0, Skipped: 0, Time elapsed: 8.407 sec
Running org.apache.activemq.broker.BrokerServiceTest
Tests run: 5, Failures: 0, Errors: 0, Skipped: 0, Time elapsed: 4.626 sec
Running org.apache.activemq.broker.BrokerTest
Tests run: 129, Failures: 0, Errors: 0, Skipped: 0, Time elapsed: 21.389 sec
Running org.apache.activemq.broker.ConcurrentConnectSimulationTest
Tests run: 1, Failures: 0, Errors: 0, Skipped: 0, Time elapsed: 0.627 sec
Running org.apache.activemq.broker.CreateDestinationsOnStartupViaXBeanTest
Tests run: 1, Failures: 0, Errors: 0, Skipped: 0, Time elapsed: 2.269 sec
Running org.apache.activemq.broker.DedicatedTaskRunnerBrokerTest
Tests run: 129, Failures: 0, Errors: 0, Skipped: 0, Time elapsed: 21.409 sec
Running org.apache.activemq.broker.DoubleSubscriptionTest
Tests run: 1, Failures: 0, Errors: 0, Skipped: 0, Time elapsed: 2.561 sec
Running org.apache.activemq.broker.DurablePersistentFalseRestartTest
Tests run: 1, Failures: 0, Errors: 0, Skipped: 0, Time elapsed: 6.748 sec
Running org.apache.activemq.broker.JdbcXARecoveryBrokerTest
Tests run: 16, Failures: 0, Errors: 0, Skipped: 0, Time elapsed: 58.037 sec
Running org.apache.activemq.broker.MessageExpirationTest
Tests run: 13, Failures: 0, Errors: 0, Skipped: 0, Time elapsed: 23.141 sec
Running org.apache.activemq.broker.OutOfOrderXMLTest
Tests run: 1, Failures: 0, Errors: 0, Skipped: 0, Time elapsed: 1.338 sec
Running org.apache.activemq.broker.QueueMbeanRestartTest
Tests run: 2, Failures: 0, Errors: 0, Skipped: 0, Time elapsed: 3.922 sec
Running org.apache.activemq.broker.QueueSubscriptionTest
Tests run: 8, Failures: 0, Errors: 0, Skipped: 0, Time elapsed: 3.614 sec
Running org.apache.activemq.broker.ReconnectWithJMXEnabledTest
Tests run: 1, Failures: 0, Errors: 0, Skipped: 0, Time elapsed: 4.657 sec
Running org.apache.activemq.broker.RecoveryBrokerTest
Tests run: 9, Failures: 0, Errors: 0, Skipped: 0, Time elapsed: 28.85 sec
Running org.apache.activemq.broker.RedeliveryRestartTest
Tests run: 2, Failures: 0, Errors: 0, Skipped: 0, Time elapsed: 12.006 sec
Running org.apache.activemq.broker.SpringTest
Tests run: 1, Failures: 0, Errors: 0, Skipped: 0, Time elapsed: 2.82 sec
Running org.apache.activemq.broker.TopicSubscriptionTest
Tests run: 8, Failures: 0, Errors: 0, Skipped: 0, Time elapsed: 7.563 sec
Running org.apache.activemq.broker.XARecoveryBrokerTest
Tests run: 16, Failures: 0, Errors: 0, Skipped: 0, Time elapsed: 69.17 sec
Running org.apache.activemq.broker.advisory.AdvisoryBrokerTest
Tests run: 6, Failures: 0, Errors: 0, Skipped: 0, Time elapsed: 0.883 sec
Running org.apache.activemq.broker.advisory.AdvisoryDuplexNetworkBridgeTest
Tests run: 2, Failures: 0, Errors: 0, Skipped: 0, Time elapsed: 11.274 sec
Running org.apache.activemq.broker.advisory.AdvisoryJmxTest
Tests run: 1, Failures: 0, Errors: 0, Skipped: 0, Time elapsed: 0.735 sec
Running org.apache.activemq.broker.advisory.AdvisoryNetworkBridgeTest
Tests run: 2, Failures: 0, Errors: 0, Skipped: 0, Time elapsed: 10.831 sec
Running org.apache.activemq.broker.ft.DbRestartJDBCQueueMasterSlaveLeaseQuiesceTest
Tests run: 3, Failures: 0, Errors: 0, Skipped: 0, Time elapsed: 40.297 sec
Running org.apache.activemq.broker.ft.DbRestartJDBCQueueMasterSlaveLeaseTest
Tests run: 2, Failures: 0, Errors: 0, Skipped: 0, Time elapsed: 21.511 sec
Running org.apache.activemq.broker.ft.DbRestartJDBCQueueMasterSlaveTest
Running org.apache.activemq.broker.ft.JDBCQueueMasterSlaveTest
Tests run: 2, Failures: 0, Errors: 0, Skipped: 0, Time elapsed: 12.652 sec
Running org.apache.activemq.broker.ft.MasterSlaveProducerFlowControlTest
Tests run: 6, Failures: 0, Errors: 0, Skipped: 0, Time elapsed: 25.741 sec
Running org.apache.activemq.broker.ft.MasterSlaveSlaveDieTest
Tests run: 1, Failures: 0, Errors: 0, Skipped: 0, Time elapsed: 2.47 sec
Running org.apache.activemq.broker.ft.MasterSlaveSlaveShutdownTest
Tests run: 1, Failures: 0, Errors: 0, Skipped: 0, Time elapsed: 32.347 sec
Running org.apache.activemq.broker.ft.QueueMasterSlaveSingleUrlTest
Tests run: 2, Failures: 0, Errors: 0, Skipped: 0, Time elapsed: 14.695 sec
Running org.apache.activemq.broker.ft.QueueMasterSlaveTest
Tests run: 2, Failures: 0, Errors: 0, Skipped: 0, Time elapsed: 13.541 sec
Running org.apache.activemq.broker.ft.QueueMasterSlaveTestUsingSharedFileTest
Tests run: 2, Failures: 0, Errors: 0, Skipped: 0, Time elapsed: 27.854 sec
Running org.apache.activemq.broker.ft.QueueMasterSlaveUsingMasterConnectorElementCompositeQueueTest
Tests run: 2, Failures: 0, Errors: 0, Skipped: 0, Time elapsed: 16.426 sec
Running org.apache.activemq.broker.ft.QueueMasterSlaveUsingMasterConnectorElementTest
Tests run: 2, Failures: 0, Errors: 0, Skipped: 0, Time elapsed: 14.215 sec
Running org.apache.activemq.broker.ft.TopicMasterSlaveTest
Tests run: 2, Failures: 0, Errors: 0, Skipped: 0, Time elapsed: 14.193 sec
Running org.apache.activemq.broker.ft.TransactedTopicMasterSlaveTest
Tests run: 15, Failures: 0, Errors: 0, Skipped: 0, Time elapsed: 77.462 sec
Running org.apache.activemq.broker.jmx.BrokerViewSlowStoreStartupTest
Tests run: 1, Failures: 0, Errors: 0, Skipped: 0, Time elapsed: 1.008 sec
Running org.apache.activemq.broker.jmx.MBeanOperationTimeoutTest
Tests run: 1, Failures: 0, Errors: 0, Skipped: 0, Time elapsed: 13.609 sec
Running org.apache.activemq.broker.jmx.MBeanTest
Tests run: 19, Failures: 0, Errors: 0, Skipped: 0, Time elapsed: 54.882 sec
Running org.apache.activemq.broker.jmx.PurgeTest
Tests run: 5, Failures: 0, Errors: 0, Skipped: 0, Time elapsed: 16.07 sec
Running org.apache.activemq.broker.jmx.TransportConnectorMBeanTest
Tests run: 2, Failures: 0, Errors: 0, Skipped: 0, Time elapsed: 4.638 sec
Running org.apache.activemq.broker.mKahaDBXARecoveryBrokerTest
Tests run: 16, Failures: 0, Errors: 0, Skipped: 0, Time elapsed: 79.55 sec
Running org.apache.activemq.broker.message.security.MessageAuthenticationTest
Tests run: 1, Failures: 0, Errors: 0, Skipped: 0, Time elapsed: 0.719 sec
Running org.apache.activemq.broker.policy.AbortSlowConsumerTest
Tests run: 19, Failures: 0, Errors: 0, Skipped: 0, Time elapsed: 113.601 sec
Running org.apache.activemq.broker.policy.DeadLetterTest
Tests run: 4, Failures: 0, Errors: 0, Skipped: 0, Time elapsed: 2.339 sec
Running org.apache.activemq.broker.policy.DestinationCursorConfigTest
Tests run: 2, Failures: 0, Errors: 0, Skipped: 0, Time elapsed: 1.568 sec
Running org.apache.activemq.broker.policy.IndividualDeadLetterTest
Tests run: 5, Failures: 0, Errors: 0, Skipped: 0, Time elapsed: 4.469 sec
Running org.apache.activemq.broker.policy.IndividualDeadLetterViaXmlTest
Tests run: 4, Failures: 0, Errors: 0, Skipped: 0, Time elapsed: 3.63 sec
Running org.apache.activemq.broker.policy.MessageListenerDeadLetterTest
Tests run: 4, Failures: 0, Errors: 0, Skipped: 0, Time elapsed: 3.057 sec
Running org.apache.activemq.broker.policy.NoConsumerDeadLetterTest
Tests run: 5, Failures: 0, Errors: 0, Skipped: 0, Time elapsed: 1.88 sec
Running org.apache.activemq.broker.policy.NoRetryDeadLetterTest
Tests run: 4, Failures: 0, Errors: 0, Skipped: 0, Time elapsed: 1.034 sec
Running org.apache.activemq.broker.policy.PerDurableConsumerDeadLetterTest
Tests run: 4, Failures: 0, Errors: 0, Skipped: 0, Time elapsed: 2.333 sec
Running org.apache.activemq.broker.policy.PriorityNetworkDispatchPolicyTest
Tests run: 1, Failures: 0, Errors: 0, Skipped: 0, Time elapsed: 0.217 sec
Running org.apache.activemq.broker.policy.RoundRobinDispatchPolicyTest
Tests run: 9, Failures: 0, Errors: 0, Skipped: 0, Time elapsed: 3.74 sec
Running org.apache.activemq.broker.policy.SimpleDispatchPolicyTest
Tests run: 8, Failures: 0, Errors: 0, Skipped: 0, Time elapsed: 3.645 sec
Running org.apache.activemq.broker.policy.StrictOrderDispatchPolicyTest
Tests run: 8, Failures: 0, Errors: 0, Skipped: 0, Time elapsed: 4.918 sec
Running org.apache.activemq.broker.region.DestinationGCTest
Tests run: 2, Failures: 0, Errors: 0, Skipped: 0, Time elapsed: 13.705 sec
Running org.apache.activemq.broker.region.DestinationRemoveRestartTest
Tests run: 2, Failures: 0, Errors: 0, Skipped: 0, Time elapsed: 3.56 sec
Running org.apache.activemq.broker.region.QueueDuplicatesFromStoreTest
Tests run: 2, Failures: 0, Errors: 0, Skipped: 0, Time elapsed: 7.15 sec
Running org.apache.activemq.broker.region.QueueOptimizedDispatchExceptionTest
Tests run: 1, Failures: 0, Errors: 0, Skipped: 0, Time elapsed: 0.433 sec
Running org.apache.activemq.broker.region.QueuePurgeTest
Tests run: 3, Failures: 0, Errors: 0, Skipped: 0, Time elapsed: 98.646 sec
Running org.apache.activemq.broker.region.UniquePropertyMessageEvictionStrategyTest
Tests run: 1, Failures: 0, Errors: 0, Skipped: 0, Time elapsed: 11.785 sec
Running org.apache.activemq.broker.region.cursors.CursorDurableTest
Tests run: 2, Failures: 0, Errors: 0, Skipped: 0, Time elapsed: 3.906 sec
Running org.apache.activemq.broker.region.cursors.CursorQueueStoreTest
Tests run: 5, Failures: 0, Errors: 0, Skipped: 0, Time elapsed: 103.298 sec
Running org.apache.activemq.broker.region.cursors.FilePendingMessageCursorTest
Tests run: 2, Failures: 0, Errors: 0, Skipped: 0, Time elapsed: 2.446 sec
Running org.apache.activemq.broker.region.cursors.NegativeQueueTest
Tests run: 4, Failures: 0, Errors: 0, Skipped: 0, Time elapsed: 102.166 sec
Running org.apache.activemq.broker.region.cursors.OrderPendingListTest
Tests run: 9, Failures: 0, Errors: 0, Skipped: 0, Time elapsed: 0.307 sec
Running org.apache.activemq.broker.region.cursors.PrioritizedPendingListTest
Tests run: 7, Failures: 0, Errors: 0, Skipped: 0, Time elapsed: 0.31 sec
Running org.apache.activemq.broker.region.cursors.StoreBasedCursorTest
Tests run: 5, Failures: 0, Errors: 0, Skipped: 0, Time elapsed: 14.974 sec
Running org.apache.activemq.broker.region.cursors.StoreQueueCursorJDBCNoDuplicateTest
Tests run: 1, Failures: 0, Errors: 0, Skipped: 0, Time elapsed: 2.897 sec
Running org.apache.activemq.broker.region.cursors.StoreQueueCursorJournalNoDuplicateTest
Tests run: 1, Failures: 0, Errors: 0, Skipped: 0, Time elapsed: 0.589 sec
Running org.apache.activemq.broker.region.cursors.StoreQueueCursorKahaDBNoDuplicateTest
Tests run: 1, Failures: 0, Errors: 0, Skipped: 0, Time elapsed: 1.274 sec
Running org.apache.activemq.broker.region.cursors.StoreQueueCursorMemoryNoDuplicateTest
Tests run: 1, Failures: 0, Errors: 0, Skipped: 0, Time elapsed: 0.413 sec
Running org.apache.activemq.broker.region.cursors.StoreQueueCursorNoDuplicateTest
Tests run: 1, Failures: 0, Errors: 0, Skipped: 0, Time elapsed: 1.269 sec
Running org.apache.activemq.broker.region.group.MessageGroupHashBucketTest
Tests run: 2, Failures: 0, Errors: 0, Skipped: 0, Time elapsed: 0.038 sec
Running org.apache.activemq.broker.region.group.MessageGroupMapTest
Tests run: 2, Failures: 0, Errors: 0, Skipped: 0, Time elapsed: 0.038 sec
Running org.apache.activemq.broker.region.group.MessageGroupTest
Tests run: 3, Failures: 0, Errors: 0, Skipped: 0, Time elapsed: 1.133 sec
Running org.apache.activemq.broker.scheduler.CronParserTest
Tests run: 13, Failures: 0, Errors: 0, Skipped: 0, Time elapsed: 0.204 sec
Running org.apache.activemq.broker.scheduler.JmsCronSchedulerTest
Tests run: 2, Failures: 0, Errors: 0, Skipped: 0, Time elapsed: 199.335 sec
Running org.apache.activemq.broker.scheduler.JmsSchedulerTest
Tests run: 5, Failures: 0, Errors: 0, Skipped: 0, Time elapsed: 87.456 sec
Running org.apache.activemq.broker.scheduler.JobSchedulerManagementTest
Tests run: 7, Failures: 0, Errors: 0, Skipped: 0, Time elapsed: 75.867 sec
Running org.apache.activemq.broker.scheduler.JobSchedulerStoreTest
Tests run: 1, Failures: 0, Errors: 0, Skipped: 0, Time elapsed: 2.311 sec
Running org.apache.activemq.broker.scheduler.JobSchedulerTest
Tests run: 9, Failures: 0, Errors: 0, Skipped: 0, Time elapsed: 62.801 sec
Running org.apache.activemq.broker.store.DefaultStoreRecoveryBrokerTest
Tests run: 9, Failures: 0, Errors: 0, Skipped: 0, Time elapsed: 31.507 sec
Running org.apache.activemq.broker.store.RecoverExpiredMessagesTest
Tests run: 4, Failures: 0, Errors: 0, Skipped: 0, Time elapsed: 30.531 sec
Running org.apache.activemq.broker.store.TransactionStoreTest
Tests run: 1, Failures: 0, Errors: 0, Skipped: 0, Time elapsed: 0.359 sec
Running org.apache.activemq.broker.util.PluginBrokerTest
Tests run: 1, Failures: 0, Errors: 0, Skipped: 0, Time elapsed: 2.407 sec
Running org.apache.activemq.broker.util.RedeliveryPluginTest
Tests run: 1, Failures: 0, Errors: 0, Skipped: 0, Time elapsed: 0.226 sec
Running org.apache.activemq.broker.util.TimeStampingBrokerPluginTest
Tests run: 3, Failures: 0, Errors: 0, Skipped: 0, Time elapsed: 6.635 sec
Running org.apache.activemq.broker.util.TraceBrokerPathPluginTest
Tests run: 1, Failures: 0, Errors: 0, Skipped: 0, Time elapsed: 2.72 sec
Running org.apache.activemq.broker.virtual.CompositeQueueTest
Tests run: 1, Failures: 0, Errors: 0, Skipped: 0, Time elapsed: 1.273 sec
Running org.apache.activemq.broker.virtual.CompositeTopicTest
Tests run: 1, Failures: 0, Errors: 0, Skipped: 0, Time elapsed: 1.73 sec
Running org.apache.activemq.broker.virtual.FilteredQueueTest
Tests run: 1, Failures: 0, Errors: 0, Skipped: 0, Time elapsed: 2.129 sec
Running org.apache.activemq.broker.virtual.MirroredQueueCorrectMemoryUsageTest
Tests run: 1, Failures: 0, Errors: 0, Skipped: 0, Time elapsed: 8.059 sec
Running org.apache.activemq.broker.virtual.MirroredQueueTest
Tests run: 2, Failures: 0, Errors: 0, Skipped: 0, Time elapsed: 0.792 sec
Running org.apache.activemq.broker.virtual.MirroredQueueUsingVirtualTopicQueueTest
Tests run: 2, Failures: 0, Errors: 0, Skipped: 0, Time elapsed: 0.83 sec
Running org.apache.activemq.broker.virtual.VirtualTopicDLQTest
Tests run: 1, Failures: 0, Errors: 0, Skipped: 0, Time elapsed: 7.677 sec
Running org.apache.activemq.broker.virtual.VirtualTopicDisconnectSelectorTest
Tests run: 1, Failures: 0, Errors: 0, Skipped: 0, Time elapsed: 2.457 sec
Running org.apache.activemq.broker.virtual.VirtualTopicPubSubTest
Tests run: 2, Failures: 0, Errors: 0, Skipped: 0, Time elapsed: 0.913 sec
Running org.apache.activemq.broker.virtual.VirtualTopicPubSubUsingXBeanTest
Tests run: 2, Failures: 0, Errors: 0, Skipped: 0, Time elapsed: 0.924 sec
Running org.apache.activemq.broker.virtual.VirtualTopicSelectorTest
Tests run: 1, Failures: 0, Errors: 0, Skipped: 0, Time elapsed: 1.801 sec
Running org.apache.activemq.broker.virtual.VirtualTopicsAndDurableSubsTest
Tests run: 20, Failures: 0, Errors: 0, Skipped: 0, Time elapsed: 48.928 sec
Running org.apache.activemq.bugs.AMQ1687Test
Tests run: 1, Failures: 0, Errors: 0, Skipped: 0, Time elapsed: 2.629 sec
Running org.apache.activemq.bugs.AMQ1853Test
Tests run: 1, Failures: 0, Errors: 0, Skipped: 0, Time elapsed: 7.444 sec
Running org.apache.activemq.bugs.AMQ1893Test
Tests run: 1, Failures: 0, Errors: 0, Skipped: 0, Time elapsed: 17.013 sec
Running org.apache.activemq.bugs.AMQ1917Test
Tests run: 1, Failures: 0, Errors: 0, Skipped: 0, Time elapsed: 6.77 sec
Running org.apache.activemq.bugs.AMQ1936Test
Tests run: 1, Failures: 0, Errors: 0, Skipped: 0, Time elapsed: 30.364 sec
Running org.apache.activemq.bugs.AMQ2021Test
Tests run: 1, Failures: 0, Errors: 0, Skipped: 0, Time elapsed: 4.894 sec
Running org.apache.activemq.bugs.AMQ2084Test
Tests run: 2, Failures: 0, Errors: 0, Skipped: 0, Time elapsed: 8.874 sec
Running org.apache.activemq.bugs.AMQ2102Test
Results :
Tests run: 1224, Failures: 0, Errors: 0, Skipped: 0
mojoFailed org.apache.maven.plugins:maven-surefire-plugin:2.12.3(default-test)
[JENKINS] Recording test results
Tests run: 2, Failures: 0, Errors: 0, Skipped: 0, Time elapsed: 70.082 sec
projectFailed org.apache.activemq:activemq-core:5.7-SNAPSHOT
Build failed in Jenkins: ActiveMQ-Java7 » ActiveMQ :: Core #16
Posted by Apache Jenkins Server <je...@builds.apache.org>.
See <https://builds.apache.org/job/ActiveMQ-Java7/org.apache.activemq$activemq-core/16/changes>
Changes:
[gtully] fix typo
------------------------------------------
[...truncated 329 lines...]
Tests run: 2, Failures: 0, Errors: 0, Skipped: 0, Time elapsed: 0.798 sec
Running org.apache.activemq.advisory.TempDestLoadTest
Tests run: 2, Failures: 0, Errors: 0, Skipped: 0, Time elapsed: 18.408 sec
Running org.apache.activemq.advisory.TempQueueMemoryTest
Tests run: 2, Failures: 0, Errors: 0, Skipped: 0, Time elapsed: 19.735 sec
Running org.apache.activemq.blob.BlobTransferPolicyUriTest
Tests run: 1, Failures: 0, Errors: 0, Skipped: 0, Time elapsed: 0.186 sec
Running org.apache.activemq.blob.FTPBlobDownloadStrategyTest
Tests run: 3, Failures: 0, Errors: 0, Skipped: 0, Time elapsed: 1.81 sec
Running org.apache.activemq.blob.FTPBlobTest
Tests run: 1, Failures: 0, Errors: 0, Skipped: 0, Time elapsed: 2.035 sec
Running org.apache.activemq.blob.FTPBlobUploadStrategyTest
Tests run: 2, Failures: 0, Errors: 0, Skipped: 0, Time elapsed: 1.007 sec
Running org.apache.activemq.blob.FilesystemBlobTest
Tests run: 1, Failures: 0, Errors: 0, Skipped: 0, Time elapsed: 1.721 sec
Running org.apache.activemq.broker.BrokerRedeliveryTest
Tests run: 1, Failures: 0, Errors: 0, Skipped: 0, Time elapsed: 8.406 sec
Running org.apache.activemq.broker.BrokerServiceTest
Tests run: 5, Failures: 0, Errors: 0, Skipped: 0, Time elapsed: 4.644 sec
Running org.apache.activemq.broker.BrokerTest
Tests run: 129, Failures: 0, Errors: 0, Skipped: 0, Time elapsed: 21.313 sec
Running org.apache.activemq.broker.ConcurrentConnectSimulationTest
Tests run: 1, Failures: 0, Errors: 0, Skipped: 0, Time elapsed: 0.613 sec
Running org.apache.activemq.broker.CreateDestinationsOnStartupViaXBeanTest
Tests run: 1, Failures: 0, Errors: 0, Skipped: 0, Time elapsed: 2.224 sec
Running org.apache.activemq.broker.DedicatedTaskRunnerBrokerTest
Tests run: 129, Failures: 0, Errors: 0, Skipped: 0, Time elapsed: 21.271 sec
Running org.apache.activemq.broker.DoubleSubscriptionTest
Tests run: 1, Failures: 0, Errors: 0, Skipped: 0, Time elapsed: 2.556 sec
Running org.apache.activemq.broker.DurablePersistentFalseRestartTest
Tests run: 1, Failures: 0, Errors: 0, Skipped: 0, Time elapsed: 6.748 sec
Running org.apache.activemq.broker.JdbcXARecoveryBrokerTest
Tests run: 16, Failures: 0, Errors: 0, Skipped: 0, Time elapsed: 57.888 sec
Running org.apache.activemq.broker.MessageExpirationTest
Tests run: 13, Failures: 0, Errors: 0, Skipped: 0, Time elapsed: 23.095 sec
Running org.apache.activemq.broker.OutOfOrderXMLTest
Tests run: 1, Failures: 0, Errors: 0, Skipped: 0, Time elapsed: 1.339 sec
Running org.apache.activemq.broker.QueueMbeanRestartTest
Tests run: 2, Failures: 0, Errors: 0, Skipped: 0, Time elapsed: 3.9 sec
Running org.apache.activemq.broker.QueueSubscriptionTest
Tests run: 8, Failures: 0, Errors: 0, Skipped: 0, Time elapsed: 3.656 sec
Running org.apache.activemq.broker.ReconnectWithJMXEnabledTest
Tests run: 1, Failures: 0, Errors: 0, Skipped: 0, Time elapsed: 4.622 sec
Running org.apache.activemq.broker.RecoveryBrokerTest
Tests run: 9, Failures: 0, Errors: 0, Skipped: 0, Time elapsed: 28.787 sec
Running org.apache.activemq.broker.RedeliveryRestartTest
Tests run: 2, Failures: 0, Errors: 0, Skipped: 0, Time elapsed: 11.943 sec
Running org.apache.activemq.broker.SpringTest
Tests run: 1, Failures: 0, Errors: 0, Skipped: 0, Time elapsed: 2.713 sec
Running org.apache.activemq.broker.TopicSubscriptionTest
Tests run: 8, Failures: 0, Errors: 0, Skipped: 0, Time elapsed: 6.772 sec
Running org.apache.activemq.broker.XARecoveryBrokerTest
Tests run: 16, Failures: 0, Errors: 0, Skipped: 0, Time elapsed: 68.659 sec
Running org.apache.activemq.broker.advisory.AdvisoryBrokerTest
Tests run: 6, Failures: 0, Errors: 0, Skipped: 0, Time elapsed: 0.855 sec
Running org.apache.activemq.broker.advisory.AdvisoryDuplexNetworkBridgeTest
Tests run: 2, Failures: 0, Errors: 0, Skipped: 0, Time elapsed: 11.475 sec
Running org.apache.activemq.broker.advisory.AdvisoryJmxTest
Tests run: 1, Failures: 0, Errors: 0, Skipped: 0, Time elapsed: 0.734 sec
Running org.apache.activemq.broker.advisory.AdvisoryNetworkBridgeTest
Tests run: 2, Failures: 0, Errors: 0, Skipped: 0, Time elapsed: 10.802 sec
Running org.apache.activemq.broker.ft.DbRestartJDBCQueueMasterSlaveLeaseQuiesceTest
Tests run: 3, Failures: 0, Errors: 0, Skipped: 0, Time elapsed: 40.33 sec
Running org.apache.activemq.broker.ft.DbRestartJDBCQueueMasterSlaveLeaseTest
Tests run: 2, Failures: 0, Errors: 0, Skipped: 0, Time elapsed: 21.503 sec
Running org.apache.activemq.broker.ft.DbRestartJDBCQueueMasterSlaveTest
Running org.apache.activemq.broker.ft.JDBCQueueMasterSlaveTest
Tests run: 2, Failures: 0, Errors: 0, Skipped: 0, Time elapsed: 12.644 sec
Running org.apache.activemq.broker.ft.MasterSlaveProducerFlowControlTest
Tests run: 6, Failures: 0, Errors: 0, Skipped: 0, Time elapsed: 25.709 sec
Running org.apache.activemq.broker.ft.MasterSlaveSlaveDieTest
Tests run: 1, Failures: 0, Errors: 0, Skipped: 0, Time elapsed: 2.458 sec
Running org.apache.activemq.broker.ft.MasterSlaveSlaveShutdownTest
Tests run: 1, Failures: 0, Errors: 0, Skipped: 0, Time elapsed: 32.356 sec
Running org.apache.activemq.broker.ft.QueueMasterSlaveSingleUrlTest
Tests run: 2, Failures: 0, Errors: 0, Skipped: 0, Time elapsed: 13.725 sec
Running org.apache.activemq.broker.ft.QueueMasterSlaveTest
Tests run: 2, Failures: 0, Errors: 0, Skipped: 0, Time elapsed: 13.545 sec
Running org.apache.activemq.broker.ft.QueueMasterSlaveTestUsingSharedFileTest
Tests run: 2, Failures: 0, Errors: 0, Skipped: 0, Time elapsed: 27.814 sec
Running org.apache.activemq.broker.ft.QueueMasterSlaveUsingMasterConnectorElementCompositeQueueTest
Tests run: 2, Failures: 0, Errors: 0, Skipped: 0, Time elapsed: 14.219 sec
Running org.apache.activemq.broker.ft.QueueMasterSlaveUsingMasterConnectorElementTest
Tests run: 2, Failures: 0, Errors: 0, Skipped: 0, Time elapsed: 14.196 sec
Running org.apache.activemq.broker.ft.TopicMasterSlaveTest
Tests run: 2, Failures: 0, Errors: 0, Skipped: 0, Time elapsed: 14.197 sec
Running org.apache.activemq.broker.ft.TransactedTopicMasterSlaveTest
Tests run: 15, Failures: 0, Errors: 0, Skipped: 0, Time elapsed: 77.429 sec
Running org.apache.activemq.broker.jmx.BrokerViewSlowStoreStartupTest
Tests run: 1, Failures: 0, Errors: 0, Skipped: 0, Time elapsed: 1.002 sec
Running org.apache.activemq.broker.jmx.MBeanOperationTimeoutTest
Tests run: 1, Failures: 0, Errors: 0, Skipped: 0, Time elapsed: 13.341 sec
Running org.apache.activemq.broker.jmx.MBeanTest
Tests run: 19, Failures: 0, Errors: 0, Skipped: 0, Time elapsed: 54.911 sec
Running org.apache.activemq.broker.jmx.PurgeTest
Tests run: 5, Failures: 0, Errors: 0, Skipped: 0, Time elapsed: 16.066 sec
Running org.apache.activemq.broker.jmx.TransportConnectorMBeanTest
Tests run: 2, Failures: 0, Errors: 0, Skipped: 0, Time elapsed: 4.634 sec
Running org.apache.activemq.broker.mKahaDBXARecoveryBrokerTest
Tests run: 16, Failures: 0, Errors: 0, Skipped: 0, Time elapsed: 79.395 sec
Running org.apache.activemq.broker.message.security.MessageAuthenticationTest
Tests run: 1, Failures: 0, Errors: 0, Skipped: 0, Time elapsed: 0.718 sec
Running org.apache.activemq.broker.policy.AbortSlowConsumerTest
Tests run: 19, Failures: 0, Errors: 0, Skipped: 0, Time elapsed: 113.575 sec
Running org.apache.activemq.broker.policy.DeadLetterTest
Tests run: 4, Failures: 0, Errors: 0, Skipped: 0, Time elapsed: 2.352 sec
Running org.apache.activemq.broker.policy.DestinationCursorConfigTest
Tests run: 2, Failures: 0, Errors: 0, Skipped: 0, Time elapsed: 1.554 sec
Running org.apache.activemq.broker.policy.IndividualDeadLetterTest
Tests run: 5, Failures: 0, Errors: 0, Skipped: 0, Time elapsed: 4.476 sec
Running org.apache.activemq.broker.policy.IndividualDeadLetterViaXmlTest
Tests run: 4, Failures: 0, Errors: 0, Skipped: 0, Time elapsed: 3.604 sec
Running org.apache.activemq.broker.policy.MessageListenerDeadLetterTest
Tests run: 4, Failures: 0, Errors: 0, Skipped: 0, Time elapsed: 3.13 sec
Running org.apache.activemq.broker.policy.NoConsumerDeadLetterTest
Tests run: 5, Failures: 0, Errors: 0, Skipped: 0, Time elapsed: 1.893 sec
Running org.apache.activemq.broker.policy.NoRetryDeadLetterTest
Tests run: 4, Failures: 0, Errors: 0, Skipped: 0, Time elapsed: 1.037 sec
Running org.apache.activemq.broker.policy.PerDurableConsumerDeadLetterTest
Tests run: 4, Failures: 0, Errors: 0, Skipped: 0, Time elapsed: 2.347 sec
Running org.apache.activemq.broker.policy.PriorityNetworkDispatchPolicyTest
Tests run: 1, Failures: 0, Errors: 0, Skipped: 0, Time elapsed: 0.213 sec
Running org.apache.activemq.broker.policy.RoundRobinDispatchPolicyTest
Tests run: 9, Failures: 0, Errors: 0, Skipped: 0, Time elapsed: 3.862 sec
Running org.apache.activemq.broker.policy.SimpleDispatchPolicyTest
Tests run: 8, Failures: 0, Errors: 0, Skipped: 0, Time elapsed: 3.813 sec
Running org.apache.activemq.broker.policy.StrictOrderDispatchPolicyTest
Tests run: 8, Failures: 0, Errors: 0, Skipped: 0, Time elapsed: 4.602 sec
Running org.apache.activemq.broker.region.DestinationGCTest
Tests run: 2, Failures: 0, Errors: 0, Skipped: 0, Time elapsed: 13.699 sec
Running org.apache.activemq.broker.region.DestinationRemoveRestartTest
Tests run: 2, Failures: 0, Errors: 0, Skipped: 0, Time elapsed: 3.551 sec
Running org.apache.activemq.broker.region.QueueDuplicatesFromStoreTest
Tests run: 2, Failures: 0, Errors: 0, Skipped: 0, Time elapsed: 7.149 sec
Running org.apache.activemq.broker.region.QueueOptimizedDispatchExceptionTest
Tests run: 1, Failures: 0, Errors: 0, Skipped: 0, Time elapsed: 0.432 sec
Running org.apache.activemq.broker.region.QueuePurgeTest
Tests run: 3, Failures: 0, Errors: 0, Skipped: 0, Time elapsed: 98.098 sec
Running org.apache.activemq.broker.region.UniquePropertyMessageEvictionStrategyTest
Tests run: 1, Failures: 0, Errors: 0, Skipped: 0, Time elapsed: 11.759 sec
Running org.apache.activemq.broker.region.cursors.CursorDurableTest
Tests run: 2, Failures: 0, Errors: 0, Skipped: 0, Time elapsed: 3.874 sec
Running org.apache.activemq.broker.region.cursors.CursorQueueStoreTest
Tests run: 5, Failures: 0, Errors: 0, Skipped: 0, Time elapsed: 103.448 sec
Running org.apache.activemq.broker.region.cursors.FilePendingMessageCursorTest
Tests run: 2, Failures: 0, Errors: 0, Skipped: 0, Time elapsed: 2.446 sec
Running org.apache.activemq.broker.region.cursors.NegativeQueueTest
Tests run: 4, Failures: 0, Errors: 0, Skipped: 0, Time elapsed: 102.127 sec
Running org.apache.activemq.broker.region.cursors.OrderPendingListTest
Tests run: 9, Failures: 0, Errors: 0, Skipped: 0, Time elapsed: 0.297 sec
Running org.apache.activemq.broker.region.cursors.PrioritizedPendingListTest
Tests run: 7, Failures: 0, Errors: 0, Skipped: 0, Time elapsed: 0.307 sec
Running org.apache.activemq.broker.region.cursors.StoreBasedCursorTest
Tests run: 5, Failures: 0, Errors: 0, Skipped: 0, Time elapsed: 14.884 sec
Running org.apache.activemq.broker.region.cursors.StoreQueueCursorJDBCNoDuplicateTest
Tests run: 1, Failures: 0, Errors: 0, Skipped: 0, Time elapsed: 2.709 sec
Running org.apache.activemq.broker.region.cursors.StoreQueueCursorJournalNoDuplicateTest
Tests run: 1, Failures: 0, Errors: 0, Skipped: 0, Time elapsed: 0.523 sec
Running org.apache.activemq.broker.region.cursors.StoreQueueCursorKahaDBNoDuplicateTest
Tests run: 1, Failures: 0, Errors: 0, Skipped: 0, Time elapsed: 1.25 sec
Running org.apache.activemq.broker.region.cursors.StoreQueueCursorMemoryNoDuplicateTest
Tests run: 1, Failures: 0, Errors: 0, Skipped: 0, Time elapsed: 0.404 sec
Running org.apache.activemq.broker.region.cursors.StoreQueueCursorNoDuplicateTest
Tests run: 1, Failures: 0, Errors: 0, Skipped: 0, Time elapsed: 1.261 sec
Running org.apache.activemq.broker.region.group.MessageGroupHashBucketTest
Tests run: 2, Failures: 0, Errors: 0, Skipped: 0, Time elapsed: 0.031 sec
Running org.apache.activemq.broker.region.group.MessageGroupMapTest
Tests run: 2, Failures: 0, Errors: 0, Skipped: 0, Time elapsed: 0.031 sec
Running org.apache.activemq.broker.region.group.MessageGroupTest
Tests run: 3, Failures: 0, Errors: 0, Skipped: 0, Time elapsed: 1.137 sec
Running org.apache.activemq.broker.scheduler.CronParserTest
Tests run: 13, Failures: 0, Errors: 0, Skipped: 0, Time elapsed: 0.205 sec
Running org.apache.activemq.broker.scheduler.JmsCronSchedulerTest
Tests run: 2, Failures: 0, Errors: 0, Skipped: 0, Time elapsed: 198.634 sec
Running org.apache.activemq.broker.scheduler.JmsSchedulerTest
Tests run: 5, Failures: 0, Errors: 0, Skipped: 0, Time elapsed: 87.142 sec
Running org.apache.activemq.broker.scheduler.JobSchedulerManagementTest
Tests run: 7, Failures: 0, Errors: 0, Skipped: 0, Time elapsed: 75.169 sec
Running org.apache.activemq.broker.scheduler.JobSchedulerStoreTest
Tests run: 1, Failures: 0, Errors: 0, Skipped: 0, Time elapsed: 2.285 sec
Running org.apache.activemq.broker.scheduler.JobSchedulerTest
Tests run: 9, Failures: 0, Errors: 0, Skipped: 0, Time elapsed: 62.177 sec
Running org.apache.activemq.broker.store.DefaultStoreRecoveryBrokerTest
Tests run: 9, Failures: 0, Errors: 0, Skipped: 0, Time elapsed: 31.835 sec
Running org.apache.activemq.broker.store.RecoverExpiredMessagesTest
Tests run: 4, Failures: 0, Errors: 0, Skipped: 0, Time elapsed: 30.452 sec
Running org.apache.activemq.broker.store.TransactionStoreTest
Tests run: 1, Failures: 0, Errors: 0, Skipped: 0, Time elapsed: 0.336 sec
Running org.apache.activemq.broker.util.PluginBrokerTest
Tests run: 1, Failures: 0, Errors: 0, Skipped: 0, Time elapsed: 2.376 sec
Running org.apache.activemq.broker.util.RedeliveryPluginTest
Tests run: 1, Failures: 0, Errors: 0, Skipped: 0, Time elapsed: 0.214 sec
Running org.apache.activemq.broker.util.TimeStampingBrokerPluginTest
Tests run: 3, Failures: 0, Errors: 0, Skipped: 0, Time elapsed: 6.638 sec
Running org.apache.activemq.broker.util.TraceBrokerPathPluginTest
Tests run: 1, Failures: 0, Errors: 0, Skipped: 0, Time elapsed: 2.698 sec
Running org.apache.activemq.broker.virtual.CompositeQueueTest
Tests run: 1, Failures: 0, Errors: 0, Skipped: 0, Time elapsed: 1.238 sec
Running org.apache.activemq.broker.virtual.CompositeTopicTest
Tests run: 1, Failures: 0, Errors: 0, Skipped: 0, Time elapsed: 2.706 sec
Running org.apache.activemq.broker.virtual.FilteredQueueTest
Tests run: 1, Failures: 0, Errors: 0, Skipped: 0, Time elapsed: 2.144 sec
Running org.apache.activemq.broker.virtual.MirroredQueueCorrectMemoryUsageTest
Tests run: 1, Failures: 0, Errors: 0, Skipped: 0, Time elapsed: 8.561 sec
Running org.apache.activemq.broker.virtual.MirroredQueueTest
Tests run: 2, Failures: 0, Errors: 0, Skipped: 0, Time elapsed: 0.788 sec
Running org.apache.activemq.broker.virtual.MirroredQueueUsingVirtualTopicQueueTest
Tests run: 2, Failures: 0, Errors: 0, Skipped: 0, Time elapsed: 0.825 sec
Running org.apache.activemq.broker.virtual.VirtualTopicDLQTest
Tests run: 1, Failures: 0, Errors: 0, Skipped: 0, Time elapsed: 7.679 sec
Running org.apache.activemq.broker.virtual.VirtualTopicDisconnectSelectorTest
Tests run: 1, Failures: 0, Errors: 0, Skipped: 0, Time elapsed: 3.316 sec
Running org.apache.activemq.broker.virtual.VirtualTopicPubSubTest
Tests run: 2, Failures: 0, Errors: 0, Skipped: 0, Time elapsed: 0.921 sec
Running org.apache.activemq.broker.virtual.VirtualTopicPubSubUsingXBeanTest
Tests run: 2, Failures: 0, Errors: 0, Skipped: 0, Time elapsed: 0.903 sec
Running org.apache.activemq.broker.virtual.VirtualTopicSelectorTest
Tests run: 1, Failures: 0, Errors: 0, Skipped: 0, Time elapsed: 1.772 sec
Running org.apache.activemq.broker.virtual.VirtualTopicsAndDurableSubsTest
Tests run: 20, Failures: 0, Errors: 0, Skipped: 0, Time elapsed: 48.983 sec
Running org.apache.activemq.bugs.AMQ1687Test
Tests run: 1, Failures: 0, Errors: 0, Skipped: 0, Time elapsed: 2.638 sec
Running org.apache.activemq.bugs.AMQ1853Test
Tests run: 1, Failures: 0, Errors: 0, Skipped: 0, Time elapsed: 7.438 sec
Running org.apache.activemq.bugs.AMQ1893Test
Tests run: 1, Failures: 0, Errors: 0, Skipped: 0, Time elapsed: 17.045 sec
Running org.apache.activemq.bugs.AMQ1917Test
Tests run: 1, Failures: 0, Errors: 0, Skipped: 0, Time elapsed: 6.741 sec
Running org.apache.activemq.bugs.AMQ1936Test
Tests run: 1, Failures: 0, Errors: 0, Skipped: 0, Time elapsed: 29.359 sec
Running org.apache.activemq.bugs.AMQ2021Test
Tests run: 1, Failures: 0, Errors: 0, Skipped: 0, Time elapsed: 4.912 sec
Running org.apache.activemq.bugs.AMQ2084Test
Tests run: 2, Failures: 0, Errors: 0, Skipped: 0, Time elapsed: 8.838 sec
Running org.apache.activemq.bugs.AMQ2102Test
Results :
Failed tests: testConsumeExpiredQueueAndDlq(org.apache.activemq.JmsSendReceiveWithMessageExpirationTest): got dlq messages expected:<99> but was:<100>
Tests in error:
testCreateTcpConnectionUsingAllocatedPort(org.apache.activemq.ActiveMQXAConnectionFactoryTest): org.apache.activemq:BrokerName=localhost,Type=Broker
Tests run: 1224, Failures: 1, Errors: 1, Skipped: 0
mojoFailed org.apache.maven.plugins:maven-surefire-plugin:2.12.3(default-test)
[JENKINS] Recording test results
Tests run: 2, Failures: 0, Errors: 0, Skipped: 0, Time elapsed: 74.617 sec
projectFailed org.apache.activemq:activemq-core:5.7-SNAPSHOT
Build failed in Jenkins: ActiveMQ-Java7 » ActiveMQ :: Core #15
Posted by Apache Jenkins Server <je...@builds.apache.org>.
See <https://builds.apache.org/job/ActiveMQ-Java7/org.apache.activemq$activemq-core/15/changes>
Changes:
[tabish] fix and tests for: https://issues.apache.org/jira/browse/AMQ-4083
Ensure that client ack mode sends acks for expired messages.
------------------------------------------
[...truncated 158 lines...]
Tests run: 1, Failures: 0, Errors: 0, Skipped: 0, Time elapsed: 1.747 sec
Running org.apache.activemq.JmsQueueSendReceiveUsingTwoSessionsTest
Tests run: 1, Failures: 0, Errors: 0, Skipped: 0, Time elapsed: 1.851 sec
Running org.apache.activemq.JmsQueueTopicCompositeSendReceiveTest
Tests run: 1, Failures: 0, Errors: 0, Skipped: 0, Time elapsed: 1.77 sec
Running org.apache.activemq.JmsQueueTransactionTest
Tests run: 17, Failures: 0, Errors: 0, Skipped: 0, Time elapsed: 22.182 sec
Running org.apache.activemq.JmsQueueWildcardSendReceiveTest
Tests run: 4, Failures: 0, Errors: 0, Skipped: 0, Time elapsed: 2.526 sec
Running org.apache.activemq.JmsRedeliveredTest
Tests run: 18, Failures: 0, Errors: 0, Skipped: 0, Time elapsed: 13.476 sec
Running org.apache.activemq.JmsRollbackRedeliveryTest
Tests run: 9, Failures: 0, Errors: 0, Skipped: 0, Time elapsed: 10.962 sec
Running org.apache.activemq.JmsSendReceiveWithMessageExpirationTest
Tests run: 5, Failures: 1, Errors: 0, Skipped: 0, Time elapsed: 18.162 sec <<< FAILURE!
testConsumeExpiredQueueAndDlq(org.apache.activemq.JmsSendReceiveWithMessageExpirationTest) Time elapsed: 3670 sec <<< FAILURE!
junit.framework.AssertionFailedError: got dlq messages expected:<99> but was:<100>
at junit.framework.Assert.fail(Assert.java:50)
at junit.framework.Assert.failNotEquals(Assert.java:287)
at junit.framework.Assert.assertEquals(Assert.java:67)
at junit.framework.Assert.assertEquals(Assert.java:199)
at org.apache.activemq.JmsSendReceiveWithMessageExpirationTest.testConsumeExpiredQueueAndDlq(JmsSendReceiveWithMessageExpirationTest.java:161)
at sun.reflect.NativeMethodAccessorImpl.invoke0(Native Method)
at sun.reflect.NativeMethodAccessorImpl.invoke(NativeMethodAccessorImpl.java:57)
at sun.reflect.DelegatingMethodAccessorImpl.invoke(DelegatingMethodAccessorImpl.java:43)
at java.lang.reflect.Method.invoke(Method.java:601)
at junit.framework.TestCase.runTest(TestCase.java:168)
at junit.framework.TestCase.runBare(TestCase.java:134)
at org.apache.activemq.CombinationTestSupport.runBare(CombinationTestSupport.java:90)
at org.apache.activemq.CombinationTestSupport.runBare(CombinationTestSupport.java:96)
at junit.framework.TestResult$1.protect(TestResult.java:110)
at junit.framework.TestResult.runProtected(TestResult.java:128)
at junit.framework.TestResult.run(TestResult.java:113)
at junit.framework.TestCase.run(TestCase.java:124)
at junit.framework.TestSuite.runTest(TestSuite.java:243)
at junit.framework.TestSuite.run(TestSuite.java:238)
at org.junit.internal.runners.JUnit38ClassRunner.run(JUnit38ClassRunner.java:83)
at org.apache.maven.surefire.junit4.JUnit4Provider.execute(JUnit4Provider.java:252)
at org.apache.maven.surefire.junit4.JUnit4Provider.executeTestSet(JUnit4Provider.java:141)
at org.apache.maven.surefire.junit4.JUnit4Provider.invoke(JUnit4Provider.java:112)
at sun.reflect.NativeMethodAccessorImpl.invoke0(Native Method)
at sun.reflect.NativeMethodAccessorImpl.invoke(NativeMethodAccessorImpl.java:57)
at sun.reflect.DelegatingMethodAccessorImpl.invoke(DelegatingMethodAccessorImpl.java:43)
at java.lang.reflect.Method.invoke(Method.java:601)
at org.apache.maven.surefire.util.ReflectionUtils.invokeMethodWithArray(ReflectionUtils.java:189)
at org.apache.maven.surefire.booter.ProviderFactory$ProviderProxy.invoke(ProviderFactory.java:165)
at org.apache.maven.surefire.booter.ProviderFactory.invokeProvider(ProviderFactory.java:85)
at org.apache.maven.surefire.booter.ForkedBooter.runSuitesInProcess(ForkedBooter.java:115)
at org.apache.maven.surefire.booter.ForkedBooter.main(ForkedBooter.java:75)
Running org.apache.activemq.JmsSendWithAsyncCallbackTest
Tests run: 1, Failures: 0, Errors: 0, Skipped: 0, Time elapsed: 2.865 sec
Running org.apache.activemq.JmsSessionRecoverTest
Tests run: 6, Failures: 0, Errors: 0, Skipped: 0, Time elapsed: 7.372 sec
Running org.apache.activemq.JmsTempDestinationTest
Tests run: 8, Failures: 0, Errors: 0, Skipped: 0, Time elapsed: 38.269 sec
Running org.apache.activemq.JmsTopicCompositeSendReceiveTest
Tests run: 1, Failures: 0, Errors: 0, Skipped: 0, Time elapsed: 1.747 sec
Running org.apache.activemq.JmsTopicRedeliverTest
Tests run: 1, Failures: 0, Errors: 0, Skipped: 0, Time elapsed: 1.657 sec
Running org.apache.activemq.JmsTopicRequestReplyTest
Tests run: 2, Failures: 0, Errors: 0, Skipped: 0, Time elapsed: 0.793 sec
Running org.apache.activemq.JmsTopicSelectorTest
Tests run: 3, Failures: 0, Errors: 0, Skipped: 0, Time elapsed: 8.789 sec
Running org.apache.activemq.JmsTopicSendReceiveSubscriberTest
Tests run: 1, Failures: 0, Errors: 0, Skipped: 0, Time elapsed: 0.717 sec
Running org.apache.activemq.JmsTopicSendReceiveTest
Tests run: 1, Failures: 0, Errors: 0, Skipped: 0, Time elapsed: 0.708 sec
Running org.apache.activemq.JmsTopicSendReceiveWithTwoConnectionsTest
Tests run: 1, Failures: 0, Errors: 0, Skipped: 0, Time elapsed: 0.744 sec
Running org.apache.activemq.JmsTopicSendReceiveWithTwoConnectionsWithJMXTest
Tests run: 1, Failures: 0, Errors: 0, Skipped: 0, Time elapsed: 0.719 sec
Running org.apache.activemq.JmsTopicSendSameMessageTest
Tests run: 1, Failures: 0, Errors: 0, Skipped: 0, Time elapsed: 0.721 sec
Running org.apache.activemq.JmsTopicTransactionTest
Tests run: 14, Failures: 0, Errors: 0, Skipped: 0, Time elapsed: 20.627 sec
Running org.apache.activemq.JmsTopicWildcardSendReceiveTest
Tests run: 4, Failures: 0, Errors: 0, Skipped: 0, Time elapsed: 1.909 sec
Running org.apache.activemq.LargeStreamletTest
Tests run: 1, Failures: 0, Errors: 0, Skipped: 0, Time elapsed: 1.61 sec
Running org.apache.activemq.MessageEvictionTest
Tests run: 3, Failures: 0, Errors: 0, Skipped: 0, Time elapsed: 96.008 sec
Running org.apache.activemq.MessageListenerRedeliveryTest
Tests run: 4, Failures: 0, Errors: 0, Skipped: 0, Time elapsed: 16.952 sec
Running org.apache.activemq.MessageTransformationTest
Tests run: 2, Failures: 0, Errors: 0, Skipped: 0, Time elapsed: 0.175 sec
Running org.apache.activemq.OnePrefetchAsyncConsumerTest
Tests run: 1, Failures: 0, Errors: 0, Skipped: 0, Time elapsed: 6.606 sec
Running org.apache.activemq.OptimizedAckTest
Tests run: 3, Failures: 0, Errors: 0, Skipped: 0, Time elapsed: 15.836 sec
Running org.apache.activemq.PerDestinationStoreLimitTest
Tests run: 2, Failures: 0, Errors: 0, Skipped: 0, Time elapsed: 43.564 sec
Running org.apache.activemq.ProducerFlowControlSendFailTest
Tests run: 7, Failures: 0, Errors: 0, Skipped: 0, Time elapsed: 18.488 sec
Running org.apache.activemq.ProducerFlowControlTest
Tests run: 6, Failures: 0, Errors: 0, Skipped: 0, Time elapsed: 26.028 sec
Running org.apache.activemq.QueueConsumerPriorityTest
Tests run: 1, Failures: 0, Errors: 0, Skipped: 0, Time elapsed: 5.673 sec
Running org.apache.activemq.ReconnectWithSameClientIDTest
Tests run: 2, Failures: 0, Errors: 0, Skipped: 0, Time elapsed: 4.821 sec
Running org.apache.activemq.RedeliveryPolicyTest
Tests run: 10, Failures: 0, Errors: 0, Skipped: 0, Time elapsed: 15.197 sec
Running org.apache.activemq.RemoveDestinationTest
Tests run: 2, Failures: 0, Errors: 0, Skipped: 0, Time elapsed: 20.216 sec
Running org.apache.activemq.TimeStampTest
Tests run: 1, Failures: 0, Errors: 0, Skipped: 0, Time elapsed: 4.552 sec
Running org.apache.activemq.TransactionContextTest
Tests run: 2, Failures: 0, Errors: 0, Skipped: 0, Time elapsed: 2.477 sec
Running org.apache.activemq.ZeroPrefetchConsumerTest
Tests run: 11, Failures: 0, Errors: 0, Skipped: 0, Time elapsed: 22.739 sec
Running org.apache.activemq.advisory.ConsumerListenerTest
Tests run: 2, Failures: 0, Errors: 0, Skipped: 0, Time elapsed: 0.755 sec
Running org.apache.activemq.advisory.DestinationListenerTest
Tests run: 3, Failures: 0, Errors: 0, Skipped: 0, Time elapsed: 7.901 sec
Running org.apache.activemq.advisory.MasterSlaveTempQueueMemoryTest
Tests run: 6, Failures: 0, Errors: 0, Skipped: 0, Time elapsed: 40.625 sec
Running org.apache.activemq.advisory.ProducerListenerTest
Tests run: 2, Failures: 0, Errors: 0, Skipped: 0, Time elapsed: 0.743 sec
Running org.apache.activemq.advisory.TempDestDeleteTest
Tests run: 2, Failures: 0, Errors: 0, Skipped: 0, Time elapsed: 0.773 sec
Running org.apache.activemq.advisory.TempDestLoadTest
Tests run: 2, Failures: 0, Errors: 0, Skipped: 0, Time elapsed: 18.244 sec
Running org.apache.activemq.advisory.TempQueueMemoryTest
Tests run: 2, Failures: 0, Errors: 0, Skipped: 0, Time elapsed: 20.27 sec
Running org.apache.activemq.blob.BlobTransferPolicyUriTest
Tests run: 1, Failures: 0, Errors: 0, Skipped: 0, Time elapsed: 0.177 sec
Running org.apache.activemq.blob.FTPBlobDownloadStrategyTest
Tests run: 3, Failures: 0, Errors: 0, Skipped: 0, Time elapsed: 1.77 sec
Running org.apache.activemq.blob.FTPBlobTest
Tests run: 1, Failures: 0, Errors: 0, Skipped: 0, Time elapsed: 1.997 sec
Running org.apache.activemq.blob.FTPBlobUploadStrategyTest
Tests run: 2, Failures: 0, Errors: 0, Skipped: 0, Time elapsed: 0.954 sec
Running org.apache.activemq.blob.FilesystemBlobTest
Tests run: 1, Failures: 0, Errors: 0, Skipped: 0, Time elapsed: 1.683 sec
Running org.apache.activemq.broker.BrokerRedeliveryTest
Tests run: 1, Failures: 0, Errors: 0, Skipped: 0, Time elapsed: 9.124 sec
Running org.apache.activemq.broker.BrokerServiceTest
Tests run: 5, Failures: 0, Errors: 0, Skipped: 0, Time elapsed: 4.634 sec
Running org.apache.activemq.broker.BrokerTest
Tests run: 129, Failures: 0, Errors: 0, Skipped: 0, Time elapsed: 21.435 sec
Running org.apache.activemq.broker.ConcurrentConnectSimulationTest
Tests run: 1, Failures: 0, Errors: 0, Skipped: 0, Time elapsed: 0.586 sec
Running org.apache.activemq.broker.CreateDestinationsOnStartupViaXBeanTest
Tests run: 1, Failures: 0, Errors: 0, Skipped: 0, Time elapsed: 2.238 sec
Running org.apache.activemq.broker.DedicatedTaskRunnerBrokerTest
Tests run: 129, Failures: 0, Errors: 0, Skipped: 0, Time elapsed: 21.45 sec
Running org.apache.activemq.broker.DoubleSubscriptionTest
Tests run: 1, Failures: 0, Errors: 0, Skipped: 0, Time elapsed: 2.535 sec
Running org.apache.activemq.broker.DurablePersistentFalseRestartTest
Tests run: 1, Failures: 0, Errors: 0, Skipped: 0, Time elapsed: 6.724 sec
Running org.apache.activemq.broker.JdbcXARecoveryBrokerTest
Tests run: 16, Failures: 0, Errors: 0, Skipped: 0, Time elapsed: 132.524 sec
Running org.apache.activemq.broker.MessageExpirationTest
Tests run: 13, Failures: 0, Errors: 0, Skipped: 0, Time elapsed: 23.152 sec
Running org.apache.activemq.broker.OutOfOrderXMLTest
Tests run: 1, Failures: 0, Errors: 0, Skipped: 0, Time elapsed: 1.483 sec
Running org.apache.activemq.broker.QueueMbeanRestartTest
Tests run: 2, Failures: 0, Errors: 0, Skipped: 0, Time elapsed: 14.69 sec
Running org.apache.activemq.broker.QueueSubscriptionTest
Tests run: 8, Failures: 0, Errors: 0, Skipped: 0, Time elapsed: 3.495 sec
Running org.apache.activemq.broker.ReconnectWithJMXEnabledTest
Tests run: 1, Failures: 0, Errors: 0, Skipped: 0, Time elapsed: 4.628 sec
Running org.apache.activemq.broker.RecoveryBrokerTest
Tests run: 9, Failures: 0, Errors: 0, Skipped: 0, Time elapsed: 32.917 sec
Running org.apache.activemq.broker.RedeliveryRestartTest
Tests run: 2, Failures: 0, Errors: 0, Skipped: 0, Time elapsed: 12.33 sec
Running org.apache.activemq.broker.SpringTest
Tests run: 1, Failures: 0, Errors: 0, Skipped: 0, Time elapsed: 2.746 sec
Running org.apache.activemq.broker.TopicSubscriptionTest
Tests run: 8, Failures: 0, Errors: 0, Skipped: 0, Time elapsed: 4.292 sec
Running org.apache.activemq.broker.XARecoveryBrokerTest
Tests run: 16, Failures: 0, Errors: 0, Skipped: 0, Time elapsed: 73.393 sec
Running org.apache.activemq.broker.advisory.AdvisoryBrokerTest
Tests run: 6, Failures: 0, Errors: 0, Skipped: 0, Time elapsed: 0.85 sec
Running org.apache.activemq.broker.advisory.AdvisoryDuplexNetworkBridgeTest
Tests run: 2, Failures: 0, Errors: 0, Skipped: 0, Time elapsed: 11.739 sec
Running org.apache.activemq.broker.advisory.AdvisoryJmxTest
Tests run: 1, Failures: 0, Errors: 0, Skipped: 0, Time elapsed: 0.704 sec
Running org.apache.activemq.broker.advisory.AdvisoryNetworkBridgeTest
Tests run: 2, Failures: 0, Errors: 0, Skipped: 0, Time elapsed: 10.876 sec
Running org.apache.activemq.broker.ft.DbRestartJDBCQueueMasterSlaveLeaseQuiesceTest
Running org.apache.activemq.broker.ft.DbRestartJDBCQueueMasterSlaveLeaseTest
Tests run: 2, Failures: 0, Errors: 0, Skipped: 0, Time elapsed: 80.394 sec
Running org.apache.activemq.broker.ft.DbRestartJDBCQueueMasterSlaveTest
Running org.apache.activemq.broker.ft.JDBCQueueMasterSlaveTest
Tests run: 2, Failures: 0, Errors: 0, Skipped: 0, Time elapsed: 164.621 sec
Running org.apache.activemq.broker.ft.MasterSlaveProducerFlowControlTest
Tests run: 6, Failures: 0, Errors: 0, Skipped: 0, Time elapsed: 26.381 sec
Running org.apache.activemq.broker.ft.MasterSlaveSlaveDieTest
Tests run: 1, Failures: 0, Errors: 0, Skipped: 0, Time elapsed: 2.734 sec
Running org.apache.activemq.broker.ft.MasterSlaveSlaveShutdownTest
Tests run: 1, Failures: 0, Errors: 0, Skipped: 0, Time elapsed: 33.136 sec
Running org.apache.activemq.broker.ft.QueueMasterSlaveSingleUrlTest
Tests run: 2, Failures: 1, Errors: 0, Skipped: 0, Time elapsed: 55.288 sec <<< FAILURE!
testVirtualTopicFailover(org.apache.activemq.broker.ft.QueueMasterSlaveSingleUrlTest) Time elapsed: 30747 sec <<< FAILURE!
junit.framework.AssertionFailedError: slave started
at junit.framework.Assert.fail(Assert.java:50)
at junit.framework.Assert.assertTrue(Assert.java:20)
at org.apache.activemq.broker.ft.QueueMasterSlaveTest.testVirtualTopicFailover(QueueMasterSlaveTest.java:125)
at sun.reflect.NativeMethodAccessorImpl.invoke0(Native Method)
at sun.reflect.NativeMethodAccessorImpl.invoke(NativeMethodAccessorImpl.java:57)
at sun.reflect.DelegatingMethodAccessorImpl.invoke(DelegatingMethodAccessorImpl.java:43)
at java.lang.reflect.Method.invoke(Method.java:601)
at junit.framework.TestCase.runTest(TestCase.java:168)
at junit.framework.TestCase.runBare(TestCase.java:134)
at org.apache.activemq.CombinationTestSupport.runBare(CombinationTestSupport.java:90)
at org.apache.activemq.CombinationTestSupport.runBare(CombinationTestSupport.java:96)
at junit.framework.TestResult$1.protect(TestResult.java:110)
at junit.framework.TestResult.runProtected(TestResult.java:128)
at junit.framework.TestResult.run(TestResult.java:113)
at junit.framework.TestCase.run(TestCase.java:124)
at junit.framework.TestSuite.runTest(TestSuite.java:243)
at junit.framework.TestSuite.run(TestSuite.java:238)
at org.junit.internal.runners.JUnit38ClassRunner.run(JUnit38ClassRunner.java:83)
at org.apache.maven.surefire.junit4.JUnit4Provider.execute(JUnit4Provider.java:252)
at org.apache.maven.surefire.junit4.JUnit4Provider.executeTestSet(JUnit4Provider.java:141)
at org.apache.maven.surefire.junit4.JUnit4Provider.invoke(JUnit4Provider.java:112)
at sun.reflect.NativeMethodAccessorImpl.invoke0(Native Method)
at sun.reflect.NativeMethodAccessorImpl.invoke(NativeMethodAccessorImpl.java:57)
at sun.reflect.DelegatingMethodAccessorImpl.invoke(DelegatingMethodAccessorImpl.java:43)
at java.lang.reflect.Method.invoke(Method.java:601)
at org.apache.maven.surefire.util.ReflectionUtils.invokeMethodWithArray(ReflectionUtils.java:189)
at org.apache.maven.surefire.booter.ProviderFactory$ProviderProxy.invoke(ProviderFactory.java:165)
at org.apache.maven.surefire.booter.ProviderFactory.invokeProvider(ProviderFactory.java:85)
at org.apache.maven.surefire.booter.ForkedBooter.runSuitesInProcess(ForkedBooter.java:115)
at org.apache.maven.surefire.booter.ForkedBooter.main(ForkedBooter.java:75)
Running org.apache.activemq.broker.ft.QueueMasterSlaveTest
Tests run: 2, Failures: 0, Errors: 0, Skipped: 0, Time elapsed: 55.882 sec
Running org.apache.activemq.broker.ft.QueueMasterSlaveTestUsingSharedFileTest
Tests run: 2, Failures: 0, Errors: 0, Skipped: 0, Time elapsed: 34.685 sec
Running org.apache.activemq.broker.ft.QueueMasterSlaveUsingMasterConnectorElementCompositeQueueTest
Tests run: 2, Failures: 0, Errors: 0, Skipped: 0, Time elapsed: 75.441 sec
Running org.apache.activemq.broker.ft.QueueMasterSlaveUsingMasterConnectorElementTest
Tests run: 2, Failures: 0, Errors: 0, Skipped: 0, Time elapsed: 92.518 sec
Running org.apache.activemq.broker.ft.TopicMasterSlaveTest
Tests run: 2, Failures: 0, Errors: 0, Skipped: 0, Time elapsed: 122.979 sec
Running org.apache.activemq.broker.ft.TransactedTopicMasterSlaveTest
Results :
Failed tests: testConsumeExpiredQueueAndDlq(org.apache.activemq.JmsSendReceiveWithMessageExpirationTest): got dlq messages expected:<99> but was:<100>
testVirtualTopicFailover(org.apache.activemq.broker.ft.QueueMasterSlaveSingleUrlTest): slave started
Tests run: 927, Failures: 2, Errors: 0, Skipped: 0
mojoFailed org.apache.maven.plugins:maven-surefire-plugin:2.12.3(default-test)
[JENKINS] Recording test results
projectFailed org.apache.activemq:activemq-core:5.7-SNAPSHOT
Build failed in Jenkins: ActiveMQ-Java7 » ActiveMQ :: Core #14
Posted by Apache Jenkins Server <je...@builds.apache.org>.
See <https://builds.apache.org/job/ActiveMQ-Java7/org.apache.activemq$activemq-core/14/changes>
Changes:
[dejanb] https://issues.apache.org/jira/browse/AMQ-3887 - do safeWaitUntilStarted outside of the synchronized block as deadlocks are possible
------------------------------------------
[...truncated 230 lines...]
Tests run: 1, Failures: 0, Errors: 0, Skipped: 0, Time elapsed: 0.73 sec
Running org.apache.activemq.JmsTopicSendReceiveTest
Tests run: 1, Failures: 0, Errors: 0, Skipped: 0, Time elapsed: 0.744 sec
Running org.apache.activemq.JmsTopicSendReceiveWithTwoConnectionsTest
Tests run: 1, Failures: 0, Errors: 0, Skipped: 0, Time elapsed: 0.773 sec
Running org.apache.activemq.JmsTopicSendReceiveWithTwoConnectionsWithJMXTest
Tests run: 1, Failures: 0, Errors: 0, Skipped: 0, Time elapsed: 0.752 sec
Running org.apache.activemq.JmsTopicSendSameMessageTest
Tests run: 1, Failures: 0, Errors: 0, Skipped: 0, Time elapsed: 0.767 sec
Running org.apache.activemq.JmsTopicTransactionTest
Tests run: 14, Failures: 0, Errors: 0, Skipped: 0, Time elapsed: 20.611 sec
Running org.apache.activemq.JmsTopicWildcardSendReceiveTest
Tests run: 4, Failures: 0, Errors: 0, Skipped: 0, Time elapsed: 2.112 sec
Running org.apache.activemq.LargeStreamletTest
Tests run: 1, Failures: 0, Errors: 0, Skipped: 0, Time elapsed: 1.581 sec
Running org.apache.activemq.MessageEvictionTest
Tests run: 3, Failures: 0, Errors: 0, Skipped: 0, Time elapsed: 84.632 sec
Running org.apache.activemq.MessageListenerRedeliveryTest
Tests run: 4, Failures: 0, Errors: 0, Skipped: 0, Time elapsed: 16.97 sec
Running org.apache.activemq.MessageTransformationTest
Tests run: 2, Failures: 0, Errors: 0, Skipped: 0, Time elapsed: 0.145 sec
Running org.apache.activemq.OnePrefetchAsyncConsumerTest
Tests run: 1, Failures: 0, Errors: 0, Skipped: 0, Time elapsed: 6.535 sec
Running org.apache.activemq.OptimizedAckTest
Tests run: 3, Failures: 0, Errors: 0, Skipped: 0, Time elapsed: 15.942 sec
Running org.apache.activemq.PerDestinationStoreLimitTest
Tests run: 2, Failures: 0, Errors: 0, Skipped: 0, Time elapsed: 39.933 sec
Running org.apache.activemq.ProducerFlowControlSendFailTest
Tests run: 7, Failures: 0, Errors: 0, Skipped: 0, Time elapsed: 18.453 sec
Running org.apache.activemq.ProducerFlowControlTest
Tests run: 6, Failures: 0, Errors: 0, Skipped: 0, Time elapsed: 25.563 sec
Running org.apache.activemq.QueueConsumerPriorityTest
Tests run: 1, Failures: 0, Errors: 0, Skipped: 0, Time elapsed: 5.942 sec
Running org.apache.activemq.ReconnectWithSameClientIDTest
Tests run: 2, Failures: 0, Errors: 0, Skipped: 0, Time elapsed: 4.92 sec
Running org.apache.activemq.RedeliveryPolicyTest
Tests run: 10, Failures: 0, Errors: 0, Skipped: 0, Time elapsed: 15.208 sec
Running org.apache.activemq.RemoveDestinationTest
Tests run: 2, Failures: 0, Errors: 0, Skipped: 0, Time elapsed: 19.057 sec
Running org.apache.activemq.TimeStampTest
Tests run: 1, Failures: 0, Errors: 0, Skipped: 0, Time elapsed: 4.502 sec
Running org.apache.activemq.TransactionContextTest
Tests run: 2, Failures: 0, Errors: 0, Skipped: 0, Time elapsed: 1.899 sec
Running org.apache.activemq.ZeroPrefetchConsumerTest
Tests run: 11, Failures: 0, Errors: 0, Skipped: 0, Time elapsed: 22.796 sec
Running org.apache.activemq.advisory.ConsumerListenerTest
Tests run: 2, Failures: 0, Errors: 0, Skipped: 0, Time elapsed: 0.851 sec
Running org.apache.activemq.advisory.DestinationListenerTest
Tests run: 3, Failures: 0, Errors: 0, Skipped: 0, Time elapsed: 7.952 sec
Running org.apache.activemq.advisory.MasterSlaveTempQueueMemoryTest
Tests run: 6, Failures: 0, Errors: 0, Skipped: 0, Time elapsed: 38.656 sec
Running org.apache.activemq.advisory.ProducerListenerTest
Tests run: 2, Failures: 0, Errors: 0, Skipped: 0, Time elapsed: 0.825 sec
Running org.apache.activemq.advisory.TempDestDeleteTest
Tests run: 2, Failures: 0, Errors: 0, Skipped: 0, Time elapsed: 0.882 sec
Running org.apache.activemq.advisory.TempDestLoadTest
Tests run: 2, Failures: 0, Errors: 0, Skipped: 0, Time elapsed: 23.01 sec
Running org.apache.activemq.advisory.TempQueueMemoryTest
Tests run: 2, Failures: 0, Errors: 0, Skipped: 0, Time elapsed: 24.932 sec
Running org.apache.activemq.blob.BlobTransferPolicyUriTest
Tests run: 1, Failures: 0, Errors: 0, Skipped: 0, Time elapsed: 0.141 sec
Running org.apache.activemq.blob.FTPBlobDownloadStrategyTest
Tests run: 3, Failures: 0, Errors: 0, Skipped: 0, Time elapsed: 1.675 sec
Running org.apache.activemq.blob.FTPBlobTest
Tests run: 1, Failures: 0, Errors: 0, Skipped: 0, Time elapsed: 2.077 sec
Running org.apache.activemq.blob.FTPBlobUploadStrategyTest
Tests run: 2, Failures: 0, Errors: 0, Skipped: 0, Time elapsed: 1.003 sec
Running org.apache.activemq.blob.FilesystemBlobTest
Tests run: 1, Failures: 0, Errors: 0, Skipped: 0, Time elapsed: 1.704 sec
Running org.apache.activemq.broker.BrokerRedeliveryTest
Tests run: 1, Failures: 0, Errors: 0, Skipped: 0, Time elapsed: 8.664 sec
Running org.apache.activemq.broker.BrokerServiceTest
Tests run: 5, Failures: 0, Errors: 0, Skipped: 0, Time elapsed: 4.593 sec
Running org.apache.activemq.broker.BrokerTest
Tests run: 129, Failures: 0, Errors: 0, Skipped: 0, Time elapsed: 22.352 sec
Running org.apache.activemq.broker.ConcurrentConnectSimulationTest
Tests run: 1, Failures: 0, Errors: 0, Skipped: 0, Time elapsed: 0.541 sec
Running org.apache.activemq.broker.CreateDestinationsOnStartupViaXBeanTest
Tests run: 1, Failures: 0, Errors: 0, Skipped: 0, Time elapsed: 2.016 sec
Running org.apache.activemq.broker.DedicatedTaskRunnerBrokerTest
Tests run: 129, Failures: 0, Errors: 0, Skipped: 0, Time elapsed: 21.805 sec
Running org.apache.activemq.broker.DoubleSubscriptionTest
Tests run: 1, Failures: 0, Errors: 0, Skipped: 0, Time elapsed: 2.54 sec
Running org.apache.activemq.broker.DurablePersistentFalseRestartTest
Tests run: 1, Failures: 0, Errors: 0, Skipped: 0, Time elapsed: 6.692 sec
Running org.apache.activemq.broker.JdbcXARecoveryBrokerTest
Tests run: 16, Failures: 0, Errors: 0, Skipped: 0, Time elapsed: 59.303 sec
Running org.apache.activemq.broker.MessageExpirationTest
Tests run: 13, Failures: 0, Errors: 0, Skipped: 0, Time elapsed: 22.392 sec
Running org.apache.activemq.broker.OutOfOrderXMLTest
Tests run: 1, Failures: 0, Errors: 0, Skipped: 0, Time elapsed: 1.212 sec
Running org.apache.activemq.broker.QueueMbeanRestartTest
Tests run: 2, Failures: 0, Errors: 0, Skipped: 0, Time elapsed: 3.754 sec
Running org.apache.activemq.broker.QueueSubscriptionTest
Tests run: 8, Failures: 0, Errors: 0, Skipped: 0, Time elapsed: 3.662 sec
Running org.apache.activemq.broker.ReconnectWithJMXEnabledTest
Tests run: 1, Failures: 0, Errors: 0, Skipped: 0, Time elapsed: 4.612 sec
Running org.apache.activemq.broker.RecoveryBrokerTest
Tests run: 9, Failures: 0, Errors: 0, Skipped: 0, Time elapsed: 25.947 sec
Running org.apache.activemq.broker.RedeliveryRestartTest
Tests run: 2, Failures: 0, Errors: 0, Skipped: 0, Time elapsed: 11.932 sec
Running org.apache.activemq.broker.SpringTest
Tests run: 1, Failures: 0, Errors: 0, Skipped: 0, Time elapsed: 2.332 sec
Running org.apache.activemq.broker.TopicSubscriptionTest
Tests run: 8, Failures: 0, Errors: 0, Skipped: 0, Time elapsed: 2.817 sec
Running org.apache.activemq.broker.XARecoveryBrokerTest
Tests run: 16, Failures: 0, Errors: 0, Skipped: 0, Time elapsed: 66.882 sec
Running org.apache.activemq.broker.advisory.AdvisoryBrokerTest
Tests run: 6, Failures: 0, Errors: 0, Skipped: 0, Time elapsed: 1.003 sec
Running org.apache.activemq.broker.advisory.AdvisoryDuplexNetworkBridgeTest
Tests run: 2, Failures: 0, Errors: 0, Skipped: 0, Time elapsed: 11.011 sec
Running org.apache.activemq.broker.advisory.AdvisoryJmxTest
Tests run: 1, Failures: 0, Errors: 0, Skipped: 0, Time elapsed: 0.805 sec
Running org.apache.activemq.broker.advisory.AdvisoryNetworkBridgeTest
Tests run: 2, Failures: 0, Errors: 0, Skipped: 0, Time elapsed: 10.72 sec
Running org.apache.activemq.broker.ft.DbRestartJDBCQueueMasterSlaveLeaseQuiesceTest
Tests run: 3, Failures: 0, Errors: 0, Skipped: 0, Time elapsed: 40.269 sec
Running org.apache.activemq.broker.ft.DbRestartJDBCQueueMasterSlaveLeaseTest
Tests run: 2, Failures: 0, Errors: 0, Skipped: 0, Time elapsed: 21.367 sec
Running org.apache.activemq.broker.ft.DbRestartJDBCQueueMasterSlaveTest
Running org.apache.activemq.broker.ft.JDBCQueueMasterSlaveTest
Tests run: 2, Failures: 0, Errors: 0, Skipped: 0, Time elapsed: 12.731 sec
Running org.apache.activemq.broker.ft.MasterSlaveProducerFlowControlTest
Tests run: 6, Failures: 0, Errors: 0, Skipped: 0, Time elapsed: 25.697 sec
Running org.apache.activemq.broker.ft.MasterSlaveSlaveDieTest
Tests run: 1, Failures: 0, Errors: 0, Skipped: 0, Time elapsed: 2.428 sec
Running org.apache.activemq.broker.ft.MasterSlaveSlaveShutdownTest
Tests run: 1, Failures: 0, Errors: 0, Skipped: 0, Time elapsed: 32.297 sec
Running org.apache.activemq.broker.ft.QueueMasterSlaveSingleUrlTest
Tests run: 2, Failures: 0, Errors: 0, Skipped: 0, Time elapsed: 13.735 sec
Running org.apache.activemq.broker.ft.QueueMasterSlaveTest
Tests run: 2, Failures: 0, Errors: 0, Skipped: 0, Time elapsed: 13.041 sec
Running org.apache.activemq.broker.ft.QueueMasterSlaveTestUsingSharedFileTest
Tests run: 2, Failures: 0, Errors: 0, Skipped: 0, Time elapsed: 27.513 sec
Running org.apache.activemq.broker.ft.QueueMasterSlaveUsingMasterConnectorElementCompositeQueueTest
Tests run: 2, Failures: 0, Errors: 0, Skipped: 0, Time elapsed: 13.276 sec
Running org.apache.activemq.broker.ft.QueueMasterSlaveUsingMasterConnectorElementTest
Tests run: 2, Failures: 0, Errors: 0, Skipped: 0, Time elapsed: 13.336 sec
Running org.apache.activemq.broker.ft.TopicMasterSlaveTest
Tests run: 2, Failures: 0, Errors: 0, Skipped: 0, Time elapsed: 13.499 sec
Running org.apache.activemq.broker.ft.TransactedTopicMasterSlaveTest
Tests run: 15, Failures: 0, Errors: 0, Skipped: 0, Time elapsed: 75.669 sec
Running org.apache.activemq.broker.jmx.BrokerViewSlowStoreStartupTest
Tests run: 1, Failures: 0, Errors: 0, Skipped: 0, Time elapsed: 1.018 sec
Running org.apache.activemq.broker.jmx.MBeanOperationTimeoutTest
Tests run: 1, Failures: 0, Errors: 0, Skipped: 0, Time elapsed: 9.357 sec
Running org.apache.activemq.broker.jmx.MBeanTest
Tests run: 19, Failures: 0, Errors: 0, Skipped: 0, Time elapsed: 55.152 sec
Running org.apache.activemq.broker.jmx.PurgeTest
Tests run: 5, Failures: 0, Errors: 0, Skipped: 0, Time elapsed: 17.615 sec
Running org.apache.activemq.broker.jmx.TransportConnectorMBeanTest
Tests run: 2, Failures: 0, Errors: 0, Skipped: 0, Time elapsed: 4.613 sec
Running org.apache.activemq.broker.mKahaDBXARecoveryBrokerTest
Tests run: 16, Failures: 0, Errors: 0, Skipped: 0, Time elapsed: 69.446 sec
Running org.apache.activemq.broker.message.security.MessageAuthenticationTest
Tests run: 1, Failures: 0, Errors: 0, Skipped: 0, Time elapsed: 0.777 sec
Running org.apache.activemq.broker.policy.AbortSlowConsumerTest
Tests run: 19, Failures: 0, Errors: 0, Skipped: 0, Time elapsed: 477.219 sec
Running org.apache.activemq.broker.policy.DeadLetterTest
Tests run: 4, Failures: 0, Errors: 0, Skipped: 0, Time elapsed: 2.726 sec
Running org.apache.activemq.broker.policy.DestinationCursorConfigTest
Tests run: 2, Failures: 0, Errors: 0, Skipped: 0, Time elapsed: 1.391 sec
Running org.apache.activemq.broker.policy.IndividualDeadLetterTest
Tests run: 5, Failures: 0, Errors: 0, Skipped: 0, Time elapsed: 4.954 sec
Running org.apache.activemq.broker.policy.IndividualDeadLetterViaXmlTest
Tests run: 4, Failures: 0, Errors: 0, Skipped: 0, Time elapsed: 3.974 sec
Running org.apache.activemq.broker.policy.MessageListenerDeadLetterTest
Tests run: 4, Failures: 0, Errors: 0, Skipped: 0, Time elapsed: 3.549 sec
Running org.apache.activemq.broker.policy.NoConsumerDeadLetterTest
Tests run: 5, Failures: 0, Errors: 0, Skipped: 0, Time elapsed: 2.08 sec
Running org.apache.activemq.broker.policy.NoRetryDeadLetterTest
Tests run: 4, Failures: 0, Errors: 0, Skipped: 0, Time elapsed: 1.292 sec
Running org.apache.activemq.broker.policy.PerDurableConsumerDeadLetterTest
Tests run: 4, Failures: 0, Errors: 0, Skipped: 0, Time elapsed: 2.748 sec
Running org.apache.activemq.broker.policy.PriorityNetworkDispatchPolicyTest
Tests run: 1, Failures: 0, Errors: 0, Skipped: 0, Time elapsed: 0.169 sec
Running org.apache.activemq.broker.policy.RoundRobinDispatchPolicyTest
Tests run: 9, Failures: 0, Errors: 0, Skipped: 0, Time elapsed: 3.745 sec
Running org.apache.activemq.broker.policy.SimpleDispatchPolicyTest
Tests run: 8, Failures: 0, Errors: 0, Skipped: 0, Time elapsed: 3.616 sec
Running org.apache.activemq.broker.policy.StrictOrderDispatchPolicyTest
Tests run: 8, Failures: 0, Errors: 0, Skipped: 0, Time elapsed: 3.806 sec
Running org.apache.activemq.broker.region.DestinationGCTest
Tests run: 2, Failures: 0, Errors: 0, Skipped: 0, Time elapsed: 13.811 sec
Running org.apache.activemq.broker.region.DestinationRemoveRestartTest
Tests run: 2, Failures: 0, Errors: 0, Skipped: 0, Time elapsed: 3.364 sec
Running org.apache.activemq.broker.region.QueueDuplicatesFromStoreTest
Tests run: 2, Failures: 0, Errors: 0, Skipped: 0, Time elapsed: 7.384 sec
Running org.apache.activemq.broker.region.QueueOptimizedDispatchExceptionTest
Tests run: 1, Failures: 0, Errors: 0, Skipped: 0, Time elapsed: 0.361 sec
Running org.apache.activemq.broker.region.QueuePurgeTest
Tests run: 3, Failures: 0, Errors: 0, Skipped: 0, Time elapsed: 86.298 sec
Running org.apache.activemq.broker.region.UniquePropertyMessageEvictionStrategyTest
Tests run: 1, Failures: 0, Errors: 0, Skipped: 0, Time elapsed: 11.891 sec
Running org.apache.activemq.broker.region.cursors.CursorDurableTest
Tests run: 2, Failures: 0, Errors: 0, Skipped: 0, Time elapsed: 4.179 sec
Running org.apache.activemq.broker.region.cursors.CursorQueueStoreTest
Tests run: 5, Failures: 0, Errors: 0, Skipped: 0, Time elapsed: 103.418 sec
Running org.apache.activemq.broker.region.cursors.FilePendingMessageCursorTest
Tests run: 2, Failures: 0, Errors: 0, Skipped: 0, Time elapsed: 2.216 sec
Running org.apache.activemq.broker.region.cursors.NegativeQueueTest
Tests run: 4, Failures: 0, Errors: 0, Skipped: 0, Time elapsed: 101.533 sec
Running org.apache.activemq.broker.region.cursors.OrderPendingListTest
Tests run: 9, Failures: 0, Errors: 0, Skipped: 0, Time elapsed: 0.256 sec
Running org.apache.activemq.broker.region.cursors.PrioritizedPendingListTest
Tests run: 7, Failures: 0, Errors: 0, Skipped: 0, Time elapsed: 0.263 sec
Running org.apache.activemq.broker.region.cursors.StoreBasedCursorTest
Tests run: 5, Failures: 0, Errors: 0, Skipped: 0, Time elapsed: 14.26 sec
Running org.apache.activemq.broker.region.cursors.StoreQueueCursorJDBCNoDuplicateTest
Tests run: 1, Failures: 0, Errors: 0, Skipped: 0, Time elapsed: 2.485 sec
Running org.apache.activemq.broker.region.cursors.StoreQueueCursorJournalNoDuplicateTest
Tests run: 1, Failures: 0, Errors: 0, Skipped: 0, Time elapsed: 0.559 sec
Running org.apache.activemq.broker.region.cursors.StoreQueueCursorKahaDBNoDuplicateTest
Tests run: 1, Failures: 0, Errors: 0, Skipped: 0, Time elapsed: 0.995 sec
Running org.apache.activemq.broker.region.cursors.StoreQueueCursorMemoryNoDuplicateTest
Tests run: 1, Failures: 0, Errors: 0, Skipped: 0, Time elapsed: 0.325 sec
Running org.apache.activemq.broker.region.cursors.StoreQueueCursorNoDuplicateTest
Tests run: 1, Failures: 0, Errors: 0, Skipped: 0, Time elapsed: 1.039 sec
Running org.apache.activemq.broker.region.group.MessageGroupHashBucketTest
Tests run: 2, Failures: 0, Errors: 0, Skipped: 0, Time elapsed: 0.025 sec
Running org.apache.activemq.broker.region.group.MessageGroupMapTest
Tests run: 2, Failures: 0, Errors: 0, Skipped: 0, Time elapsed: 0.025 sec
Running org.apache.activemq.broker.region.group.MessageGroupTest
Tests run: 3, Failures: 0, Errors: 0, Skipped: 0, Time elapsed: 1.213 sec
Running org.apache.activemq.broker.scheduler.CronParserTest
Tests run: 13, Failures: 0, Errors: 0, Skipped: 0, Time elapsed: 0.158 sec
Running org.apache.activemq.broker.scheduler.JmsCronSchedulerTest
Tests run: 2, Failures: 0, Errors: 0, Skipped: 0, Time elapsed: 198.438 sec
Running org.apache.activemq.broker.scheduler.JmsSchedulerTest
Tests run: 5, Failures: 0, Errors: 0, Skipped: 0, Time elapsed: 87.16 sec
Running org.apache.activemq.broker.scheduler.JobSchedulerManagementTest
Tests run: 7, Failures: 0, Errors: 0, Skipped: 0, Time elapsed: 75.246 sec
Running org.apache.activemq.broker.scheduler.JobSchedulerStoreTest
Tests run: 1, Failures: 0, Errors: 0, Skipped: 0, Time elapsed: 1.941 sec
Running org.apache.activemq.broker.scheduler.JobSchedulerTest
Tests run: 9, Failures: 0, Errors: 0, Skipped: 0, Time elapsed: 34.214 sec
Running org.apache.activemq.broker.store.DefaultStoreRecoveryBrokerTest
Tests run: 9, Failures: 0, Errors: 0, Skipped: 0, Time elapsed: 28.741 sec
Results :
Tests in error:
testCreateTcpConnectionUsingAllocatedPort(org.apache.activemq.ActiveMQXAConnectionFactoryTest): org.apache.activemq:BrokerName=localhost,Type=Broker
Tests run: 1170, Failures: 0, Errors: 1, Skipped: 0
mojoFailed org.apache.maven.plugins:maven-surefire-plugin:2.12.3(default-test)
[JENKINS] Recording test results
projectFailed org.apache.activemq:activemq-core:5.7-SNAPSHOT
Build failed in Jenkins: ActiveMQ-Java7 » ActiveMQ :: Core #13
Posted by Apache Jenkins Server <je...@builds.apache.org>.
See <https://builds.apache.org/job/ActiveMQ-Java7/org.apache.activemq$activemq-core/13/changes>
Changes:
[gtully] fix up assembly xml configuration validtion tests - have them run by default. Pull out osgi isms to separate hook and add shutdown hook when jetty.xml is included so that it is shutdown on broker stop. Fix problems with the xml eposed by the tests
[tabish] fix for: https://issues.apache.org/jira/browse/AMQ-4062
Durable consumer should be configured with the policyEntry configuration on activate.
[chirino] More work for AMQ-4080: Include the activemq-leveldb module in the assembly, don't use the fusesource leveldb module anymore.
[chirino] Fixes AMQ-4080: Integrate the Fusesource LevelDB module into the ActiveMQ build.
------------------------------------------
[...truncated 269 lines...]
Running org.apache.activemq.JmsTopicSelectorTest
Tests run: 3, Failures: 0, Errors: 0, Skipped: 0, Time elapsed: 8.818 sec
Running org.apache.activemq.JmsTopicSendReceiveSubscriberTest
Tests run: 1, Failures: 0, Errors: 0, Skipped: 0, Time elapsed: 0.729 sec
Running org.apache.activemq.JmsTopicSendReceiveTest
Tests run: 1, Failures: 0, Errors: 0, Skipped: 0, Time elapsed: 0.718 sec
Running org.apache.activemq.JmsTopicSendReceiveWithTwoConnectionsTest
Tests run: 1, Failures: 0, Errors: 0, Skipped: 0, Time elapsed: 0.735 sec
Running org.apache.activemq.JmsTopicSendReceiveWithTwoConnectionsWithJMXTest
Tests run: 1, Failures: 0, Errors: 0, Skipped: 0, Time elapsed: 0.73 sec
Running org.apache.activemq.JmsTopicSendSameMessageTest
Tests run: 1, Failures: 0, Errors: 0, Skipped: 0, Time elapsed: 0.719 sec
Running org.apache.activemq.JmsTopicTransactionTest
Tests run: 14, Failures: 0, Errors: 0, Skipped: 0, Time elapsed: 20.12 sec
Running org.apache.activemq.JmsTopicWildcardSendReceiveTest
Tests run: 4, Failures: 0, Errors: 0, Skipped: 0, Time elapsed: 1.95 sec
Running org.apache.activemq.LargeStreamletTest
Tests run: 1, Failures: 0, Errors: 0, Skipped: 0, Time elapsed: 1.614 sec
Running org.apache.activemq.MessageEvictionTest
Tests run: 3, Failures: 0, Errors: 0, Skipped: 0, Time elapsed: 90.325 sec
Running org.apache.activemq.MessageListenerRedeliveryTest
Tests run: 4, Failures: 0, Errors: 0, Skipped: 0, Time elapsed: 17.003 sec
Running org.apache.activemq.MessageTransformationTest
Tests run: 2, Failures: 0, Errors: 0, Skipped: 0, Time elapsed: 0.184 sec
Running org.apache.activemq.OnePrefetchAsyncConsumerTest
Tests run: 1, Failures: 0, Errors: 0, Skipped: 0, Time elapsed: 6.604 sec
Running org.apache.activemq.OptimizedAckTest
Tests run: 3, Failures: 0, Errors: 0, Skipped: 0, Time elapsed: 15.893 sec
Running org.apache.activemq.PerDestinationStoreLimitTest
Tests run: 2, Failures: 0, Errors: 0, Skipped: 0, Time elapsed: 40.34 sec
Running org.apache.activemq.ProducerFlowControlSendFailTest
Tests run: 7, Failures: 0, Errors: 0, Skipped: 0, Time elapsed: 18.511 sec
Running org.apache.activemq.ProducerFlowControlTest
Tests run: 6, Failures: 0, Errors: 0, Skipped: 0, Time elapsed: 25.628 sec
Running org.apache.activemq.QueueConsumerPriorityTest
Tests run: 1, Failures: 0, Errors: 0, Skipped: 0, Time elapsed: 5.701 sec
Running org.apache.activemq.ReconnectWithSameClientIDTest
Tests run: 2, Failures: 0, Errors: 0, Skipped: 0, Time elapsed: 4.832 sec
Running org.apache.activemq.RedeliveryPolicyTest
Tests run: 10, Failures: 0, Errors: 0, Skipped: 0, Time elapsed: 14.841 sec
Running org.apache.activemq.RemoveDestinationTest
Tests run: 2, Failures: 0, Errors: 0, Skipped: 0, Time elapsed: 19.351 sec
Running org.apache.activemq.TimeStampTest
Tests run: 1, Failures: 0, Errors: 0, Skipped: 0, Time elapsed: 4.549 sec
Running org.apache.activemq.TransactionContextTest
Tests run: 2, Failures: 0, Errors: 0, Skipped: 0, Time elapsed: 2.339 sec
Running org.apache.activemq.ZeroPrefetchConsumerTest
Tests run: 11, Failures: 0, Errors: 0, Skipped: 0, Time elapsed: 22.763 sec
Running org.apache.activemq.advisory.ConsumerListenerTest
Tests run: 2, Failures: 0, Errors: 0, Skipped: 0, Time elapsed: 0.777 sec
Running org.apache.activemq.advisory.DestinationListenerTest
Tests run: 3, Failures: 0, Errors: 0, Skipped: 0, Time elapsed: 7.961 sec
Running org.apache.activemq.advisory.MasterSlaveTempQueueMemoryTest
Tests run: 6, Failures: 0, Errors: 0, Skipped: 0, Time elapsed: 44.676 sec
Running org.apache.activemq.advisory.ProducerListenerTest
Tests run: 2, Failures: 0, Errors: 0, Skipped: 0, Time elapsed: 0.759 sec
Running org.apache.activemq.advisory.TempDestDeleteTest
Tests run: 2, Failures: 0, Errors: 0, Skipped: 0, Time elapsed: 0.796 sec
Running org.apache.activemq.advisory.TempDestLoadTest
Tests run: 2, Failures: 0, Errors: 0, Skipped: 0, Time elapsed: 20.57 sec
Running org.apache.activemq.advisory.TempQueueMemoryTest
Tests run: 2, Failures: 0, Errors: 0, Skipped: 0, Time elapsed: 21.889 sec
Running org.apache.activemq.blob.BlobTransferPolicyUriTest
Tests run: 1, Failures: 0, Errors: 0, Skipped: 0, Time elapsed: 0.181 sec
Running org.apache.activemq.blob.FTPBlobDownloadStrategyTest
Tests run: 3, Failures: 0, Errors: 0, Skipped: 0, Time elapsed: 1.822 sec
Running org.apache.activemq.blob.FTPBlobTest
Tests run: 1, Failures: 0, Errors: 0, Skipped: 0, Time elapsed: 2.041 sec
Running org.apache.activemq.blob.FTPBlobUploadStrategyTest
Tests run: 2, Failures: 0, Errors: 0, Skipped: 0, Time elapsed: 1.048 sec
Running org.apache.activemq.blob.FilesystemBlobTest
Tests run: 1, Failures: 0, Errors: 0, Skipped: 0, Time elapsed: 1.714 sec
Running org.apache.activemq.broker.BrokerRedeliveryTest
Tests run: 1, Failures: 0, Errors: 0, Skipped: 0, Time elapsed: 8.425 sec
Running org.apache.activemq.broker.BrokerServiceTest
Tests run: 5, Failures: 0, Errors: 0, Skipped: 0, Time elapsed: 4.632 sec
Running org.apache.activemq.broker.BrokerTest
Tests run: 129, Failures: 0, Errors: 0, Skipped: 0, Time elapsed: 22.593 sec
Running org.apache.activemq.broker.ConcurrentConnectSimulationTest
Tests run: 1, Failures: 0, Errors: 0, Skipped: 0, Time elapsed: 0.597 sec
Running org.apache.activemq.broker.CreateDestinationsOnStartupViaXBeanTest
Tests run: 1, Failures: 0, Errors: 0, Skipped: 0, Time elapsed: 2.266 sec
Running org.apache.activemq.broker.DedicatedTaskRunnerBrokerTest
Tests run: 129, Failures: 0, Errors: 0, Skipped: 0, Time elapsed: 21.584 sec
Running org.apache.activemq.broker.DoubleSubscriptionTest
Tests run: 1, Failures: 0, Errors: 0, Skipped: 0, Time elapsed: 2.549 sec
Running org.apache.activemq.broker.DurablePersistentFalseRestartTest
Tests run: 1, Failures: 0, Errors: 0, Skipped: 0, Time elapsed: 6.735 sec
Running org.apache.activemq.broker.JdbcXARecoveryBrokerTest
Tests run: 16, Failures: 0, Errors: 0, Skipped: 0, Time elapsed: 67.245 sec
Running org.apache.activemq.broker.MessageExpirationTest
Tests run: 13, Failures: 0, Errors: 0, Skipped: 0, Time elapsed: 22.241 sec
Running org.apache.activemq.broker.OutOfOrderXMLTest
Tests run: 1, Failures: 0, Errors: 0, Skipped: 0, Time elapsed: 1.352 sec
Running org.apache.activemq.broker.QueueMbeanRestartTest
Tests run: 2, Failures: 0, Errors: 0, Skipped: 0, Time elapsed: 5.262 sec
Running org.apache.activemq.broker.QueueSubscriptionTest
Tests run: 8, Failures: 0, Errors: 0, Skipped: 0, Time elapsed: 3.608 sec
Running org.apache.activemq.broker.ReconnectWithJMXEnabledTest
Tests run: 1, Failures: 0, Errors: 0, Skipped: 0, Time elapsed: 4.615 sec
Running org.apache.activemq.broker.RecoveryBrokerTest
Tests run: 9, Failures: 0, Errors: 0, Skipped: 0, Time elapsed: 29.958 sec
Running org.apache.activemq.broker.RedeliveryRestartTest
Tests run: 2, Failures: 0, Errors: 0, Skipped: 0, Time elapsed: 12.119 sec
Running org.apache.activemq.broker.SpringTest
Tests run: 1, Failures: 0, Errors: 0, Skipped: 0, Time elapsed: 2.736 sec
Running org.apache.activemq.broker.TopicSubscriptionTest
Tests run: 8, Failures: 0, Errors: 0, Skipped: 0, Time elapsed: 7.717 sec
Running org.apache.activemq.broker.XARecoveryBrokerTest
Tests run: 16, Failures: 0, Errors: 0, Skipped: 0, Time elapsed: 69.134 sec
Running org.apache.activemq.broker.advisory.AdvisoryBrokerTest
Tests run: 6, Failures: 0, Errors: 0, Skipped: 0, Time elapsed: 0.904 sec
Running org.apache.activemq.broker.advisory.AdvisoryDuplexNetworkBridgeTest
Tests run: 2, Failures: 0, Errors: 0, Skipped: 0, Time elapsed: 13.231 sec
Running org.apache.activemq.broker.advisory.AdvisoryJmxTest
Tests run: 1, Failures: 0, Errors: 0, Skipped: 0, Time elapsed: 0.74 sec
Running org.apache.activemq.broker.advisory.AdvisoryNetworkBridgeTest
Tests run: 2, Failures: 0, Errors: 0, Skipped: 0, Time elapsed: 10.772 sec
Running org.apache.activemq.broker.ft.DbRestartJDBCQueueMasterSlaveLeaseQuiesceTest
Tests run: 3, Failures: 0, Errors: 0, Skipped: 0, Time elapsed: 46.348 sec
Running org.apache.activemq.broker.ft.DbRestartJDBCQueueMasterSlaveLeaseTest
Tests run: 2, Failures: 0, Errors: 0, Skipped: 0, Time elapsed: 24.24 sec
Running org.apache.activemq.broker.ft.DbRestartJDBCQueueMasterSlaveTest
Running org.apache.activemq.broker.ft.JDBCQueueMasterSlaveTest
Tests run: 2, Failures: 0, Errors: 0, Skipped: 0, Time elapsed: 15.398 sec
Running org.apache.activemq.broker.ft.MasterSlaveProducerFlowControlTest
Tests run: 6, Failures: 0, Errors: 0, Skipped: 0, Time elapsed: 25.761 sec
Running org.apache.activemq.broker.ft.MasterSlaveSlaveDieTest
Tests run: 1, Failures: 0, Errors: 0, Skipped: 0, Time elapsed: 2.447 sec
Running org.apache.activemq.broker.ft.MasterSlaveSlaveShutdownTest
Tests run: 1, Failures: 0, Errors: 0, Skipped: 0, Time elapsed: 32.354 sec
Running org.apache.activemq.broker.ft.QueueMasterSlaveSingleUrlTest
Tests run: 2, Failures: 0, Errors: 0, Skipped: 0, Time elapsed: 14.722 sec
Running org.apache.activemq.broker.ft.QueueMasterSlaveTest
Tests run: 2, Failures: 0, Errors: 0, Skipped: 0, Time elapsed: 15.697 sec
Running org.apache.activemq.broker.ft.QueueMasterSlaveTestUsingSharedFileTest
Tests run: 2, Failures: 0, Errors: 0, Skipped: 0, Time elapsed: 27.902 sec
Running org.apache.activemq.broker.ft.QueueMasterSlaveUsingMasterConnectorElementCompositeQueueTest
Tests run: 2, Failures: 0, Errors: 0, Skipped: 0, Time elapsed: 16.283 sec
Running org.apache.activemq.broker.ft.QueueMasterSlaveUsingMasterConnectorElementTest
Tests run: 2, Failures: 0, Errors: 0, Skipped: 0, Time elapsed: 16.255 sec
Running org.apache.activemq.broker.ft.TopicMasterSlaveTest
Tests run: 2, Failures: 0, Errors: 0, Skipped: 0, Time elapsed: 14.25 sec
Running org.apache.activemq.broker.ft.TransactedTopicMasterSlaveTest
Tests run: 15, Failures: 0, Errors: 0, Skipped: 0, Time elapsed: 78.189 sec
Running org.apache.activemq.broker.jmx.BrokerViewSlowStoreStartupTest
Tests run: 1, Failures: 0, Errors: 0, Skipped: 0, Time elapsed: 1.024 sec
Running org.apache.activemq.broker.jmx.MBeanOperationTimeoutTest
Tests run: 1, Failures: 0, Errors: 0, Skipped: 0, Time elapsed: 14.769 sec
Running org.apache.activemq.broker.jmx.MBeanTest
Tests run: 19, Failures: 0, Errors: 0, Skipped: 0, Time elapsed: 54.965 sec
Running org.apache.activemq.broker.jmx.PurgeTest
Tests run: 5, Failures: 0, Errors: 0, Skipped: 0, Time elapsed: 22.894 sec
Running org.apache.activemq.broker.jmx.TransportConnectorMBeanTest
Tests run: 2, Failures: 0, Errors: 0, Skipped: 0, Time elapsed: 4.624 sec
Running org.apache.activemq.broker.mKahaDBXARecoveryBrokerTest
Tests run: 16, Failures: 0, Errors: 0, Skipped: 0, Time elapsed: 80.38 sec
Running org.apache.activemq.broker.message.security.MessageAuthenticationTest
Tests run: 1, Failures: 0, Errors: 0, Skipped: 0, Time elapsed: 0.706 sec
Running org.apache.activemq.broker.policy.AbortSlowConsumerTest
Tests run: 19, Failures: 0, Errors: 0, Skipped: 0, Time elapsed: 113.671 sec
Running org.apache.activemq.broker.policy.DeadLetterTest
Tests run: 4, Failures: 0, Errors: 0, Skipped: 0, Time elapsed: 2.555 sec
Running org.apache.activemq.broker.policy.DestinationCursorConfigTest
Tests run: 2, Failures: 0, Errors: 0, Skipped: 0, Time elapsed: 1.572 sec
Running org.apache.activemq.broker.policy.IndividualDeadLetterTest
Tests run: 5, Failures: 0, Errors: 0, Skipped: 0, Time elapsed: 4.512 sec
Running org.apache.activemq.broker.policy.IndividualDeadLetterViaXmlTest
Tests run: 4, Failures: 0, Errors: 0, Skipped: 0, Time elapsed: 3.646 sec
Running org.apache.activemq.broker.policy.MessageListenerDeadLetterTest
Tests run: 4, Failures: 0, Errors: 0, Skipped: 0, Time elapsed: 3.198 sec
Running org.apache.activemq.broker.policy.NoConsumerDeadLetterTest
Tests run: 5, Failures: 0, Errors: 0, Skipped: 0, Time elapsed: 1.909 sec
Running org.apache.activemq.broker.policy.NoRetryDeadLetterTest
Tests run: 4, Failures: 0, Errors: 0, Skipped: 0, Time elapsed: 1.1 sec
Running org.apache.activemq.broker.policy.PerDurableConsumerDeadLetterTest
Tests run: 4, Failures: 0, Errors: 0, Skipped: 0, Time elapsed: 2.431 sec
Running org.apache.activemq.broker.policy.PriorityNetworkDispatchPolicyTest
Tests run: 1, Failures: 0, Errors: 0, Skipped: 0, Time elapsed: 0.224 sec
Running org.apache.activemq.broker.policy.RoundRobinDispatchPolicyTest
Tests run: 9, Failures: 0, Errors: 0, Skipped: 0, Time elapsed: 4.527 sec
Running org.apache.activemq.broker.policy.SimpleDispatchPolicyTest
Tests run: 8, Failures: 0, Errors: 0, Skipped: 0, Time elapsed: 3.807 sec
Running org.apache.activemq.broker.policy.StrictOrderDispatchPolicyTest
Tests run: 8, Failures: 0, Errors: 0, Skipped: 0, Time elapsed: 5.936 sec
Running org.apache.activemq.broker.region.DestinationGCTest
Tests run: 2, Failures: 0, Errors: 0, Skipped: 0, Time elapsed: 13.698 sec
Running org.apache.activemq.broker.region.DestinationRemoveRestartTest
Tests run: 2, Failures: 0, Errors: 0, Skipped: 0, Time elapsed: 3.636 sec
Running org.apache.activemq.broker.region.QueueDuplicatesFromStoreTest
Tests run: 2, Failures: 0, Errors: 0, Skipped: 0, Time elapsed: 18.783 sec
Running org.apache.activemq.broker.region.QueueOptimizedDispatchExceptionTest
Tests run: 1, Failures: 0, Errors: 0, Skipped: 0, Time elapsed: 0.429 sec
Running org.apache.activemq.broker.region.QueuePurgeTest
Tests run: 3, Failures: 0, Errors: 0, Skipped: 0, Time elapsed: 389.128 sec
Running org.apache.activemq.broker.region.UniquePropertyMessageEvictionStrategyTest
Tests run: 1, Failures: 0, Errors: 0, Skipped: 0, Time elapsed: 11.762 sec
Running org.apache.activemq.broker.region.cursors.CursorDurableTest
Tests run: 2, Failures: 0, Errors: 0, Skipped: 0, Time elapsed: 4.395 sec
Running org.apache.activemq.broker.region.cursors.CursorQueueStoreTest
Tests run: 5, Failures: 0, Errors: 0, Skipped: 0, Time elapsed: 104.482 sec
Running org.apache.activemq.broker.region.cursors.FilePendingMessageCursorTest
Tests run: 2, Failures: 0, Errors: 0, Skipped: 0, Time elapsed: 2.286 sec
Running org.apache.activemq.broker.region.cursors.NegativeQueueTest
Tests run: 4, Failures: 0, Errors: 0, Skipped: 0, Time elapsed: 111.507 sec
Running org.apache.activemq.broker.region.cursors.OrderPendingListTest
Tests run: 9, Failures: 0, Errors: 0, Skipped: 0, Time elapsed: 0.292 sec
Running org.apache.activemq.broker.region.cursors.PrioritizedPendingListTest
Tests run: 7, Failures: 0, Errors: 0, Skipped: 0, Time elapsed: 0.305 sec
Running org.apache.activemq.broker.region.cursors.StoreBasedCursorTest
Tests run: 5, Failures: 0, Errors: 0, Skipped: 0, Time elapsed: 15.004 sec
Running org.apache.activemq.broker.region.cursors.StoreQueueCursorJDBCNoDuplicateTest
Tests run: 1, Failures: 0, Errors: 0, Skipped: 0, Time elapsed: 3.113 sec
Running org.apache.activemq.broker.region.cursors.StoreQueueCursorJournalNoDuplicateTest
Tests run: 1, Failures: 0, Errors: 0, Skipped: 0, Time elapsed: 0.579 sec
Running org.apache.activemq.broker.region.cursors.StoreQueueCursorKahaDBNoDuplicateTest
Tests run: 1, Failures: 0, Errors: 0, Skipped: 0, Time elapsed: 1.252 sec
Running org.apache.activemq.broker.region.cursors.StoreQueueCursorMemoryNoDuplicateTest
Tests run: 1, Failures: 0, Errors: 0, Skipped: 0, Time elapsed: 0.39 sec
Running org.apache.activemq.broker.region.cursors.StoreQueueCursorNoDuplicateTest
Tests run: 1, Failures: 0, Errors: 0, Skipped: 0, Time elapsed: 1.258 sec
Running org.apache.activemq.broker.region.group.MessageGroupHashBucketTest
Tests run: 2, Failures: 0, Errors: 0, Skipped: 0, Time elapsed: 0.03 sec
Running org.apache.activemq.broker.region.group.MessageGroupMapTest
Tests run: 2, Failures: 0, Errors: 0, Skipped: 0, Time elapsed: 0.029 sec
Running org.apache.activemq.broker.region.group.MessageGroupTest
Tests run: 3, Failures: 0, Errors: 0, Skipped: 0, Time elapsed: 1.134 sec
Running org.apache.activemq.broker.scheduler.CronParserTest
Tests run: 13, Failures: 0, Errors: 0, Skipped: 0, Time elapsed: 0.204 sec
Running org.apache.activemq.broker.scheduler.JmsCronSchedulerTest
Tests run: 2, Failures: 0, Errors: 0, Skipped: 0, Time elapsed: 199.07 sec
Running org.apache.activemq.broker.scheduler.JmsSchedulerTest
Tests run: 5, Failures: 0, Errors: 0, Skipped: 0, Time elapsed: 87.742 sec
Running org.apache.activemq.broker.scheduler.JobSchedulerManagementTest
Tests run: 7, Failures: 0, Errors: 0, Skipped: 0, Time elapsed: 77.009 sec
Running org.apache.activemq.broker.scheduler.JobSchedulerStoreTest
Results :
Tests in error:
testCreateTcpConnectionUsingAllocatedPort(org.apache.activemq.ActiveMQConnectionFactoryTest): org.apache.activemq:BrokerName=localhost,Type=Broker
testCreateTcpConnectionUsingAllocatedPort(org.apache.activemq.ActiveMQXAConnectionFactoryTest): org.apache.activemq:BrokerName=localhost,Type=Broker
Tests run: 1151, Failures: 0, Errors: 2, Skipped: 0
mojoFailed org.apache.maven.plugins:maven-surefire-plugin:2.12.3(default-test)
[JENKINS] Recording test results
Tests run: 1, Failures: 0, Errors: 0, Skipped: 0, Time elapsed: 10.657 sec
projectFailed org.apache.activemq:activemq-core:5.7-SNAPSHOT
Build failed in Jenkins: ActiveMQ-Java7 » ActiveMQ :: Core #12
Posted by Apache Jenkins Server <je...@builds.apache.org>.
See <https://builds.apache.org/job/ActiveMQ-Java7/org.apache.activemq$activemq-core/12/changes>
Changes:
[gtully] https://issues.apache.org/jira/browse/AMQ-4076 https://issues.apache.org/jira/browse/AMQ-498 - default to unlimited maxFrameSize - explicit limits in the xml config with DOS comment
[dejanb] removing activemq-version pom variable and using project.version directly
[dejanb] https://issues.apache.org/jira/browse/AMQ-3918 - don't bind http based transports to local host name and do better url registering
------------------------------------------
[...truncated 146 lines...]
Running org.apache.activemq.JmsCreateConsumerInOnMessageTest
Tests run: 1, Failures: 0, Errors: 0, Skipped: 0, Time elapsed: 0.669 sec
Running org.apache.activemq.JmsDurableQueueWildcardSendReceiveTest
Tests run: 1, Failures: 0, Errors: 0, Skipped: 0, Time elapsed: 1.803 sec
Running org.apache.activemq.JmsDurableTopicSelectorTest
Tests run: 3, Failures: 0, Errors: 0, Skipped: 0, Time elapsed: 8.793 sec
Running org.apache.activemq.JmsDurableTopicSendReceiveTest
Tests run: 2, Failures: 0, Errors: 0, Skipped: 0, Time elapsed: 3.823 sec
Running org.apache.activemq.JmsDurableTopicTransactionTest
Tests run: 14, Failures: 0, Errors: 0, Skipped: 0, Time elapsed: 20.085 sec
Running org.apache.activemq.JmsDurableTopicWildcardSendReceiveTest
Tests run: 1, Failures: 0, Errors: 0, Skipped: 0, Time elapsed: 1.723 sec
Running org.apache.activemq.JmsQueueBrowserTest
Tests run: 8, Failures: 0, Errors: 0, Skipped: 0, Time elapsed: 9.732 sec
Running org.apache.activemq.JmsQueueCompositeSendReceiveTest
Tests run: 2, Failures: 0, Errors: 0, Skipped: 0, Time elapsed: 2.115 sec
Running org.apache.activemq.JmsQueueRequestReplyTest
Tests run: 2, Failures: 0, Errors: 0, Skipped: 0, Time elapsed: 0.829 sec
Running org.apache.activemq.JmsQueueSelectorTest
Tests run: 3, Failures: 0, Errors: 0, Skipped: 0, Time elapsed: 3.823 sec
Running org.apache.activemq.JmsQueueSendReceiveTest
Tests run: 1, Failures: 0, Errors: 0, Skipped: 0, Time elapsed: 1.755 sec
Running org.apache.activemq.JmsQueueSendReceiveTwoConnectionsStartBeforeBrokerTest
Tests run: 1, Failures: 0, Errors: 0, Skipped: 0, Time elapsed: 3.541 sec
Running org.apache.activemq.JmsQueueSendReceiveTwoConnectionsTest
Tests run: 1, Failures: 0, Errors: 0, Skipped: 0, Time elapsed: 1.745 sec
Running org.apache.activemq.JmsQueueSendReceiveUsingTwoSessionsTest
Tests run: 1, Failures: 0, Errors: 0, Skipped: 0, Time elapsed: 1.749 sec
Running org.apache.activemq.JmsQueueTopicCompositeSendReceiveTest
Tests run: 1, Failures: 0, Errors: 0, Skipped: 0, Time elapsed: 1.77 sec
Running org.apache.activemq.JmsQueueTransactionTest
Tests run: 17, Failures: 0, Errors: 0, Skipped: 0, Time elapsed: 22.337 sec
Running org.apache.activemq.JmsQueueWildcardSendReceiveTest
Tests run: 4, Failures: 0, Errors: 0, Skipped: 0, Time elapsed: 2.001 sec
Running org.apache.activemq.JmsRedeliveredTest
Tests run: 18, Failures: 0, Errors: 0, Skipped: 0, Time elapsed: 13.536 sec
Running org.apache.activemq.JmsRollbackRedeliveryTest
Tests run: 9, Failures: 0, Errors: 0, Skipped: 0, Time elapsed: 10.882 sec
Running org.apache.activemq.JmsSendReceiveWithMessageExpirationTest
Tests run: 5, Failures: 0, Errors: 0, Skipped: 0, Time elapsed: 18.188 sec
Running org.apache.activemq.JmsSendWithAsyncCallbackTest
Tests run: 1, Failures: 0, Errors: 0, Skipped: 0, Time elapsed: 3.277 sec
Running org.apache.activemq.JmsSessionRecoverTest
Tests run: 6, Failures: 0, Errors: 0, Skipped: 0, Time elapsed: 6.97 sec
Running org.apache.activemq.JmsTempDestinationTest
Tests run: 8, Failures: 0, Errors: 0, Skipped: 0, Time elapsed: 38.245 sec
Running org.apache.activemq.JmsTopicCompositeSendReceiveTest
Tests run: 1, Failures: 0, Errors: 0, Skipped: 0, Time elapsed: 1.747 sec
Running org.apache.activemq.JmsTopicRedeliverTest
Tests run: 1, Failures: 0, Errors: 0, Skipped: 0, Time elapsed: 1.661 sec
Running org.apache.activemq.JmsTopicRequestReplyTest
Tests run: 2, Failures: 0, Errors: 0, Skipped: 0, Time elapsed: 0.785 sec
Running org.apache.activemq.JmsTopicSelectorTest
Tests run: 3, Failures: 0, Errors: 0, Skipped: 0, Time elapsed: 8.798 sec
Running org.apache.activemq.JmsTopicSendReceiveSubscriberTest
Tests run: 1, Failures: 0, Errors: 0, Skipped: 0, Time elapsed: 0.707 sec
Running org.apache.activemq.JmsTopicSendReceiveTest
Tests run: 1, Failures: 0, Errors: 0, Skipped: 0, Time elapsed: 0.707 sec
Running org.apache.activemq.JmsTopicSendReceiveWithTwoConnectionsTest
Tests run: 1, Failures: 0, Errors: 0, Skipped: 0, Time elapsed: 0.723 sec
Running org.apache.activemq.JmsTopicSendReceiveWithTwoConnectionsWithJMXTest
Tests run: 1, Failures: 0, Errors: 0, Skipped: 0, Time elapsed: 0.844 sec
Running org.apache.activemq.JmsTopicSendSameMessageTest
Tests run: 1, Failures: 0, Errors: 0, Skipped: 0, Time elapsed: 0.725 sec
Running org.apache.activemq.JmsTopicTransactionTest
Tests run: 14, Failures: 0, Errors: 0, Skipped: 0, Time elapsed: 20.081 sec
Running org.apache.activemq.JmsTopicWildcardSendReceiveTest
Tests run: 4, Failures: 0, Errors: 0, Skipped: 0, Time elapsed: 1.93 sec
Running org.apache.activemq.LargeStreamletTest
Tests run: 1, Failures: 0, Errors: 0, Skipped: 0, Time elapsed: 1.615 sec
Running org.apache.activemq.MessageEvictionTest
Tests run: 3, Failures: 0, Errors: 0, Skipped: 0, Time elapsed: 93.163 sec
Running org.apache.activemq.MessageListenerRedeliveryTest
Tests run: 4, Failures: 0, Errors: 0, Skipped: 0, Time elapsed: 16.963 sec
Running org.apache.activemq.MessageTransformationTest
Tests run: 2, Failures: 0, Errors: 0, Skipped: 0, Time elapsed: 0.184 sec
Running org.apache.activemq.OnePrefetchAsyncConsumerTest
Tests run: 1, Failures: 0, Errors: 0, Skipped: 0, Time elapsed: 6.611 sec
Running org.apache.activemq.OptimizedAckTest
Tests run: 3, Failures: 0, Errors: 0, Skipped: 0, Time elapsed: 14.839 sec
Running org.apache.activemq.PerDestinationStoreLimitTest
Tests run: 2, Failures: 0, Errors: 0, Skipped: 0, Time elapsed: 41.151 sec
Running org.apache.activemq.ProducerFlowControlSendFailTest
Tests run: 7, Failures: 0, Errors: 0, Skipped: 0, Time elapsed: 18.507 sec
Running org.apache.activemq.ProducerFlowControlTest
Tests run: 6, Failures: 0, Errors: 0, Skipped: 0, Time elapsed: 25.899 sec
Running org.apache.activemq.QueueConsumerPriorityTest
Tests run: 1, Failures: 0, Errors: 0, Skipped: 0, Time elapsed: 5.729 sec
Running org.apache.activemq.ReconnectWithSameClientIDTest
Tests run: 2, Failures: 0, Errors: 0, Skipped: 0, Time elapsed: 4.802 sec
Running org.apache.activemq.RedeliveryPolicyTest
Tests run: 10, Failures: 0, Errors: 0, Skipped: 0, Time elapsed: 15.151 sec
Running org.apache.activemq.RemoveDestinationTest
Tests run: 2, Failures: 0, Errors: 0, Skipped: 0, Time elapsed: 33.628 sec
Running org.apache.activemq.TimeStampTest
Tests run: 1, Failures: 0, Errors: 0, Skipped: 0, Time elapsed: 4.555 sec
Running org.apache.activemq.TransactionContextTest
Tests run: 2, Failures: 0, Errors: 0, Skipped: 0, Time elapsed: 2.541 sec
Running org.apache.activemq.ZeroPrefetchConsumerTest
Tests run: 11, Failures: 0, Errors: 0, Skipped: 0, Time elapsed: 23.1 sec
Running org.apache.activemq.advisory.ConsumerListenerTest
Tests run: 2, Failures: 0, Errors: 0, Skipped: 0, Time elapsed: 0.762 sec
Running org.apache.activemq.advisory.DestinationListenerTest
Tests run: 3, Failures: 0, Errors: 0, Skipped: 0, Time elapsed: 7.925 sec
Running org.apache.activemq.advisory.MasterSlaveTempQueueMemoryTest
Tests run: 6, Failures: 0, Errors: 0, Skipped: 0, Time elapsed: 44.685 sec
Running org.apache.activemq.advisory.ProducerListenerTest
Tests run: 2, Failures: 0, Errors: 0, Skipped: 0, Time elapsed: 0.745 sec
Running org.apache.activemq.advisory.TempDestDeleteTest
Tests run: 2, Failures: 0, Errors: 0, Skipped: 0, Time elapsed: 0.771 sec
Running org.apache.activemq.advisory.TempDestLoadTest
Tests run: 2, Failures: 0, Errors: 0, Skipped: 0, Time elapsed: 19.086 sec
Running org.apache.activemq.advisory.TempQueueMemoryTest
Tests run: 2, Failures: 0, Errors: 0, Skipped: 0, Time elapsed: 20.203 sec
Running org.apache.activemq.blob.BlobTransferPolicyUriTest
Tests run: 1, Failures: 0, Errors: 0, Skipped: 0, Time elapsed: 0.184 sec
Running org.apache.activemq.blob.FTPBlobDownloadStrategyTest
Tests run: 3, Failures: 0, Errors: 0, Skipped: 0, Time elapsed: 1.811 sec
Running org.apache.activemq.blob.FTPBlobTest
Tests run: 1, Failures: 0, Errors: 0, Skipped: 0, Time elapsed: 2.021 sec
Running org.apache.activemq.blob.FTPBlobUploadStrategyTest
Tests run: 2, Failures: 0, Errors: 0, Skipped: 0, Time elapsed: 0.979 sec
Running org.apache.activemq.blob.FilesystemBlobTest
Tests run: 1, Failures: 0, Errors: 0, Skipped: 0, Time elapsed: 1.708 sec
Running org.apache.activemq.broker.BrokerRedeliveryTest
Tests run: 1, Failures: 0, Errors: 0, Skipped: 0, Time elapsed: 9.865 sec
Running org.apache.activemq.broker.BrokerServiceTest
Tests run: 5, Failures: 0, Errors: 0, Skipped: 0, Time elapsed: 4.626 sec
Running org.apache.activemq.broker.BrokerTest
Tests run: 129, Failures: 0, Errors: 0, Skipped: 0, Time elapsed: 25.751 sec
Running org.apache.activemq.broker.ConcurrentConnectSimulationTest
Tests run: 1, Failures: 0, Errors: 0, Skipped: 0, Time elapsed: 0.607 sec
Running org.apache.activemq.broker.CreateDestinationsOnStartupViaXBeanTest
Tests run: 1, Failures: 0, Errors: 0, Skipped: 0, Time elapsed: 2.819 sec
Running org.apache.activemq.broker.DedicatedTaskRunnerBrokerTest
Tests run: 129, Failures: 0, Errors: 0, Skipped: 0, Time elapsed: 21.513 sec
Running org.apache.activemq.broker.DoubleSubscriptionTest
Tests run: 1, Failures: 0, Errors: 0, Skipped: 0, Time elapsed: 3.065 sec
Running org.apache.activemq.broker.DurablePersistentFalseRestartTest
Tests run: 1, Failures: 0, Errors: 0, Skipped: 0, Time elapsed: 7.266 sec
Running org.apache.activemq.broker.JdbcXARecoveryBrokerTest
Tests run: 16, Failures: 0, Errors: 0, Skipped: 0, Time elapsed: 158.194 sec
Running org.apache.activemq.broker.MessageExpirationTest
Tests run: 13, Failures: 0, Errors: 0, Skipped: 0, Time elapsed: 23.131 sec
Running org.apache.activemq.broker.OutOfOrderXMLTest
Tests run: 1, Failures: 0, Errors: 0, Skipped: 0, Time elapsed: 1.555 sec
Running org.apache.activemq.broker.QueueMbeanRestartTest
Tests run: 2, Failures: 0, Errors: 0, Skipped: 0, Time elapsed: 15.504 sec
Running org.apache.activemq.broker.QueueSubscriptionTest
Tests run: 8, Failures: 0, Errors: 0, Skipped: 0, Time elapsed: 3.683 sec
Running org.apache.activemq.broker.ReconnectWithJMXEnabledTest
Tests run: 1, Failures: 0, Errors: 0, Skipped: 0, Time elapsed: 4.637 sec
Running org.apache.activemq.broker.RecoveryBrokerTest
Tests run: 9, Failures: 0, Errors: 0, Skipped: 0, Time elapsed: 29.904 sec
Running org.apache.activemq.broker.RedeliveryRestartTest
Tests run: 2, Failures: 0, Errors: 0, Skipped: 0, Time elapsed: 12.08 sec
Running org.apache.activemq.broker.SpringTest
Tests run: 1, Failures: 0, Errors: 0, Skipped: 0, Time elapsed: 2.84 sec
Running org.apache.activemq.broker.TopicSubscriptionTest
Tests run: 8, Failures: 0, Errors: 0, Skipped: 0, Time elapsed: 6.509 sec
Running org.apache.activemq.broker.XARecoveryBrokerTest
Tests run: 16, Failures: 0, Errors: 0, Skipped: 0, Time elapsed: 73.961 sec
Running org.apache.activemq.broker.advisory.AdvisoryBrokerTest
Tests run: 6, Failures: 0, Errors: 0, Skipped: 0, Time elapsed: 0.866 sec
Running org.apache.activemq.broker.advisory.AdvisoryDuplexNetworkBridgeTest
Tests run: 2, Failures: 0, Errors: 0, Skipped: 0, Time elapsed: 11.642 sec
Running org.apache.activemq.broker.advisory.AdvisoryJmxTest
Tests run: 1, Failures: 0, Errors: 0, Skipped: 0, Time elapsed: 0.768 sec
Running org.apache.activemq.broker.advisory.AdvisoryNetworkBridgeTest
Tests run: 2, Failures: 0, Errors: 0, Skipped: 0, Time elapsed: 10.893 sec
Running org.apache.activemq.broker.ft.DbRestartJDBCQueueMasterSlaveLeaseQuiesceTest
Running org.apache.activemq.broker.ft.DbRestartJDBCQueueMasterSlaveLeaseTest
Tests run: 2, Failures: 0, Errors: 0, Skipped: 0, Time elapsed: 55.771 sec
Running org.apache.activemq.broker.ft.DbRestartJDBCQueueMasterSlaveTest
Running org.apache.activemq.broker.ft.JDBCQueueMasterSlaveTest
Tests run: 2, Failures: 0, Errors: 0, Skipped: 0, Time elapsed: 49.915 sec
Running org.apache.activemq.broker.ft.MasterSlaveProducerFlowControlTest
Tests run: 6, Failures: 0, Errors: 0, Skipped: 0, Time elapsed: 25.732 sec
Running org.apache.activemq.broker.ft.MasterSlaveSlaveDieTest
Tests run: 1, Failures: 0, Errors: 0, Skipped: 0, Time elapsed: 2.496 sec
Running org.apache.activemq.broker.ft.MasterSlaveSlaveShutdownTest
Tests run: 1, Failures: 0, Errors: 0, Skipped: 0, Time elapsed: 32.343 sec
Running org.apache.activemq.broker.ft.QueueMasterSlaveSingleUrlTest
Tests run: 2, Failures: 0, Errors: 0, Skipped: 0, Time elapsed: 15.43 sec
Running org.apache.activemq.broker.ft.QueueMasterSlaveTest
Tests run: 2, Failures: 0, Errors: 0, Skipped: 0, Time elapsed: 26.257 sec
Running org.apache.activemq.broker.ft.QueueMasterSlaveTestUsingSharedFileTest
Tests run: 2, Failures: 0, Errors: 0, Skipped: 0, Time elapsed: 30.317 sec
Running org.apache.activemq.broker.ft.QueueMasterSlaveUsingMasterConnectorElementCompositeQueueTest
Tests run: 2, Failures: 0, Errors: 0, Skipped: 0, Time elapsed: 50.856 sec
Running org.apache.activemq.broker.ft.QueueMasterSlaveUsingMasterConnectorElementTest
Tests run: 2, Failures: 0, Errors: 0, Skipped: 0, Time elapsed: 33.091 sec
Running org.apache.activemq.broker.ft.TopicMasterSlaveTest
Tests run: 2, Failures: 0, Errors: 0, Skipped: 0, Time elapsed: 24.88 sec
Running org.apache.activemq.broker.ft.TransactedTopicMasterSlaveTest
Tests run: 15, Failures: 0, Errors: 0, Skipped: 0, Time elapsed: 89.827 sec
Running org.apache.activemq.broker.jmx.BrokerViewSlowStoreStartupTest
Tests run: 1, Failures: 0, Errors: 0, Skipped: 0, Time elapsed: 1.214 sec
Running org.apache.activemq.broker.jmx.MBeanOperationTimeoutTest
Tests run: 1, Failures: 0, Errors: 0, Skipped: 0, Time elapsed: 34.191 sec
Running org.apache.activemq.broker.jmx.MBeanTest
Tests run: 19, Failures: 0, Errors: 0, Skipped: 0, Time elapsed: 55.049 sec
Running org.apache.activemq.broker.jmx.PurgeTest
Tests run: 5, Failures: 0, Errors: 0, Skipped: 0, Time elapsed: 96.304 sec
Running org.apache.activemq.broker.jmx.TransportConnectorMBeanTest
Tests run: 2, Failures: 0, Errors: 0, Skipped: 0, Time elapsed: 4.678 sec
Running org.apache.activemq.broker.mKahaDBXARecoveryBrokerTest
Tests run: 16, Failures: 0, Errors: 0, Skipped: 0, Time elapsed: 86.239 sec
Running org.apache.activemq.broker.message.security.MessageAuthenticationTest
Tests run: 1, Failures: 0, Errors: 0, Skipped: 0, Time elapsed: 0.725 sec
Running org.apache.activemq.broker.policy.AbortSlowConsumerTest
Tests run: 19, Failures: 0, Errors: 0, Skipped: 0, Time elapsed: 113.738 sec
Running org.apache.activemq.broker.policy.DeadLetterTest
Tests run: 4, Failures: 0, Errors: 0, Skipped: 0, Time elapsed: 2.311 sec
Running org.apache.activemq.broker.policy.DestinationCursorConfigTest
Tests run: 2, Failures: 0, Errors: 0, Skipped: 0, Time elapsed: 1.589 sec
Running org.apache.activemq.broker.policy.IndividualDeadLetterTest
Tests run: 5, Failures: 0, Errors: 0, Skipped: 0, Time elapsed: 4.528 sec
Running org.apache.activemq.broker.policy.IndividualDeadLetterViaXmlTest
Tests run: 4, Failures: 0, Errors: 0, Skipped: 0, Time elapsed: 3.674 sec
Running org.apache.activemq.broker.policy.MessageListenerDeadLetterTest
Tests run: 4, Failures: 0, Errors: 0, Skipped: 0, Time elapsed: 2.906 sec
Running org.apache.activemq.broker.policy.NoConsumerDeadLetterTest
Tests run: 5, Failures: 0, Errors: 0, Skipped: 0, Time elapsed: 1.886 sec
Running org.apache.activemq.broker.policy.NoRetryDeadLetterTest
Tests run: 4, Failures: 0, Errors: 0, Skipped: 0, Time elapsed: 1.014 sec
Running org.apache.activemq.broker.policy.PerDurableConsumerDeadLetterTest
Tests run: 4, Failures: 0, Errors: 0, Skipped: 0, Time elapsed: 2.296 sec
Running org.apache.activemq.broker.policy.PriorityNetworkDispatchPolicyTest
Tests run: 1, Failures: 0, Errors: 0, Skipped: 0, Time elapsed: 0.215 sec
Running org.apache.activemq.broker.policy.RoundRobinDispatchPolicyTest
Tests run: 9, Failures: 0, Errors: 0, Skipped: 0, Time elapsed: 3.987 sec
Running org.apache.activemq.broker.policy.SimpleDispatchPolicyTest
Tests run: 8, Failures: 0, Errors: 0, Skipped: 0, Time elapsed: 3.276 sec
Running org.apache.activemq.broker.policy.StrictOrderDispatchPolicyTest
Tests run: 8, Failures: 0, Errors: 0, Skipped: 0, Time elapsed: 4.694 sec
Running org.apache.activemq.broker.region.DestinationGCTest
Tests run: 2, Failures: 0, Errors: 0, Skipped: 0, Time elapsed: 13.703 sec
Running org.apache.activemq.broker.region.DestinationRemoveRestartTest
Tests run: 2, Failures: 0, Errors: 0, Skipped: 0, Time elapsed: 4.46 sec
Running org.apache.activemq.broker.region.QueueDuplicatesFromStoreTest
Results :
Tests run: 1068, Failures: 0, Errors: 0, Skipped: 0
mojoFailed org.apache.maven.plugins:maven-surefire-plugin:2.12.3(default-test)
[JENKINS] Recording test results
projectFailed org.apache.activemq:activemq-core:5.7-SNAPSHOT
Build failed in Jenkins: ActiveMQ-Java7 » ActiveMQ :: Core #11
Posted by Apache Jenkins Server <je...@builds.apache.org>.
See <https://builds.apache.org/job/ActiveMQ-Java7/org.apache.activemq$activemq-core/11/changes>
Changes:
[davsclaus] AMQ-4069: Upgraded maven plugin versions to latest releases.
[davsclaus] Added missing license header. More exclude to rat plugin.
[tabish] fix for: https://issues.apache.org/jira/browse/AMQ-3298
Add property preferJndiDestinationLookup so that users can override the default order as needed and have the connector first go to JNDI before trying the JMS create method.
[tabish] fix for: https://issues.apache.org/jira/browse/AMQ-730
Update some JavaDocs
------------------------------------------
[...truncated 234 lines...]
Running org.apache.activemq.JmsTopicCompositeSendReceiveTest
Tests run: 1, Failures: 0, Errors: 0, Skipped: 0, Time elapsed: 1.814 sec
Running org.apache.activemq.JmsTopicRedeliverTest
Tests run: 1, Failures: 0, Errors: 0, Skipped: 0, Time elapsed: 1.72 sec
Running org.apache.activemq.JmsTopicRequestReplyTest
Tests run: 2, Failures: 0, Errors: 0, Skipped: 0, Time elapsed: 0.863 sec
Running org.apache.activemq.JmsTopicSelectorTest
Tests run: 3, Failures: 0, Errors: 0, Skipped: 0, Time elapsed: 8.886 sec
Running org.apache.activemq.JmsTopicSendReceiveSubscriberTest
Tests run: 1, Failures: 0, Errors: 0, Skipped: 0, Time elapsed: 0.785 sec
Running org.apache.activemq.JmsTopicSendReceiveTest
Tests run: 1, Failures: 0, Errors: 0, Skipped: 0, Time elapsed: 0.783 sec
Running org.apache.activemq.JmsTopicSendReceiveWithTwoConnectionsTest
Tests run: 1, Failures: 0, Errors: 0, Skipped: 0, Time elapsed: 0.798 sec
Running org.apache.activemq.JmsTopicSendReceiveWithTwoConnectionsWithJMXTest
Tests run: 1, Failures: 0, Errors: 0, Skipped: 0, Time elapsed: 0.807 sec
Running org.apache.activemq.JmsTopicSendSameMessageTest
Tests run: 1, Failures: 0, Errors: 0, Skipped: 0, Time elapsed: 0.812 sec
Running org.apache.activemq.JmsTopicTransactionTest
Tests run: 14, Failures: 0, Errors: 0, Skipped: 0, Time elapsed: 20.425 sec
Running org.apache.activemq.JmsTopicWildcardSendReceiveTest
Tests run: 4, Failures: 0, Errors: 0, Skipped: 0, Time elapsed: 2.041 sec
Running org.apache.activemq.LargeStreamletTest
Tests run: 1, Failures: 0, Errors: 0, Skipped: 0, Time elapsed: 1.666 sec
Running org.apache.activemq.MessageEvictionTest
Tests run: 3, Failures: 0, Errors: 0, Skipped: 0, Time elapsed: 90.378 sec
Running org.apache.activemq.MessageListenerRedeliveryTest
Tests run: 4, Failures: 0, Errors: 0, Skipped: 0, Time elapsed: 17.096 sec
Running org.apache.activemq.MessageTransformationTest
Tests run: 2, Failures: 0, Errors: 0, Skipped: 0, Time elapsed: 0.18 sec
Running org.apache.activemq.OnePrefetchAsyncConsumerTest
Tests run: 1, Failures: 0, Errors: 0, Skipped: 0, Time elapsed: 6.654 sec
Running org.apache.activemq.OptimizedAckTest
Tests run: 3, Failures: 0, Errors: 0, Skipped: 0, Time elapsed: 14.918 sec
Running org.apache.activemq.PerDestinationStoreLimitTest
Tests run: 2, Failures: 0, Errors: 0, Skipped: 0, Time elapsed: 40.427 sec
Running org.apache.activemq.ProducerFlowControlSendFailTest
Tests run: 7, Failures: 0, Errors: 0, Skipped: 0, Time elapsed: 18.521 sec
Running org.apache.activemq.ProducerFlowControlTest
Tests run: 6, Failures: 0, Errors: 0, Skipped: 0, Time elapsed: 25.645 sec
Running org.apache.activemq.QueueConsumerPriorityTest
Tests run: 1, Failures: 0, Errors: 0, Skipped: 0, Time elapsed: 5.883 sec
Running org.apache.activemq.ReconnectWithSameClientIDTest
Tests run: 2, Failures: 0, Errors: 0, Skipped: 0, Time elapsed: 4.95 sec
Running org.apache.activemq.RedeliveryPolicyTest
Tests run: 10, Failures: 0, Errors: 0, Skipped: 0, Time elapsed: 14.995 sec
Running org.apache.activemq.RemoveDestinationTest
Tests run: 2, Failures: 0, Errors: 0, Skipped: 0, Time elapsed: 19.291 sec
Running org.apache.activemq.TimeStampTest
Tests run: 1, Failures: 0, Errors: 0, Skipped: 0, Time elapsed: 4.703 sec
Running org.apache.activemq.TransactionContextTest
Tests run: 2, Failures: 0, Errors: 0, Skipped: 0, Time elapsed: 2.262 sec
Running org.apache.activemq.ZeroPrefetchConsumerTest
Tests run: 11, Failures: 0, Errors: 0, Skipped: 0, Time elapsed: 22.868 sec
Running org.apache.activemq.advisory.ConsumerListenerTest
Tests run: 2, Failures: 0, Errors: 0, Skipped: 0, Time elapsed: 0.853 sec
Running org.apache.activemq.advisory.DestinationListenerTest
Tests run: 3, Failures: 0, Errors: 0, Skipped: 0, Time elapsed: 8.045 sec
Running org.apache.activemq.advisory.MasterSlaveTempQueueMemoryTest
Tests run: 6, Failures: 0, Errors: 0, Skipped: 0, Time elapsed: 44.716 sec
Running org.apache.activemq.advisory.ProducerListenerTest
Tests run: 2, Failures: 0, Errors: 0, Skipped: 0, Time elapsed: 0.832 sec
Running org.apache.activemq.advisory.TempDestDeleteTest
Tests run: 2, Failures: 0, Errors: 0, Skipped: 0, Time elapsed: 0.878 sec
Running org.apache.activemq.advisory.TempDestLoadTest
Tests run: 2, Failures: 0, Errors: 0, Skipped: 0, Time elapsed: 20.513 sec
Running org.apache.activemq.advisory.TempQueueMemoryTest
Tests run: 2, Failures: 0, Errors: 0, Skipped: 0, Time elapsed: 22.987 sec
Running org.apache.activemq.blob.BlobTransferPolicyUriTest
Tests run: 1, Failures: 0, Errors: 0, Skipped: 0, Time elapsed: 0.185 sec
Running org.apache.activemq.blob.FTPBlobDownloadStrategyTest
Tests run: 3, Failures: 0, Errors: 0, Skipped: 0, Time elapsed: 1.933 sec
Running org.apache.activemq.blob.FTPBlobTest
Tests run: 1, Failures: 0, Errors: 0, Skipped: 0, Time elapsed: 2.143 sec
Running org.apache.activemq.blob.FTPBlobUploadStrategyTest
Tests run: 2, Failures: 0, Errors: 0, Skipped: 0, Time elapsed: 1.143 sec
Running org.apache.activemq.blob.FilesystemBlobTest
Tests run: 1, Failures: 0, Errors: 0, Skipped: 0, Time elapsed: 1.792 sec
Running org.apache.activemq.broker.BrokerRedeliveryTest
Tests run: 1, Failures: 0, Errors: 0, Skipped: 0, Time elapsed: 8.467 sec
Running org.apache.activemq.broker.BrokerServiceTest
Tests run: 5, Failures: 0, Errors: 0, Skipped: 0, Time elapsed: 4.701 sec
Running org.apache.activemq.broker.BrokerTest
Tests run: 129, Failures: 0, Errors: 0, Skipped: 0, Time elapsed: 28.05 sec
Running org.apache.activemq.broker.ConcurrentConnectSimulationTest
Tests run: 1, Failures: 0, Errors: 0, Skipped: 0, Time elapsed: 0.662 sec
Running org.apache.activemq.broker.CreateDestinationsOnStartupViaXBeanTest
Tests run: 1, Failures: 0, Errors: 0, Skipped: 0, Time elapsed: 2.975 sec
Running org.apache.activemq.broker.DedicatedTaskRunnerBrokerTest
Tests run: 129, Failures: 0, Errors: 0, Skipped: 0, Time elapsed: 22.384 sec
Running org.apache.activemq.broker.DoubleSubscriptionTest
Tests run: 1, Failures: 0, Errors: 0, Skipped: 0, Time elapsed: 2.599 sec
Running org.apache.activemq.broker.DurablePersistentFalseRestartTest
Tests run: 1, Failures: 0, Errors: 0, Skipped: 0, Time elapsed: 6.782 sec
Running org.apache.activemq.broker.JdbcXARecoveryBrokerTest
Tests run: 16, Failures: 0, Errors: 0, Skipped: 0, Time elapsed: 65.514 sec
Running org.apache.activemq.broker.MessageExpirationTest
Tests run: 13, Failures: 0, Errors: 0, Skipped: 0, Time elapsed: 23.297 sec
Running org.apache.activemq.broker.OutOfOrderXMLTest
Tests run: 1, Failures: 0, Errors: 0, Skipped: 0, Time elapsed: 1.458 sec
Running org.apache.activemq.broker.QueueMbeanRestartTest
Tests run: 2, Failures: 0, Errors: 0, Skipped: 0, Time elapsed: 4.913 sec
Running org.apache.activemq.broker.QueueSubscriptionTest
Tests run: 8, Failures: 0, Errors: 0, Skipped: 0, Time elapsed: 4.562 sec
Running org.apache.activemq.broker.ReconnectWithJMXEnabledTest
Tests run: 1, Failures: 0, Errors: 0, Skipped: 0, Time elapsed: 4.681 sec
Running org.apache.activemq.broker.RecoveryBrokerTest
Tests run: 9, Failures: 0, Errors: 0, Skipped: 0, Time elapsed: 28.197 sec
Running org.apache.activemq.broker.RedeliveryRestartTest
Tests run: 2, Failures: 0, Errors: 0, Skipped: 0, Time elapsed: 11.644 sec
Running org.apache.activemq.broker.SpringTest
Tests run: 1, Failures: 0, Errors: 0, Skipped: 0, Time elapsed: 1.71 sec
Running org.apache.activemq.broker.TopicSubscriptionTest
Tests run: 8, Failures: 0, Errors: 0, Skipped: 0, Time elapsed: 7.573 sec
Running org.apache.activemq.broker.XARecoveryBrokerTest
Tests run: 16, Failures: 0, Errors: 0, Skipped: 0, Time elapsed: 66.446 sec
Running org.apache.activemq.broker.advisory.AdvisoryBrokerTest
Tests run: 6, Failures: 0, Errors: 0, Skipped: 0, Time elapsed: 0.968 sec
Running org.apache.activemq.broker.advisory.AdvisoryDuplexNetworkBridgeTest
Tests run: 2, Failures: 0, Errors: 0, Skipped: 0, Time elapsed: 11.259 sec
Running org.apache.activemq.broker.advisory.AdvisoryJmxTest
Tests run: 1, Failures: 0, Errors: 0, Skipped: 0, Time elapsed: 0.824 sec
Running org.apache.activemq.broker.advisory.AdvisoryNetworkBridgeTest
Tests run: 2, Failures: 0, Errors: 0, Skipped: 0, Time elapsed: 10.967 sec
Running org.apache.activemq.broker.ft.DbRestartJDBCQueueMasterSlaveLeaseQuiesceTest
Tests run: 3, Failures: 0, Errors: 0, Skipped: 0, Time elapsed: 44.541 sec
Running org.apache.activemq.broker.ft.DbRestartJDBCQueueMasterSlaveLeaseTest
Tests run: 2, Failures: 0, Errors: 0, Skipped: 0, Time elapsed: 24.43 sec
Running org.apache.activemq.broker.ft.DbRestartJDBCQueueMasterSlaveTest
Running org.apache.activemq.broker.ft.JDBCQueueMasterSlaveTest
Tests run: 2, Failures: 0, Errors: 0, Skipped: 0, Time elapsed: 15.392 sec
Running org.apache.activemq.broker.ft.MasterSlaveProducerFlowControlTest
Tests run: 6, Failures: 0, Errors: 0, Skipped: 0, Time elapsed: 25.789 sec
Running org.apache.activemq.broker.ft.MasterSlaveSlaveDieTest
Tests run: 1, Failures: 0, Errors: 0, Skipped: 0, Time elapsed: 2.506 sec
Running org.apache.activemq.broker.ft.MasterSlaveSlaveShutdownTest
Tests run: 1, Failures: 0, Errors: 0, Skipped: 0, Time elapsed: 32.353 sec
Running org.apache.activemq.broker.ft.QueueMasterSlaveSingleUrlTest
Tests run: 2, Failures: 0, Errors: 0, Skipped: 0, Time elapsed: 14.952 sec
Running org.apache.activemq.broker.ft.QueueMasterSlaveTest
Tests run: 2, Failures: 0, Errors: 0, Skipped: 0, Time elapsed: 15.625 sec
Running org.apache.activemq.broker.ft.QueueMasterSlaveTestUsingSharedFileTest
Tests run: 2, Failures: 0, Errors: 0, Skipped: 0, Time elapsed: 27.832 sec
Running org.apache.activemq.broker.ft.QueueMasterSlaveUsingMasterConnectorElementCompositeQueueTest
Tests run: 2, Failures: 0, Errors: 0, Skipped: 0, Time elapsed: 16.077 sec
Running org.apache.activemq.broker.ft.QueueMasterSlaveUsingMasterConnectorElementTest
Tests run: 2, Failures: 0, Errors: 0, Skipped: 0, Time elapsed: 16.07 sec
Running org.apache.activemq.broker.ft.TopicMasterSlaveTest
Tests run: 2, Failures: 0, Errors: 0, Skipped: 0, Time elapsed: 16.066 sec
Running org.apache.activemq.broker.ft.TransactedTopicMasterSlaveTest
Tests run: 15, Failures: 0, Errors: 0, Skipped: 0, Time elapsed: 75.729 sec
Running org.apache.activemq.broker.jmx.BrokerViewSlowStoreStartupTest
Tests run: 1, Failures: 0, Errors: 0, Skipped: 0, Time elapsed: 1.064 sec
Running org.apache.activemq.broker.jmx.MBeanOperationTimeoutTest
Tests run: 1, Failures: 0, Errors: 0, Skipped: 0, Time elapsed: 16.571 sec
Running org.apache.activemq.broker.jmx.MBeanTest
Tests run: 19, Failures: 0, Errors: 0, Skipped: 0, Time elapsed: 71.372 sec
Running org.apache.activemq.broker.jmx.PurgeTest
Tests run: 5, Failures: 0, Errors: 0, Skipped: 0, Time elapsed: 25.235 sec
Running org.apache.activemq.broker.jmx.TransportConnectorMBeanTest
Tests run: 2, Failures: 0, Errors: 0, Skipped: 0, Time elapsed: 4.67 sec
Running org.apache.activemq.broker.mKahaDBXARecoveryBrokerTest
Tests run: 16, Failures: 0, Errors: 0, Skipped: 0, Time elapsed: 69.981 sec
Running org.apache.activemq.broker.message.security.MessageAuthenticationTest
Tests run: 1, Failures: 0, Errors: 0, Skipped: 0, Time elapsed: 0.805 sec
Running org.apache.activemq.broker.policy.AbortSlowConsumerTest
Tests run: 19, Failures: 0, Errors: 0, Skipped: 0, Time elapsed: 113.945 sec
Running org.apache.activemq.broker.policy.DeadLetterTest
Tests run: 4, Failures: 0, Errors: 0, Skipped: 0, Time elapsed: 2.528 sec
Running org.apache.activemq.broker.policy.DestinationCursorConfigTest
Tests run: 2, Failures: 0, Errors: 0, Skipped: 0, Time elapsed: 1.715 sec
Running org.apache.activemq.broker.policy.IndividualDeadLetterTest
Tests run: 5, Failures: 0, Errors: 0, Skipped: 0, Time elapsed: 4.722 sec
Running org.apache.activemq.broker.policy.IndividualDeadLetterViaXmlTest
Tests run: 4, Failures: 0, Errors: 0, Skipped: 0, Time elapsed: 3.929 sec
Running org.apache.activemq.broker.policy.MessageListenerDeadLetterTest
Tests run: 4, Failures: 0, Errors: 0, Skipped: 0, Time elapsed: 3.524 sec
Running org.apache.activemq.broker.policy.NoConsumerDeadLetterTest
Tests run: 5, Failures: 0, Errors: 0, Skipped: 0, Time elapsed: 1.961 sec
Running org.apache.activemq.broker.policy.NoRetryDeadLetterTest
Tests run: 4, Failures: 0, Errors: 0, Skipped: 0, Time elapsed: 1.193 sec
Running org.apache.activemq.broker.policy.PerDurableConsumerDeadLetterTest
Tests run: 4, Failures: 0, Errors: 0, Skipped: 0, Time elapsed: 2.534 sec
Running org.apache.activemq.broker.policy.PriorityNetworkDispatchPolicyTest
Tests run: 1, Failures: 0, Errors: 0, Skipped: 0, Time elapsed: 0.218 sec
Running org.apache.activemq.broker.policy.RoundRobinDispatchPolicyTest
Tests run: 9, Failures: 0, Errors: 0, Skipped: 0, Time elapsed: 4.587 sec
Running org.apache.activemq.broker.policy.SimpleDispatchPolicyTest
Tests run: 8, Failures: 0, Errors: 0, Skipped: 0, Time elapsed: 4.396 sec
Running org.apache.activemq.broker.policy.StrictOrderDispatchPolicyTest
Tests run: 8, Failures: 0, Errors: 0, Skipped: 0, Time elapsed: 6.38 sec
Running org.apache.activemq.broker.region.DestinationGCTest
Tests run: 2, Failures: 0, Errors: 0, Skipped: 0, Time elapsed: 13.773 sec
Running org.apache.activemq.broker.region.DestinationRemoveRestartTest
Tests run: 2, Failures: 0, Errors: 0, Skipped: 0, Time elapsed: 3.553 sec
Running org.apache.activemq.broker.region.QueueDuplicatesFromStoreTest
Tests run: 2, Failures: 0, Errors: 0, Skipped: 0, Time elapsed: 16.729 sec
Running org.apache.activemq.broker.region.QueueOptimizedDispatchExceptionTest
Tests run: 1, Failures: 0, Errors: 0, Skipped: 0, Time elapsed: 0.477 sec
Running org.apache.activemq.broker.region.QueuePurgeTest
Tests run: 3, Failures: 0, Errors: 0, Skipped: 0, Time elapsed: 471.993 sec
Running org.apache.activemq.broker.region.UniquePropertyMessageEvictionStrategyTest
Tests run: 1, Failures: 0, Errors: 0, Skipped: 0, Time elapsed: 11.833 sec
Running org.apache.activemq.broker.region.cursors.CursorDurableTest
Tests run: 2, Failures: 0, Errors: 0, Skipped: 0, Time elapsed: 4.387 sec
Running org.apache.activemq.broker.region.cursors.CursorQueueStoreTest
Tests run: 5, Failures: 0, Errors: 0, Skipped: 0, Time elapsed: 102.955 sec
Running org.apache.activemq.broker.region.cursors.FilePendingMessageCursorTest
Tests run: 2, Failures: 0, Errors: 0, Skipped: 0, Time elapsed: 2.704 sec
Running org.apache.activemq.broker.region.cursors.NegativeQueueTest
Tests run: 4, Failures: 0, Errors: 0, Skipped: 0, Time elapsed: 110.811 sec
Running org.apache.activemq.broker.region.cursors.OrderPendingListTest
Tests run: 9, Failures: 0, Errors: 0, Skipped: 0, Time elapsed: 0.307 sec
Running org.apache.activemq.broker.region.cursors.PrioritizedPendingListTest
Tests run: 7, Failures: 0, Errors: 0, Skipped: 0, Time elapsed: 0.316 sec
Running org.apache.activemq.broker.region.cursors.StoreBasedCursorTest
Tests run: 5, Failures: 0, Errors: 0, Skipped: 0, Time elapsed: 14.696 sec
Running org.apache.activemq.broker.region.cursors.StoreQueueCursorJDBCNoDuplicateTest
Tests run: 1, Failures: 0, Errors: 0, Skipped: 0, Time elapsed: 3.419 sec
Running org.apache.activemq.broker.region.cursors.StoreQueueCursorJournalNoDuplicateTest
Tests run: 1, Failures: 0, Errors: 0, Skipped: 0, Time elapsed: 0.685 sec
Running org.apache.activemq.broker.region.cursors.StoreQueueCursorKahaDBNoDuplicateTest
Tests run: 1, Failures: 0, Errors: 0, Skipped: 0, Time elapsed: 1.252 sec
Running org.apache.activemq.broker.region.cursors.StoreQueueCursorMemoryNoDuplicateTest
Tests run: 1, Failures: 0, Errors: 0, Skipped: 0, Time elapsed: 0.4 sec
Running org.apache.activemq.broker.region.cursors.StoreQueueCursorNoDuplicateTest
Tests run: 1, Failures: 0, Errors: 0, Skipped: 0, Time elapsed: 1.247 sec
Running org.apache.activemq.broker.region.group.MessageGroupHashBucketTest
Tests run: 2, Failures: 0, Errors: 0, Skipped: 0, Time elapsed: 0.033 sec
Running org.apache.activemq.broker.region.group.MessageGroupMapTest
Tests run: 2, Failures: 0, Errors: 0, Skipped: 0, Time elapsed: 0.031 sec
Running org.apache.activemq.broker.region.group.MessageGroupTest
Tests run: 3, Failures: 0, Errors: 0, Skipped: 0, Time elapsed: 1.228 sec
Running org.apache.activemq.broker.scheduler.CronParserTest
Tests run: 13, Failures: 0, Errors: 0, Skipped: 0, Time elapsed: 0.245 sec
Running org.apache.activemq.broker.scheduler.JmsCronSchedulerTest
Tests run: 2, Failures: 0, Errors: 0, Skipped: 0, Time elapsed: 199.337 sec
Running org.apache.activemq.broker.scheduler.JmsSchedulerTest
Results :
Tests in error:
testCreateTcpConnectionUsingAllocatedPort(org.apache.activemq.ActiveMQXAConnectionFactoryTest): org.apache.activemq:BrokerName=localhost,Type=Broker
Tests run: 1139, Failures: 0, Errors: 1, Skipped: 0
mojoFailed org.apache.maven.plugins:maven-surefire-plugin:2.12.3(default-test)
[JENKINS] Recording test results
projectFailed org.apache.activemq:activemq-core:5.7-SNAPSHOT
Jenkins build is still unstable: ActiveMQ-Java7 » ActiveMQ :: Core #10
Posted by Apache Jenkins Server <je...@builds.apache.org>.
See <https://builds.apache.org/job/ActiveMQ-Java7/org.apache.activemq$activemq-core/changes>
Jenkins build is still unstable: ActiveMQ-Java7 » ActiveMQ :: Core #9
Posted by Apache Jenkins Server <je...@builds.apache.org>.
See <https://builds.apache.org/job/ActiveMQ-Java7/org.apache.activemq$activemq-core/changes>