You are viewing a plain text version of this content. The canonical link for it is here.
Posted to builds@beam.apache.org by Apache Jenkins Server <je...@builds.apache.org> on 2023/03/20 12:47:32 UTC
Build failed in Jenkins: beam_PostCommit_XVR_PythonUsingJavaSQL_Dataflow #1632
See <https://ci-beam.apache.org/job/beam_PostCommit_XVR_PythonUsingJavaSQL_Dataflow/1632/display/redirect>
Changes:
------------------------------------------
[...truncated 574.77 KB...]
> Task :runners:google-cloud-dataflow-java:validatesCrossLanguageRunnerPythonUsingSql
>>> RUNNING integration tests with pipeline options: --runner=TestDataflowRunner --project=apache-beam-testing --region=us-central1 --sdk_harness_container_image_overrides=.*java.*,us.gcr.io/apache-beam-testing/java-postcommit-it/java:20230320121739 --sdk_location=<https://ci-beam.apache.org/job/beam_PostCommit_XVR_PythonUsingJavaSQL_Dataflow/ws/src/sdks/python/build/apache-beam.tar.gz>
>>> pytest options: --capture=no --numprocesses=8 --timeout=4500 --log-cli-level=INFO
>>> collect markers: -m=xlang_sql_expansion_service
============================= test session starts ==============================
platform linux -- Python 3.10.2, pytest-7.2.2, pluggy-1.0.0
rootdir: <https://ci-beam.apache.org/job/beam_PostCommit_XVR_PythonUsingJavaSQL_Dataflow/ws/src/sdks/python,> configfile: pytest.ini
plugins: xdist-3.2.1, hypothesis-6.70.0, timeout-2.1.0, requests-mock-1.10.0
timeout: 4500.0s
timeout method: signal
timeout func_only: False
gw0 I / gw1 I / gw2 I / gw3 I / gw4 I / gw5 I / gw6 I / gw7 I
[gw0] Python 3.10.2 (main, Jan 15 2022, 18:02:07) [GCC 9.3.0]
[gw2] Python 3.10.2 (main, Jan 15 2022, 18:02:07) [GCC 9.3.0]
[gw1] Python 3.10.2 (main, Jan 15 2022, 18:02:07) [GCC 9.3.0]
[gw3] Python 3.10.2 (main, Jan 15 2022, 18:02:07) [GCC 9.3.0]
[gw4] Python 3.10.2 (main, Jan 15 2022, 18:02:07) [GCC 9.3.0]
[gw5] Python 3.10.2 (main, Jan 15 2022, 18:02:07) [GCC 9.3.0]
[gw6] Python 3.10.2 (main, Jan 15 2022, 18:02:07) [GCC 9.3.0]
[gw7] Python 3.10.2 (main, Jan 15 2022, 18:02:07) [GCC 9.3.0]
gw0 [9] / gw1 [9] / gw2 [9] / gw3 [9] / gw4 [9] / gw5 [9] / gw6 [9] / gw7 [9]
scheduling tests via LoadScheduling
apache_beam/transforms/sql_test.py::SqlTransformTest::test_map
apache_beam/transforms/sql_test.py::SqlTransformTest::test_generate_data
apache_beam/transforms/sql_test.py::SqlTransformTest::test_row
apache_beam/transforms/sql_test.py::SqlTransformTest::test_tagged_join
apache_beam/transforms/sql_test.py::SqlTransformTest::test_project
apache_beam/transforms/sql_test.py::SqlTransformTest::test_filter
apache_beam/transforms/sql_test.py::SqlTransformTest::test_agg
apache_beam/transforms/sql_test.py::SqlTransformTest::test_windowing_before_sql
[gw4] PASSED apache_beam/transforms/sql_test.py::SqlTransformTest::test_project
[gw0] PASSED apache_beam/transforms/sql_test.py::SqlTransformTest::test_agg
apache_beam/transforms/sql_test.py::SqlTransformTest::test_zetasql_generate_data
[gw7] PASSED apache_beam/transforms/sql_test.py::SqlTransformTest::test_windowing_before_sql
[gw5] PASSED apache_beam/transforms/sql_test.py::SqlTransformTest::test_row
[gw3] PASSED apache_beam/transforms/sql_test.py::SqlTransformTest::test_map
[gw1] PASSED apache_beam/transforms/sql_test.py::SqlTransformTest::test_generate_data
[gw2] PASSED apache_beam/transforms/sql_test.py::SqlTransformTest::test_filter
[gw6] PASSED apache_beam/transforms/sql_test.py::SqlTransformTest::test_tagged_join
[gw0] PASSED apache_beam/transforms/sql_test.py::SqlTransformTest::test_zetasql_generate_data
=============================== warnings summary ===============================
../../build/gradleenv/1922375555/lib/python3.10/site-packages/hdfs/config.py:15
../../build/gradleenv/1922375555/lib/python3.10/site-packages/hdfs/config.py:15
../../build/gradleenv/1922375555/lib/python3.10/site-packages/hdfs/config.py:15
../../build/gradleenv/1922375555/lib/python3.10/site-packages/hdfs/config.py:15
../../build/gradleenv/1922375555/lib/python3.10/site-packages/hdfs/config.py:15
../../build/gradleenv/1922375555/lib/python3.10/site-packages/hdfs/config.py:15
../../build/gradleenv/1922375555/lib/python3.10/site-packages/hdfs/config.py:15
../../build/gradleenv/1922375555/lib/python3.10/site-packages/hdfs/config.py:15
../../build/gradleenv/1922375555/lib/python3.10/site-packages/hdfs/config.py:15
<https://ci-beam.apache.org/job/beam_PostCommit_XVR_PythonUsingJavaSQL_Dataflow/ws/src/build/gradleenv/1922375555/lib/python3.10/site-packages/hdfs/config.py>:15: DeprecationWarning: the imp module is deprecated in favour of importlib and slated for removal in Python 3.12; see the module's documentation for alternative uses
from imp import load_source
../../build/gradleenv/1922375555/lib/python3.10/site-packages/pkg_resources/__init__.py:121
../../build/gradleenv/1922375555/lib/python3.10/site-packages/pkg_resources/__init__.py:121
../../build/gradleenv/1922375555/lib/python3.10/site-packages/pkg_resources/__init__.py:121
../../build/gradleenv/1922375555/lib/python3.10/site-packages/pkg_resources/__init__.py:121
../../build/gradleenv/1922375555/lib/python3.10/site-packages/pkg_resources/__init__.py:121
../../build/gradleenv/1922375555/lib/python3.10/site-packages/pkg_resources/__init__.py:121
../../build/gradleenv/1922375555/lib/python3.10/site-packages/pkg_resources/__init__.py:121
../../build/gradleenv/1922375555/lib/python3.10/site-packages/pkg_resources/__init__.py:121
../../build/gradleenv/1922375555/lib/python3.10/site-packages/pkg_resources/__init__.py:121
<https://ci-beam.apache.org/job/beam_PostCommit_XVR_PythonUsingJavaSQL_Dataflow/ws/src/build/gradleenv/1922375555/lib/python3.10/site-packages/pkg_resources/__init__.py>:121: DeprecationWarning: pkg_resources is deprecated as an API
warnings.warn("pkg_resources is deprecated as an API", DeprecationWarning)
../../build/gradleenv/1922375555/lib/python3.10/site-packages/pkg_resources/__init__.py:2870: 162 warnings
<https://ci-beam.apache.org/job/beam_PostCommit_XVR_PythonUsingJavaSQL_Dataflow/ws/src/build/gradleenv/1922375555/lib/python3.10/site-packages/pkg_resources/__init__.py>:2870: DeprecationWarning: Deprecated call to `pkg_resources.declare_namespace('google')`.
Implementing implicit namespace packages (as specified in PEP 420) is preferred to `pkg_resources.declare_namespace`. See https://setuptools.pypa.io/en/latest/references/keywords.html#keyword-namespace-packages
declare_namespace(pkg)
../../build/gradleenv/1922375555/lib/python3.10/site-packages/pkg_resources/__init__.py:2870: 117 warnings
<https://ci-beam.apache.org/job/beam_PostCommit_XVR_PythonUsingJavaSQL_Dataflow/ws/src/build/gradleenv/1922375555/lib/python3.10/site-packages/pkg_resources/__init__.py>:2870: DeprecationWarning: Deprecated call to `pkg_resources.declare_namespace('google.cloud')`.
Implementing implicit namespace packages (as specified in PEP 420) is preferred to `pkg_resources.declare_namespace`. See https://setuptools.pypa.io/en/latest/references/keywords.html#keyword-namespace-packages
declare_namespace(pkg)
../../build/gradleenv/1922375555/lib/python3.10/site-packages/pkg_resources/__init__.py:2349: 36 warnings
<https://ci-beam.apache.org/job/beam_PostCommit_XVR_PythonUsingJavaSQL_Dataflow/ws/src/build/gradleenv/1922375555/lib/python3.10/site-packages/pkg_resources/__init__.py>:2349: DeprecationWarning: Deprecated call to `pkg_resources.declare_namespace('google')`.
Implementing implicit namespace packages (as specified in PEP 420) is preferred to `pkg_resources.declare_namespace`. See https://setuptools.pypa.io/en/latest/references/keywords.html#keyword-namespace-packages
declare_namespace(parent)
../../build/gradleenv/1922375555/lib/python3.10/site-packages/pkg_resources/__init__.py:2870
../../build/gradleenv/1922375555/lib/python3.10/site-packages/pkg_resources/__init__.py:2870
../../build/gradleenv/1922375555/lib/python3.10/site-packages/pkg_resources/__init__.py:2870
../../build/gradleenv/1922375555/lib/python3.10/site-packages/pkg_resources/__init__.py:2870
../../build/gradleenv/1922375555/lib/python3.10/site-packages/pkg_resources/__init__.py:2870
../../build/gradleenv/1922375555/lib/python3.10/site-packages/pkg_resources/__init__.py:2870
../../build/gradleenv/1922375555/lib/python3.10/site-packages/pkg_resources/__init__.py:2870
../../build/gradleenv/1922375555/lib/python3.10/site-packages/pkg_resources/__init__.py:2870
../../build/gradleenv/1922375555/lib/python3.10/site-packages/pkg_resources/__init__.py:2870
<https://ci-beam.apache.org/job/beam_PostCommit_XVR_PythonUsingJavaSQL_Dataflow/ws/src/build/gradleenv/1922375555/lib/python3.10/site-packages/pkg_resources/__init__.py>:2870: DeprecationWarning: Deprecated call to `pkg_resources.declare_namespace('google.logging')`.
Implementing implicit namespace packages (as specified in PEP 420) is preferred to `pkg_resources.declare_namespace`. See https://setuptools.pypa.io/en/latest/references/keywords.html#keyword-namespace-packages
declare_namespace(pkg)
../../build/gradleenv/1922375555/lib/python3.10/site-packages/pkg_resources/__init__.py:2870
../../build/gradleenv/1922375555/lib/python3.10/site-packages/pkg_resources/__init__.py:2870
../../build/gradleenv/1922375555/lib/python3.10/site-packages/pkg_resources/__init__.py:2870
../../build/gradleenv/1922375555/lib/python3.10/site-packages/pkg_resources/__init__.py:2870
../../build/gradleenv/1922375555/lib/python3.10/site-packages/pkg_resources/__init__.py:2870
../../build/gradleenv/1922375555/lib/python3.10/site-packages/pkg_resources/__init__.py:2870
../../build/gradleenv/1922375555/lib/python3.10/site-packages/pkg_resources/__init__.py:2870
../../build/gradleenv/1922375555/lib/python3.10/site-packages/pkg_resources/__init__.py:2870
../../build/gradleenv/1922375555/lib/python3.10/site-packages/pkg_resources/__init__.py:2870
<https://ci-beam.apache.org/job/beam_PostCommit_XVR_PythonUsingJavaSQL_Dataflow/ws/src/build/gradleenv/1922375555/lib/python3.10/site-packages/pkg_resources/__init__.py>:2870: DeprecationWarning: Deprecated call to `pkg_resources.declare_namespace('google.iam')`.
Implementing implicit namespace packages (as specified in PEP 420) is preferred to `pkg_resources.declare_namespace`. See https://setuptools.pypa.io/en/latest/references/keywords.html#keyword-namespace-packages
declare_namespace(pkg)
../../build/gradleenv/1922375555/lib/python3.10/site-packages/google/rpc/__init__.py:20
../../build/gradleenv/1922375555/lib/python3.10/site-packages/google/rpc/__init__.py:20
../../build/gradleenv/1922375555/lib/python3.10/site-packages/google/rpc/__init__.py:20
../../build/gradleenv/1922375555/lib/python3.10/site-packages/google/rpc/__init__.py:20
../../build/gradleenv/1922375555/lib/python3.10/site-packages/google/rpc/__init__.py:20
../../build/gradleenv/1922375555/lib/python3.10/site-packages/google/rpc/__init__.py:20
../../build/gradleenv/1922375555/lib/python3.10/site-packages/google/rpc/__init__.py:20
../../build/gradleenv/1922375555/lib/python3.10/site-packages/google/rpc/__init__.py:20
../../build/gradleenv/1922375555/lib/python3.10/site-packages/google/rpc/__init__.py:20
<https://ci-beam.apache.org/job/beam_PostCommit_XVR_PythonUsingJavaSQL_Dataflow/ws/src/build/gradleenv/1922375555/lib/python3.10/site-packages/google/rpc/__init__.py>:20: DeprecationWarning: Deprecated call to `pkg_resources.declare_namespace('google.rpc')`.
Implementing implicit namespace packages (as specified in PEP 420) is preferred to `pkg_resources.declare_namespace`. See https://setuptools.pypa.io/en/latest/references/keywords.html#keyword-namespace-packages
pkg_resources.declare_namespace(__name__)
../../build/gradleenv/1922375555/lib/python3.10/site-packages/google/api_core/operations_v1/abstract_operations_client.py:17
../../build/gradleenv/1922375555/lib/python3.10/site-packages/google/api_core/operations_v1/abstract_operations_client.py:17
../../build/gradleenv/1922375555/lib/python3.10/site-packages/google/api_core/operations_v1/abstract_operations_client.py:17
../../build/gradleenv/1922375555/lib/python3.10/site-packages/google/api_core/operations_v1/abstract_operations_client.py:17
../../build/gradleenv/1922375555/lib/python3.10/site-packages/google/api_core/operations_v1/abstract_operations_client.py:17
../../build/gradleenv/1922375555/lib/python3.10/site-packages/google/api_core/operations_v1/abstract_operations_client.py:17
../../build/gradleenv/1922375555/lib/python3.10/site-packages/google/api_core/operations_v1/abstract_operations_client.py:17
../../build/gradleenv/1922375555/lib/python3.10/site-packages/google/api_core/operations_v1/abstract_operations_client.py:17
<https://ci-beam.apache.org/job/beam_PostCommit_XVR_PythonUsingJavaSQL_Dataflow/ws/src/build/gradleenv/1922375555/lib/python3.10/site-packages/google/api_core/operations_v1/abstract_operations_client.py>:17: DeprecationWarning: The distutils package is deprecated and slated for removal in Python 3.12. Use setuptools or check PEP 632 for potential alternatives
from distutils import util
../../build/gradleenv/1922375555/lib/python3.10/site-packages/tenacity/_asyncio.py:42
../../build/gradleenv/1922375555/lib/python3.10/site-packages/tenacity/_asyncio.py:42
../../build/gradleenv/1922375555/lib/python3.10/site-packages/tenacity/_asyncio.py:42
../../build/gradleenv/1922375555/lib/python3.10/site-packages/tenacity/_asyncio.py:42
../../build/gradleenv/1922375555/lib/python3.10/site-packages/tenacity/_asyncio.py:42
../../build/gradleenv/1922375555/lib/python3.10/site-packages/tenacity/_asyncio.py:42
../../build/gradleenv/1922375555/lib/python3.10/site-packages/tenacity/_asyncio.py:42
../../build/gradleenv/1922375555/lib/python3.10/site-packages/tenacity/_asyncio.py:42
<https://ci-beam.apache.org/job/beam_PostCommit_XVR_PythonUsingJavaSQL_Dataflow/ws/src/build/gradleenv/1922375555/lib/python3.10/site-packages/tenacity/_asyncio.py>:42: DeprecationWarning: "@coroutine" decorator is deprecated since Python 3.8, use "async def" instead
def call(self, fn, *args, **kwargs):
apache_beam/typehints/pandas_type_compatibility_test.py:67
apache_beam/typehints/pandas_type_compatibility_test.py:67
apache_beam/typehints/pandas_type_compatibility_test.py:67
apache_beam/typehints/pandas_type_compatibility_test.py:67
apache_beam/typehints/pandas_type_compatibility_test.py:67
apache_beam/typehints/pandas_type_compatibility_test.py:67
apache_beam/typehints/pandas_type_compatibility_test.py:67
apache_beam/typehints/pandas_type_compatibility_test.py:67
<https://ci-beam.apache.org/job/beam_PostCommit_XVR_PythonUsingJavaSQL_Dataflow/ws/src/sdks/python/apache_beam/typehints/pandas_type_compatibility_test.py>:67: FutureWarning: pandas.Int64Index is deprecated and will be removed from pandas in a future version. Use pandas.Index with the appropriate dtype instead.
}).set_index(pd.Int64Index(range(123, 223), name='an_index')),
apache_beam/typehints/pandas_type_compatibility_test.py:90
apache_beam/typehints/pandas_type_compatibility_test.py:90
apache_beam/typehints/pandas_type_compatibility_test.py:90
apache_beam/typehints/pandas_type_compatibility_test.py:90
apache_beam/typehints/pandas_type_compatibility_test.py:90
apache_beam/typehints/pandas_type_compatibility_test.py:90
apache_beam/typehints/pandas_type_compatibility_test.py:90
apache_beam/typehints/pandas_type_compatibility_test.py:90
<https://ci-beam.apache.org/job/beam_PostCommit_XVR_PythonUsingJavaSQL_Dataflow/ws/src/sdks/python/apache_beam/typehints/pandas_type_compatibility_test.py>:90: FutureWarning: pandas.Int64Index is deprecated and will be removed from pandas in a future version. Use pandas.Index with the appropriate dtype instead.
pd.Int64Index(range(123, 223), name='an_index'),
apache_beam/typehints/pandas_type_compatibility_test.py:91
apache_beam/typehints/pandas_type_compatibility_test.py:91
apache_beam/typehints/pandas_type_compatibility_test.py:91
apache_beam/typehints/pandas_type_compatibility_test.py:91
apache_beam/typehints/pandas_type_compatibility_test.py:91
apache_beam/typehints/pandas_type_compatibility_test.py:91
apache_beam/typehints/pandas_type_compatibility_test.py:91
apache_beam/typehints/pandas_type_compatibility_test.py:91
<https://ci-beam.apache.org/job/beam_PostCommit_XVR_PythonUsingJavaSQL_Dataflow/ws/src/sdks/python/apache_beam/typehints/pandas_type_compatibility_test.py>:91: FutureWarning: pandas.Int64Index is deprecated and will be removed from pandas in a future version. Use pandas.Index with the appropriate dtype instead.
pd.Int64Index(range(475, 575), name='another_index'),
-- Docs: https://docs.pytest.org/en/stable/how-to/capture-warnings.html
- generated xml file: <https://ci-beam.apache.org/job/beam_PostCommit_XVR_PythonUsingJavaSQL_Dataflow/ws/src/sdks/python/pytest_xlangSqlValidateRunner.xml> -
=========== 9 passed, 9 skipped, 400 warnings in 1101.52s (0:18:21) ============
> Task :runners:google-cloud-dataflow-java:cleanupXVR UP-TO-DATE
> Task :runners:google-cloud-dataflow-java:cleanUpDockerPythonImages
Untagged: us.gcr.io/apache-beam-testing/java-postcommit-it/python:20230320121739
Untagged: us.gcr.io/apache-beam-testing/java-postcommit-it/python@sha256:9e6a4d8049ad6a117cc70d876552b86f7c1b3b3e688d2dba77f443d55d263d9d
WARNING: Successfully resolved tag to sha256, but it is recommended to use sha256 directly.
Tag: [us.gcr.io/apache-beam-testing/java-postcommit-it/python:20230320121739]
- referencing digest: [us.gcr.io/apache-beam-testing/java-postcommit-it/python@sha256:9e6a4d8049ad6a117cc70d876552b86f7c1b3b3e688d2dba77f443d55d263d9d]
Deleted [[us.gcr.io/apache-beam-testing/java-postcommit-it/python:20230320121739] (referencing [us.gcr.io/apache-beam-testing/java-postcommit-it/python@sha256:9e6a4d8049ad6a117cc70d876552b86f7c1b3b3e688d2dba77f443d55d263d9d])].
Removing untagged image us.gcr.io/apache-beam-testing/java-postcommit-it/python@sha256:9e6a4d8049ad6a117cc70d876552b86f7c1b3b3e688d2dba77f443d55d263d9d
Digests:
- us.gcr.io/apache-beam-testing/java-postcommit-it/python@sha256:9e6a4d8049ad6a117cc70d876552b86f7c1b3b3e688d2dba77f443d55d263d9d
Deleted [us.gcr.io/apache-beam-testing/java-postcommit-it/python@sha256:9e6a4d8049ad6a117cc70d876552b86f7c1b3b3e688d2dba77f443d55d263d9d].
> Task :runners:google-cloud-dataflow-java:cleanUpDockerJavaImages
Untagged: us.gcr.io/apache-beam-testing/java-postcommit-it/java:20230320121739
Untagged: us.gcr.io/apache-beam-testing/java-postcommit-it/java@sha256:4881a7db3ba08829ea5b6d5c01704e0544c474480efa3bebd31b3466c10ed8ea
WARNING: Successfully resolved tag to sha256, but it is recommended to use sha256 directly.
Tag: [us.gcr.io/apache-beam-testing/java-postcommit-it/java:20230320121739]
- referencing digest: [us.gcr.io/apache-beam-testing/java-postcommit-it/java@sha256:4881a7db3ba08829ea5b6d5c01704e0544c474480efa3bebd31b3466c10ed8ea]
Deleted [[us.gcr.io/apache-beam-testing/java-postcommit-it/java:20230320121739] (referencing [us.gcr.io/apache-beam-testing/java-postcommit-it/java@sha256:4881a7db3ba08829ea5b6d5c01704e0544c474480efa3bebd31b3466c10ed8ea])].
Removing untagged image us.gcr.io/apache-beam-testing/java-postcommit-it/java@sha256:578da1468345b89584d4bf75b247a64650f5b73d8f143d4c5e23774465f61b0f
Digests:
- us.gcr.io/apache-beam-testing/java-postcommit-it/java@sha256:578da1468345b89584d4bf75b247a64650f5b73d8f143d4c5e23774465f61b0f
ERROR: (gcloud.container.images.delete) Not found: response: {'docker-distribution-api-version': 'registry/2.0', 'content-type': 'application/json', 'content-encoding': 'gzip', 'date': 'Mon, 20 Mar 2023 12:47:30 GMT', 'server': 'Docker Registry', 'cache-control': 'private', 'x-xss-protection': '0', 'x-frame-options': 'SAMEORIGIN', 'transfer-encoding': 'chunked', 'status': 404}
Failed to compute blob liveness for manifest: 'sha256:578da1468345b89584d4bf75b247a64650f5b73d8f143d4c5e23774465f61b0f': None
> Task :runners:google-cloud-dataflow-java:cleanUpDockerJavaImages FAILED
> Task :runners:google-cloud-dataflow-java:validatesCrossLanguageRunnerCleanup
Stopping expansion service pid: 3088499.
Stopping expansion service pid: 3088500.
FAILURE: Build failed with an exception.
* Where:
Build file '<https://ci-beam.apache.org/job/beam_PostCommit_XVR_PythonUsingJavaSQL_Dataflow/ws/src/runners/google-cloud-dataflow-java/build.gradle'> line: 306
* What went wrong:
Execution failed for task ':runners:google-cloud-dataflow-java:cleanUpDockerJavaImages'.
> Process 'command './scripts/cleanup_untagged_gcr_images.sh'' finished with non-zero exit value 1
* Try:
> Run with --stacktrace option to get the stack trace.
> Run with --info or --debug option to get more log output.
* Get more help at https://help.gradle.org
Deprecated Gradle features were used in this build, making it incompatible with Gradle 8.0.
You can use '--warning-mode all' to show the individual deprecation warnings and determine if they come from your own scripts or plugins.
See https://docs.gradle.org/7.5.1/userguide/command_line_interface.html#sec:command_line_warnings
Execution optimizations have been disabled for 1 invalid unit(s) of work during this build to ensure correctness.
Please consult deprecation warnings for more details.
BUILD FAILED in 30m 6s
179 actionable tasks: 122 executed, 51 from cache, 6 up-to-date
Publishing build scan...
https://gradle.com/s/3jsblzq5jj3ji
Build step 'Invoke Gradle script' changed build result to FAILURE
Build step 'Invoke Gradle script' marked build as failure
---------------------------------------------------------------------
To unsubscribe, e-mail: builds-unsubscribe@beam.apache.org
For additional commands, e-mail: builds-help@beam.apache.org
Jenkins build is back to normal : beam_PostCommit_XVR_PythonUsingJavaSQL_Dataflow #1633
Posted by Apache Jenkins Server <je...@builds.apache.org>.
See <https://ci-beam.apache.org/job/beam_PostCommit_XVR_PythonUsingJavaSQL_Dataflow/1633/display/redirect?page=changes>
---------------------------------------------------------------------
To unsubscribe, e-mail: builds-unsubscribe@beam.apache.org
For additional commands, e-mail: builds-help@beam.apache.org