You are viewing a plain text version of this content. The canonical link for it is here.
Posted to yarn-dev@hadoop.apache.org by Apache Jenkins Server <je...@builds.apache.org> on 2015/03/28 00:02:57 UTC
Failed: YARN-3258 PreCommit Build #7128
Jira: https://issues.apache.org/jira/browse/YARN-3258
Build: https://builds.apache.org/job/PreCommit-YARN-Build/7128/
###################################################################################
########################## LAST 60 LINES OF THE CONSOLE ###########################
[...truncated 3621 lines...]
{color:red}-1 tests included{color}. The patch doesn't appear to include any new or modified tests.
Please justify why no new tests are needed for this patch.
Also please list what manual steps were performed to verify this patch.
{color:green}+1 javac{color}. The applied patch does not increase the total number of javac compiler warnings.
{color:green}+1 javadoc{color}. There were no new javadoc warning messages.
{color:green}+1 eclipse:eclipse{color}. The patch built with eclipse:eclipse.
{color:green}+1 findbugs{color}. The patch does not introduce any new Findbugs (version 2.0.3) warnings.
{color:green}+1 release audit{color}. The applied patch does not increase the total number of release audit warnings.
{color:red}-1 core tests{color}. The patch failed these unit tests in hadoop-yarn-project/hadoop-yarn/hadoop-yarn-server/hadoop-yarn-server-resourcemanager:
org.apache.hadoop.yarn.server.resourcemanager.TestRMHA
org.apache.hadoop.yarn.server.resourcemanager.TestRMAdminService
org.apache.hadoop.yarn.server.resourcemanager.webapp.TestRMWebappAuthentication
org.apache.hadoop.yarn.server.resourcemanager.TestMoveApplication
org.apache.hadoop.yarn.server.resourcemanager.recovery.TestZKRMStateStore
Test results: https://builds.apache.org/job/PreCommit-YARN-Build/7128//testReport/
Console output: https://builds.apache.org/job/PreCommit-YARN-Build/7128//console
This message is automatically generated.
======================================================================
======================================================================
Adding comment to Jira.
======================================================================
======================================================================
Comment added.
4bae78c4e60adbaca83890bbed3c3e2f5d43b0b7 logged out
======================================================================
======================================================================
Finished build.
======================================================================
======================================================================
Build step 'Execute shell' marked build as failure
Archiving artifacts
Sending artifact delta relative to PreCommit-YARN-Build #7115
Archived 15 artifacts
Archive block size is 32768
Received 214 blocks and 2071598 bytes
Compression is 77.2%
Took 1.4 sec
Description set: MAPREDUCE-6294
Recording test results
Email was triggered for: Failure
Sending email for trigger: Failure
###################################################################################
############################## FAILED TESTS (if any) ##############################
16 tests failed.
FAILED: org.apache.hadoop.yarn.server.resourcemanager.TestMoveApplication.testMoveTooLate
Error Message:
Error starting http server
Stack Trace:
org.apache.hadoop.yarn.webapp.WebAppException: Error starting http server
at org.apache.hadoop.http.HttpServer2.start(HttpServer2.java:785)
at org.apache.hadoop.yarn.webapp.WebApps$Builder.start(WebApps.java:274)
at org.apache.hadoop.yarn.server.resourcemanager.ResourceManager.startWepApp(ResourceManager.java:974)
at org.apache.hadoop.yarn.server.resourcemanager.ResourceManager.serviceStart(ResourceManager.java:1074)
at org.apache.hadoop.service.AbstractService.start(AbstractService.java:193)
at org.apache.hadoop.yarn.server.resourcemanager.TestMoveApplication.setUp(TestMoveApplication.java:59)
FAILED: org.apache.hadoop.yarn.server.resourcemanager.TestMoveApplication.testMoveRejectedByPermissions
Error Message:
Error starting http server
Stack Trace:
org.apache.hadoop.yarn.webapp.WebAppException: Error starting http server
at sun.nio.ch.Net.bind0(Native Method)
at sun.nio.ch.Net.bind(Net.java:444)
at sun.nio.ch.Net.bind(Net.java:436)
at sun.nio.ch.ServerSocketChannelImpl.bind(ServerSocketChannelImpl.java:214)
at sun.nio.ch.ServerSocketAdaptor.bind(ServerSocketAdaptor.java:74)
at org.mortbay.jetty.nio.SelectChannelConnector.open(SelectChannelConnector.java:216)
at org.apache.hadoop.http.HttpServer2.openListeners(HttpServer2.java:830)
at org.apache.hadoop.http.HttpServer2.start(HttpServer2.java:772)
at org.apache.hadoop.yarn.webapp.WebApps$Builder.start(WebApps.java:274)
at org.apache.hadoop.yarn.server.resourcemanager.ResourceManager.startWepApp(ResourceManager.java:974)
at org.apache.hadoop.yarn.server.resourcemanager.ResourceManager.serviceStart(ResourceManager.java:1074)
at org.apache.hadoop.service.AbstractService.start(AbstractService.java:193)
at org.apache.hadoop.yarn.server.resourcemanager.TestMoveApplication.setUp(TestMoveApplication.java:59)
FAILED: org.apache.hadoop.yarn.server.resourcemanager.TestMoveApplication.testMoveSuccessful
Error Message:
Error starting http server
Stack Trace:
org.apache.hadoop.yarn.webapp.WebAppException: Error starting http server
at sun.nio.ch.Net.bind0(Native Method)
at sun.nio.ch.Net.bind(Net.java:444)
at sun.nio.ch.Net.bind(Net.java:436)
at sun.nio.ch.ServerSocketChannelImpl.bind(ServerSocketChannelImpl.java:214)
at sun.nio.ch.ServerSocketAdaptor.bind(ServerSocketAdaptor.java:74)
at org.mortbay.jetty.nio.SelectChannelConnector.open(SelectChannelConnector.java:216)
at org.apache.hadoop.http.HttpServer2.openListeners(HttpServer2.java:830)
at org.apache.hadoop.http.HttpServer2.start(HttpServer2.java:772)
at org.apache.hadoop.yarn.webapp.WebApps$Builder.start(WebApps.java:274)
at org.apache.hadoop.yarn.server.resourcemanager.ResourceManager.startWepApp(ResourceManager.java:974)
at org.apache.hadoop.yarn.server.resourcemanager.ResourceManager.serviceStart(ResourceManager.java:1074)
at org.apache.hadoop.service.AbstractService.start(AbstractService.java:193)
at org.apache.hadoop.yarn.server.resourcemanager.TestMoveApplication.setUp(TestMoveApplication.java:59)
FAILED: org.apache.hadoop.yarn.server.resourcemanager.TestMoveApplication.testMoveRejectedByScheduler
Error Message:
Error starting http server
Stack Trace:
org.apache.hadoop.yarn.webapp.WebAppException: Error starting http server
at sun.nio.ch.Net.bind0(Native Method)
at sun.nio.ch.Net.bind(Net.java:444)
at sun.nio.ch.Net.bind(Net.java:436)
at sun.nio.ch.ServerSocketChannelImpl.bind(ServerSocketChannelImpl.java:214)
at sun.nio.ch.ServerSocketAdaptor.bind(ServerSocketAdaptor.java:74)
at org.mortbay.jetty.nio.SelectChannelConnector.open(SelectChannelConnector.java:216)
at org.apache.hadoop.http.HttpServer2.openListeners(HttpServer2.java:830)
at org.apache.hadoop.http.HttpServer2.start(HttpServer2.java:772)
at org.apache.hadoop.yarn.webapp.WebApps$Builder.start(WebApps.java:274)
at org.apache.hadoop.yarn.server.resourcemanager.ResourceManager.startWepApp(ResourceManager.java:974)
at org.apache.hadoop.yarn.server.resourcemanager.ResourceManager.serviceStart(ResourceManager.java:1074)
at org.apache.hadoop.service.AbstractService.start(AbstractService.java:193)
at org.apache.hadoop.yarn.server.resourcemanager.TestMoveApplication.setUp(TestMoveApplication.java:59)
FAILED: org.apache.hadoop.yarn.server.resourcemanager.TestRMAdminService.testServiceAclsRefreshWithLocalConfigurationProvider
Error Message:
Using localConfigurationProvider. Should not get any exception.
Stack Trace:
java.lang.AssertionError: Using localConfigurationProvider. Should not get any exception.
at org.junit.Assert.fail(Assert.java:88)
at org.apache.hadoop.yarn.server.resourcemanager.TestRMAdminService.testServiceAclsRefreshWithLocalConfigurationProvider(TestRMAdminService.java:219)
FAILED: org.apache.hadoop.yarn.server.resourcemanager.TestRMAdminService.testServiceAclsRefreshWithFileSystemBasedConfigurationProvider
Error Message:
Should not get any exceptions
Stack Trace:
java.lang.AssertionError: Should not get any exceptions
at org.junit.Assert.fail(Assert.java:88)
at org.apache.hadoop.yarn.server.resourcemanager.TestRMAdminService.testServiceAclsRefreshWithFileSystemBasedConfigurationProvider(TestRMAdminService.java:248)
FAILED: org.apache.hadoop.yarn.server.resourcemanager.TestRMAdminService.testRMInitialsWithFileSystemBasedConfigurationProvider
Error Message:
Should not get any exceptions
Stack Trace:
java.lang.AssertionError: Should not get any exceptions
at org.junit.Assert.fail(Assert.java:88)
at org.apache.hadoop.yarn.server.resourcemanager.TestRMAdminService.testRMInitialsWithFileSystemBasedConfigurationProvider(TestRMAdminService.java:674)
FAILED: org.apache.hadoop.yarn.server.resourcemanager.TestRMHA.testRMDispatcherForHA
Error Message:
Error starting http server
Stack Trace:
org.apache.hadoop.yarn.webapp.WebAppException: Error starting http server
at org.apache.hadoop.http.HttpServer2.start(HttpServer2.java:785)
at org.apache.hadoop.yarn.webapp.WebApps$Builder.start(WebApps.java:274)
at org.apache.hadoop.yarn.server.resourcemanager.ResourceManager.startWepApp(ResourceManager.java:974)
at org.apache.hadoop.yarn.server.resourcemanager.MockRM.startWepApp(MockRM.java:635)
at org.apache.hadoop.yarn.server.resourcemanager.ResourceManager.serviceStart(ResourceManager.java:1074)
at org.apache.hadoop.service.AbstractService.start(AbstractService.java:193)
at org.apache.hadoop.yarn.server.resourcemanager.TestRMHA.testRMDispatcherForHA(TestRMHA.java:330)
FAILED: org.apache.hadoop.yarn.server.resourcemanager.TestRMHA.testFailoverClearsRMContext
Error Message:
Error starting http server
Stack Trace:
org.apache.hadoop.yarn.webapp.WebAppException: Error starting http server
at org.apache.hadoop.http.HttpServer2.start(HttpServer2.java:785)
at org.apache.hadoop.yarn.webapp.WebApps$Builder.start(WebApps.java:274)
at org.apache.hadoop.yarn.server.resourcemanager.ResourceManager.startWepApp(ResourceManager.java:974)
at org.apache.hadoop.yarn.server.resourcemanager.MockRM.startWepApp(MockRM.java:635)
at org.apache.hadoop.yarn.server.resourcemanager.ResourceManager.serviceStart(ResourceManager.java:1074)
at org.apache.hadoop.service.AbstractService.start(AbstractService.java:193)
at org.apache.hadoop.yarn.server.resourcemanager.TestRMHA.testFailoverClearsRMContext(TestRMHA.java:530)
FAILED: org.apache.hadoop.yarn.server.resourcemanager.TestRMHA.testTransitionedToStandbyShouldNotHang
Error Message:
Error starting http server
Stack Trace:
org.apache.hadoop.yarn.webapp.WebAppException: Error starting http server
at org.apache.hadoop.http.HttpServer2.start(HttpServer2.java:785)
at org.apache.hadoop.yarn.webapp.WebApps$Builder.start(WebApps.java:274)
at org.apache.hadoop.yarn.server.resourcemanager.ResourceManager.startWepApp(ResourceManager.java:974)
at org.apache.hadoop.yarn.server.resourcemanager.MockRM.startWepApp(MockRM.java:635)
at org.apache.hadoop.yarn.server.resourcemanager.ResourceManager.serviceStart(ResourceManager.java:1074)
at org.apache.hadoop.service.AbstractService.start(AbstractService.java:193)
at org.apache.hadoop.yarn.server.resourcemanager.TestRMHA.testTransitionedToStandbyShouldNotHang(TestRMHA.java:487)
FAILED: org.apache.hadoop.yarn.server.resourcemanager.TestRMHA.testTransitionsWhenAutomaticFailoverEnabled
Error Message:
Error starting http server
Stack Trace:
org.apache.hadoop.yarn.webapp.WebAppException: Error starting http server
at org.apache.hadoop.http.HttpServer2.start(HttpServer2.java:785)
at org.apache.hadoop.yarn.webapp.WebApps$Builder.start(WebApps.java:274)
at org.apache.hadoop.yarn.server.resourcemanager.ResourceManager.startWepApp(ResourceManager.java:974)
at org.apache.hadoop.yarn.server.resourcemanager.MockRM.startWepApp(MockRM.java:635)
at org.apache.hadoop.yarn.server.resourcemanager.ResourceManager.serviceStart(ResourceManager.java:1074)
at org.apache.hadoop.service.AbstractService.start(AbstractService.java:193)
at org.apache.hadoop.yarn.server.resourcemanager.TestRMHA.testTransitionsWhenAutomaticFailoverEnabled(TestRMHA.java:254)
FAILED: org.apache.hadoop.yarn.server.resourcemanager.TestRMHA.testFailoverWhenTransitionToActiveThrowException
Error Message:
Error starting http server
Stack Trace:
org.apache.hadoop.yarn.webapp.WebAppException: Error starting http server
at org.apache.hadoop.http.HttpServer2.start(HttpServer2.java:785)
at org.apache.hadoop.yarn.webapp.WebApps$Builder.start(WebApps.java:274)
at org.apache.hadoop.yarn.server.resourcemanager.ResourceManager.startWepApp(ResourceManager.java:974)
at org.apache.hadoop.yarn.server.resourcemanager.MockRM.startWepApp(MockRM.java:635)
at org.apache.hadoop.yarn.server.resourcemanager.ResourceManager.serviceStart(ResourceManager.java:1074)
at org.apache.hadoop.service.AbstractService.start(AbstractService.java:193)
at org.apache.hadoop.yarn.server.resourcemanager.TestRMHA.testFailoverWhenTransitionToActiveThrowException(TestRMHA.java:437)
FAILED: org.apache.hadoop.yarn.server.resourcemanager.TestRMHA.testFailoverAndTransitions
Error Message:
Error starting http server
Stack Trace:
org.apache.hadoop.yarn.webapp.WebAppException: Error starting http server
at org.apache.hadoop.http.HttpServer2.start(HttpServer2.java:785)
at org.apache.hadoop.yarn.webapp.WebApps$Builder.start(WebApps.java:274)
at org.apache.hadoop.yarn.server.resourcemanager.ResourceManager.startWepApp(ResourceManager.java:974)
at org.apache.hadoop.yarn.server.resourcemanager.MockRM.startWepApp(MockRM.java:635)
at org.apache.hadoop.yarn.server.resourcemanager.ResourceManager.serviceStart(ResourceManager.java:1074)
at org.apache.hadoop.service.AbstractService.start(AbstractService.java:193)
at org.apache.hadoop.yarn.server.resourcemanager.TestRMHA.testFailoverAndTransitions(TestRMHA.java:198)
FAILED: org.apache.hadoop.yarn.server.resourcemanager.recovery.TestZKRMStateStore.testFencing
Error Message:
Error starting http server
Stack Trace:
org.apache.hadoop.yarn.webapp.WebAppException: Error starting http server
at org.apache.hadoop.http.HttpServer2.start(HttpServer2.java:785)
at org.apache.hadoop.yarn.webapp.WebApps$Builder.start(WebApps.java:274)
at org.apache.hadoop.yarn.server.resourcemanager.ResourceManager.startWepApp(ResourceManager.java:974)
at org.apache.hadoop.yarn.server.resourcemanager.ResourceManager.serviceStart(ResourceManager.java:1074)
at org.apache.hadoop.service.AbstractService.start(AbstractService.java:193)
at org.apache.hadoop.yarn.server.resourcemanager.recovery.TestZKRMStateStore.testFencing(TestZKRMStateStore.java:229)
FAILED: org.apache.hadoop.yarn.server.resourcemanager.webapp.TestRMWebappAuthentication.testSimpleAuth[0]
Error Message:
Error starting http server
Stack Trace:
org.apache.hadoop.yarn.webapp.WebAppException: Error starting http server
at org.apache.hadoop.http.HttpServer2.start(HttpServer2.java:785)
at org.apache.hadoop.yarn.webapp.WebApps$Builder.start(WebApps.java:274)
at org.apache.hadoop.yarn.server.resourcemanager.ResourceManager.startWepApp(ResourceManager.java:974)
at org.apache.hadoop.yarn.server.resourcemanager.MockRM.startWepApp(MockRM.java:635)
at org.apache.hadoop.yarn.server.resourcemanager.ResourceManager.serviceStart(ResourceManager.java:1074)
at org.apache.hadoop.service.AbstractService.start(AbstractService.java:193)
at org.apache.hadoop.yarn.server.resourcemanager.webapp.TestRMWebappAuthentication.testSimpleAuth(TestRMWebappAuthentication.java:147)
FAILED: org.apache.hadoop.yarn.server.resourcemanager.webapp.TestRMWebappAuthentication.testSimpleAuth[1]
Error Message:
Error starting http server
Stack Trace:
org.apache.hadoop.yarn.webapp.WebAppException: Error starting http server
at sun.nio.ch.Net.bind0(Native Method)
at sun.nio.ch.Net.bind(Net.java:444)
at sun.nio.ch.Net.bind(Net.java:436)
at sun.nio.ch.ServerSocketChannelImpl.bind(ServerSocketChannelImpl.java:214)
at sun.nio.ch.ServerSocketAdaptor.bind(ServerSocketAdaptor.java:74)
at org.mortbay.jetty.nio.SelectChannelConnector.open(SelectChannelConnector.java:216)
at org.apache.hadoop.http.HttpServer2.openListeners(HttpServer2.java:830)
at org.apache.hadoop.http.HttpServer2.start(HttpServer2.java:772)
at org.apache.hadoop.yarn.webapp.WebApps$Builder.start(WebApps.java:274)
at org.apache.hadoop.yarn.server.resourcemanager.ResourceManager.startWepApp(ResourceManager.java:974)
at org.apache.hadoop.yarn.server.resourcemanager.MockRM.startWepApp(MockRM.java:635)
at org.apache.hadoop.yarn.server.resourcemanager.ResourceManager.serviceStart(ResourceManager.java:1074)
at org.apache.hadoop.service.AbstractService.start(AbstractService.java:193)
at org.apache.hadoop.yarn.server.resourcemanager.webapp.TestRMWebappAuthentication.testSimpleAuth(TestRMWebappAuthentication.java:147)
Success: YARN-3304 PreCommit Build #7129
Posted by Apache Jenkins Server <je...@builds.apache.org>.
Jira: https://issues.apache.org/jira/browse/YARN-3304
Build: https://builds.apache.org/job/PreCommit-YARN-Build/7129/
###################################################################################
########################## LAST 60 LINES OF THE CONSOLE ###########################
[...truncated 3323 lines...]
{color:green}+1 overall{color}. Here are the results of testing the latest attachment
http://issues.apache.org/jira/secure/attachment/12707904/YARN-3304-v4-negtive-value-way.patch
against trunk revision 3836ad6.
{color:green}+1 @author{color}. The patch does not contain any @author tags.
{color:green}+1 tests included{color}. The patch appears to include 1 new or modified test files.
{color:green}+1 javac{color}. The applied patch does not increase the total number of javac compiler warnings.
{color:green}+1 javadoc{color}. There were no new javadoc warning messages.
{color:green}+1 eclipse:eclipse{color}. The patch built with eclipse:eclipse.
{color:green}+1 findbugs{color}. The patch does not introduce any new Findbugs (version 2.0.3) warnings.
{color:green}+1 release audit{color}. The applied patch does not increase the total number of release audit warnings.
{color:green}+1 core tests{color}. The patch passed unit tests in hadoop-yarn-project/hadoop-yarn/hadoop-yarn-common.
Test results: https://builds.apache.org/job/PreCommit-YARN-Build/7129//testReport/
Console output: https://builds.apache.org/job/PreCommit-YARN-Build/7129//console
This message is automatically generated.
======================================================================
======================================================================
Adding comment to Jira.
======================================================================
======================================================================
Comment added.
5abc0094dfca60cf1e20c53ee3a137f726bd9321 logged out
======================================================================
======================================================================
Finished build.
======================================================================
======================================================================
Archiving artifacts
Sending artifact delta relative to PreCommit-YARN-Build #7115
Archived 20 artifacts
Archive block size is 32768
Received 56 blocks and 8669988 bytes
Compression is 17.5%
Took 1.9 sec
Description set: YARN-3304
Recording test results
Email was triggered for: Success
Sending email for trigger: Success
###################################################################################
############################## FAILED TESTS (if any) ##############################
All tests passed