You are viewing a plain text version of this content. The canonical link for it is here.
Posted to dev@geronimo.apache.org by Simon Langford <si...@pcmsgroup.com> on 2003/11/30 12:03:10 UTC
can't build from cvs
hi,
i checked out from cvs last night, and it doesn't seem to
build, anyone know where
geronimo-spec-j2ee-management-DEV.jar and
geronimo-spec-j2ee-deployment-DEV.jar are?
error:
+----------------------------------------
| Executing (site): Geronimo :: Kernel
| Memory: 74M/104M
+----------------------------------------
Attempting to download commons-collections-SNAPSHOT.jar.
Attempting to download
geronimo-spec-j2ee-management-DEV.jar.
WARNING: Failed to download
geronimo-spec-j2ee-management-DEV.jar.
Attempting to download
geronimo-spec-j2ee-deployment-DEV.jar.
WARNING: Failed to download
geronimo-spec-j2ee-deployment-DEV.jar.
Attempting to download mx4j-SNAPSHOT.jar.
BUILD FAILED
File...... file:/C:/incubator-geronimo/
Element... maven:reactor
Line...... 134
Column.... 27
The build cannot continue because of the following
unsatisfied dependencies:
geronimo-spec-j2ee-management-DEV.jar (no download url
specified)
geronimo-spec-j2ee-deployment-DEV.jar (no download url
specified)
Total time: 1 minutes 7 seconds
Finished at: Sun Nov 30 11:45:17 CET 2003
thanks
simon
The information contained in this e-mail is intended only for the person or
entity to which it is addressed and may contain confidential and/or
privileged material. If You are not the intended recipient of this e-mail,
the use of this information or any disclosure, copying or distribution is
Prohibited and may be unlawful. If you received this in error, please
contact the sender and delete the material from any computer. The views
expressed in this e-mail may not necessarily be the views of The PCMS Group
plc and should not be taken as authority to carry out any instruction
contained.
Re: can't build from cvs
Posted by Simon Matic Langford <si...@pcmsgroup.com>.
i just did "maven site" nothing fancy.
simon
On Mon, 01 Dec 2003 00:11:36 +0100
Jacek Laskowski <ja...@hp.com> wrote:
>Simon Langford wrote:
>>hi,
>>
>>i checked out from cvs last night, and it doesn't seem to
>>build, anyone
>>know where geronimo-spec-j2ee-management-DEV.jar and
>>geronimo-spec-j2ee-deployment-DEV.jar are?
>
>Hi,
>
>How do you invoke the build? The files are created during
>the build and although they're not available at
>ibiblio.org the build ought not to fail. I have even
>deleted the mentioned and other files in geronimo-spec
>directory and run the build with 'maven -o build' to make
>sure it'd work. And it does.
>
>/geronimo
>> maven -o build
>...
> [echo] Processing geronimo-spec:geronimo-spec-jms...
>BUILD SUCCESSFUL
>Total time: 3 minutes 3 seconds
>Finished at: Mon Dec 01 00:06:56 CET 2003
>
>See this for details ->
>http://wiki.apache.org/geronimo/BuildingAndRunning.
>
>Also have a read of Geronimo's README.txt. It's in the
>home directory.
>
>Jacek
>
The information contained in this e-mail is intended only for the person or
entity to which it is addressed and may contain confidential and/or
privileged material. If You are not the intended recipient of this e-mail,
the use of this information or any disclosure, copying or distribution is
Prohibited and may be unlawful. If you received this in error, please
contact the sender and delete the material from any computer. The views
expressed in this e-mail may not necessarily be the views of The PCMS Group
plc and should not be taken as authority to carry out any instruction
contained.
Re: can't build from cvs
Posted by Jacek Laskowski <ja...@hp.com>.
Simon Langford wrote:
> hi,
>
> i checked out from cvs last night, and it doesn't seem to build, anyone
> know where geronimo-spec-j2ee-management-DEV.jar and
> geronimo-spec-j2ee-deployment-DEV.jar are?
Hi,
How do you invoke the build? The files are created during the build and
although they're not available at ibiblio.org the build ought not to
fail. I have even deleted the mentioned and other files in geronimo-spec
directory and run the build with 'maven -o build' to make sure it'd
work. And it does.
/geronimo
> maven -o build
...
[echo] Processing geronimo-spec:geronimo-spec-jms...
BUILD SUCCESSFUL
Total time: 3 minutes 3 seconds
Finished at: Mon Dec 01 00:06:56 CET 2003
See this for details -> http://wiki.apache.org/geronimo/BuildingAndRunning.
Also have a read of Geronimo's README.txt. It's in the home directory.
Jacek
Re: can't build from cvs
Posted by Nick Stuart <ni...@newtsplace.com>.
We do have a firewall running, but that wasn't the problem....looked in those
files you pointed me too and it said it couldn't resolve my own computers host
name (instead of say localhost it was using mycomp.domain.com) and this is a
laptop that I move around so it get thrown on different domains....
Anyways, easy fix was to through my host name into the /etc/hosts file. Builds
fine now.
-Nick
Quoting Jacek Laskowski <ja...@hp.com>:
> Nick Stuart wrote:
>
> >>I have the same problem, but a little different output:
> >>
> >>test:test:
> >> [junit] Running
> org.apache.geronimo.remoting.transport.AsyncTransportTest
> >> [junit] Tests run: 2, Failures: 0, Errors: 2, Time elapsed: 8.151 sec
> >> [junit] [ERROR] TEST
> >>org.apache.geronimo.remoting.transport.AsyncTransportTest FAILED
> >> [junit] Running org.apache.geronimo.remoting.MarshalingInterceptorsTest
> >> [junit] Tests run: 8, Failures: 0, Errors: 0, Time elapsed: 0.269 sec
> >> [junit] Running org.apache.geronimo.remoting.RemotingInterceptorsTest
> >> [junit] Tests run: 8, Failures: 0, Errors: 8, Time elapsed: 32.246 sec
> >> [junit] [ERROR] TEST
> >>org.apache.geronimo.remoting.RemotingInterceptorsTest
> >>FAILED
>
> Hi,
>
> Do you have a personal firewall running? What's in
>
modules/remoting/target/test-reports/TEST-org.apache.geronimo.remoting.transport.AsyncTransportTest.txt
> and
>
modules/remoting/target/test-reports/TEST-org.apache.geronimo.remoting.RemotingInterceptorsTest.txt?
> What platform do you run the tests on? HP-UX 11.0 + JDK 1.4.x is known
> to not work with the tests.
>
> Perhaps it will help you out too ->
>
http://wiki.apache.org/geronimo/BuildingAndRunning#head-1a5419a621a9c7092f318a52819033ffed86afc5
>
> Besides, you can build Geronimo regardless of how the tests finish. Just
> type 'maven -Dmaven.test.skip=true build'.
>
> See
>
http://wiki.apache.org/geronimo/BuildingAndRunning#head-988099bda53d95dbf5e00b8fdfae0bc37b6dc206
> for reference.
>
> Jacek
>
----------------------------------------------------------------
This message was sent using IMP, the Internet Messaging Program.
Re: can't build from cvs
Posted by Jacek Laskowski <ja...@hp.com>.
Nick Stuart wrote:
>>I have the same problem, but a little different output:
>>
>>test:test:
>> [junit] Running org.apache.geronimo.remoting.transport.AsyncTransportTest
>> [junit] Tests run: 2, Failures: 0, Errors: 2, Time elapsed: 8.151 sec
>> [junit] [ERROR] TEST
>>org.apache.geronimo.remoting.transport.AsyncTransportTest FAILED
>> [junit] Running org.apache.geronimo.remoting.MarshalingInterceptorsTest
>> [junit] Tests run: 8, Failures: 0, Errors: 0, Time elapsed: 0.269 sec
>> [junit] Running org.apache.geronimo.remoting.RemotingInterceptorsTest
>> [junit] Tests run: 8, Failures: 0, Errors: 8, Time elapsed: 32.246 sec
>> [junit] [ERROR] TEST
>>org.apache.geronimo.remoting.RemotingInterceptorsTest
>>FAILED
Hi,
Do you have a personal firewall running? What's in
modules/remoting/target/test-reports/TEST-org.apache.geronimo.remoting.transport.AsyncTransportTest.txt
and
modules/remoting/target/test-reports/TEST-org.apache.geronimo.remoting.RemotingInterceptorsTest.txt?
What platform do you run the tests on? HP-UX 11.0 + JDK 1.4.x is known
to not work with the tests.
Perhaps it will help you out too ->
http://wiki.apache.org/geronimo/BuildingAndRunning#head-1a5419a621a9c7092f318a52819033ffed86afc5
Besides, you can build Geronimo regardless of how the tests finish. Just
type 'maven -Dmaven.test.skip=true build'.
See
http://wiki.apache.org/geronimo/BuildingAndRunning#head-988099bda53d95dbf5e00b8fdfae0bc37b6dc206
for reference.
Jacek
Re: can't build from cvs
Posted by Nick Stuart <ni...@newtsplace.com>.
Doh...first attempt didnt include the mailing list...lets try this again....
Quoting Nick Stuart <ni...@newtsplace.com>:
> I have the same problem, but a little different output:
>
> test:test:
> [junit] Running org.apache.geronimo.remoting.transport.AsyncTransportTest
> [junit] Tests run: 2, Failures: 0, Errors: 2, Time elapsed: 8.151 sec
> [junit] [ERROR] TEST
> org.apache.geronimo.remoting.transport.AsyncTransportTest FAILED
> [junit] Running org.apache.geronimo.remoting.MarshalingInterceptorsTest
> [junit] Tests run: 8, Failures: 0, Errors: 0, Time elapsed: 0.269 sec
> [junit] Running org.apache.geronimo.remoting.RemotingInterceptorsTest
> [junit] Tests run: 8, Failures: 0, Errors: 8, Time elapsed: 32.246 sec
> [junit] [ERROR] TEST
> org.apache.geronimo.remoting.RemotingInterceptorsTest
> FAILED
>
> BUILD FAILED
> File...... file:/home/nstuart/java/geronimo/incubator-geronimo/
> Element... maven:reactor
> Line...... 134
> Column.... 27
> Unable to obtain goal [default] --
> file:/home/nstuart/.maven/plugins/maven-test-plugin-1.3/:99:54: <fail> There
> were test failures.
> Total time: 9 minutes 59 seconds
>
> Just checked this out this morning.
>
> -Nick
>
> Quoting Simon Langford <si...@pcmsgroup.com>:
>
> > hi,
> >
> > i checked out from cvs last night, and it doesn't seem to
> > build, anyone know where
> > geronimo-spec-j2ee-management-DEV.jar and
> > geronimo-spec-j2ee-deployment-DEV.jar are?
> >
> > error:
> >
> > +----------------------------------------
> > | Executing (site): Geronimo :: Kernel
> > | Memory: 74M/104M
> > +----------------------------------------
> > Attempting to download commons-collections-SNAPSHOT.jar.
> > Attempting to download
> > geronimo-spec-j2ee-management-DEV.jar.
> > WARNING: Failed to download
> > geronimo-spec-j2ee-management-DEV.jar.
> > Attempting to download
> > geronimo-spec-j2ee-deployment-DEV.jar.
> > WARNING: Failed to download
> > geronimo-spec-j2ee-deployment-DEV.jar.
> > Attempting to download mx4j-SNAPSHOT.jar.
> >
> > BUILD FAILED
> > File...... file:/C:/incubator-geronimo/
> > Element... maven:reactor
> > Line...... 134
> > Column.... 27
> > The build cannot continue because of the following
> > unsatisfied dependencies:
> >
> > geronimo-spec-j2ee-management-DEV.jar (no download url
> > specified)
> > geronimo-spec-j2ee-deployment-DEV.jar (no download url
> > specified)
> >
> > Total time: 1 minutes 7 seconds
> > Finished at: Sun Nov 30 11:45:17 CET 2003
> >
> > thanks
> >
> > simon
> > The information contained in this e-mail is intended only for the person or
> > entity to which it is addressed and may contain confidential and/or
> > privileged material. If You are not the intended recipient of this e-mail,
> > the use of this information or any disclosure, copying or distribution is
> > Prohibited and may be unlawful. If you received this in error, please
> > contact the sender and delete the material from any computer. The views
> > expressed in this e-mail may not necessarily be the views of The PCMS Group
> > plc and should not be taken as authority to carry out any instruction
> > contained.
> >
>
>
> ----------------------------------------------------------------
> This message was sent using IMP, the Internet Messaging Program.
>
----------------------------------------------------------------
This message was sent using IMP, the Internet Messaging Program.