You are viewing a plain text version of this content. The canonical link for it is here.
Posted to builds@beam.apache.org by Apache Jenkins Server <je...@builds.apache.org> on 2021/11/01 06:06:06 UTC

Build failed in Jenkins: beam_PostCommit_Go_VR_Flink #5396

See <https://ci-beam.apache.org/job/beam_PostCommit_Go_VR_Flink/5396/display/redirect>

Changes:


------------------------------------------
[...truncated 34.44 KB...]
> Task :sdks:java:extensions:sql:compileJavacc
Reading from file <https://ci-beam.apache.org/job/beam_PostCommit_Go_VR_Flink/ws/src/sdks/java/extensions/sql/build/generated/fmpp/javacc/Parser.jj> . . .
Note: UNICODE_INPUT option is specified. Please make sure you create the parser/lexer using a Reader with the correct character encoding.
Warning: Lookahead adequacy checking not being performed since option LOOKAHEAD is more than 1.  Set option FORCE_LA_CHECK to true to force checking.

> Task :model:pipeline:shadowJar FROM-CACHE

> Task :sdks:java:container:goPrepare
Use project GOPATH: <https://ci-beam.apache.org/job/beam_PostCommit_Go_VR_Flink/ws/src/sdks/java/container/.gogradle/project_gopath>

> Task :sdks:java:container:resolveBuildDependencies SKIPPED
> Task :sdks:java:container:installDependencies SKIPPED
> Task :sdks:java:extensions:sql:createCheckerFrameworkManifest
> Task :sdks:java:extensions:sql:processResources
> Task :model:fn-execution:extractIncludeProto
> Task :model:job-management:extractIncludeProto
> Task :model:job-management:generateProto FROM-CACHE
> Task :model:fn-execution:generateProto FROM-CACHE
> Task :model:job-management:compileJava FROM-CACHE
> Task :model:job-management:classes
> Task :model:fn-execution:compileJava FROM-CACHE
> Task :model:fn-execution:classes
> Task :model:job-management:shadowJar FROM-CACHE
> Task :model:fn-execution:shadowJar FROM-CACHE
go: downloading google.golang.org/grpc v1.39.0
go: downloading github.com/golang/protobuf v1.5.2
go: downloading google.golang.org/protobuf v1.27.1
go: downloading cloud.google.com/go v0.81.0
go: downloading google.golang.org/api v0.45.0
go: downloading github.com/golang/protobuf v1.5.2
go: downloading github.com/google/uuid v1.3.0
go: downloading golang.org/x/oauth2 v0.0.0-20210628180205-a41e5a781914
go: downloading google.golang.org/protobuf v1.27.1
go: downloading google.golang.org/grpc v1.39.0

> Task :release:go-licenses:java:dockerRun
+ rm -rf '/output/*'
+ export GO111MODULE=off
+ GO111MODULE=off
+ go get github.com/apache/beam/sdks/java/container

go: downloading github.com/golang/protobuf v1.5.2
go: downloading google.golang.org/grpc v1.39.0
go: downloading google.golang.org/protobuf v1.27.1
go: downloading google.golang.org/genproto v0.0.0-20210728212813-7823e685a01f

> Task :release:go-licenses:go:dockerRun
+ rm -rf '/output/*'
+ export GO111MODULE=off
+ GO111MODULE=off
+ go get github.com/apache/beam/sdks/go/container

go: downloading golang.org/x/net v0.0.0-20210423184538-5f58ad60dda6
go: downloading golang.org/x/sys v0.0.0-20210630005230-0f9fa26af87c
go: downloading golang.org/x/net v0.0.0-20210423184538-5f58ad60dda6
go: downloading google.golang.org/genproto v0.0.0-20210728212813-7823e685a01f
go: downloading golang.org/x/sys v0.0.0-20210630005230-0f9fa26af87c
go: downloading cloud.google.com/go/storage v1.15.0
go: downloading google.golang.org/genproto v0.0.0-20210728212813-7823e685a01f
go: downloading golang.org/x/sys v0.0.0-20210630005230-0f9fa26af87c
go: downloading golang.org/x/net v0.0.0-20210423184538-5f58ad60dda6
go: downloading golang.org/x/text v0.3.6
go: downloading golang.org/x/text v0.3.6
go: downloading go.opencensus.io v0.23.0
go: downloading github.com/googleapis/gax-go/v2 v2.0.5

> Task :sdks:java:core:compileJava FROM-CACHE
> Task :sdks:java:core:classes
go: downloading github.com/golang/groupcache v0.0.0-20210331224755-41bb18bfe9da
go: downloading golang.org/x/text v0.3.6
> Task :sdks:java:core:shadowJar FROM-CACHE
> Task :sdks:java:extensions:join-library:compileJava FROM-CACHE
> Task :sdks:java:extensions:join-library:classes UP-TO-DATE
> Task :sdks:java:io:hadoop-common:compileJava FROM-CACHE
> Task :sdks:java:io:hadoop-common:classes UP-TO-DATE
> Task :runners:local-java:compileJava FROM-CACHE
> Task :sdks:java:extensions:arrow:compileJava FROM-CACHE
> Task :runners:local-java:classes UP-TO-DATE
> Task :sdks:java:extensions:arrow:classes UP-TO-DATE
> Task :sdks:java:extensions:join-library:jar
> Task :sdks:java:io:hadoop-common:jar
> Task :runners:local-java:jar
> Task :sdks:java:extensions:arrow:jar
> Task :sdks:java:extensions:protobuf:extractIncludeProto
> Task :sdks:java:extensions:protobuf:generateProto NO-SOURCE
> Task :sdks:java:fn-execution:compileJava FROM-CACHE
> Task :sdks:java:fn-execution:classes UP-TO-DATE
> Task :sdks:java:io:mongodb:compileJava FROM-CACHE
> Task :sdks:java:io:mongodb:classes UP-TO-DATE
> Task :sdks:java:io:parquet:compileJava FROM-CACHE
> Task :sdks:java:io:parquet:classes UP-TO-DATE
> Task :sdks:java:extensions:protobuf:compileJava FROM-CACHE
> Task :sdks:java:extensions:protobuf:classes UP-TO-DATE
> Task :sdks:java:io:amazon-web-services2:compileJava FROM-CACHE
> Task :sdks:java:io:amazon-web-services2:classes UP-TO-DATE
> Task :sdks:java:extensions:protobuf:jar
> Task :sdks:java:io:amazon-web-services2:jar
> Task :sdks:java:fn-execution:jar
> Task :sdks:java:io:parquet:jar
> Task :sdks:java:io:mongodb:jar
> Task :runners:core-construction-java:compileJava FROM-CACHE
> Task :runners:core-construction-java:classes UP-TO-DATE
> Task :runners:core-construction-java:jar
> Task :runners:core-java:compileJava FROM-CACHE
> Task :runners:core-java:classes UP-TO-DATE
> Task :runners:core-java:jar
> Task :sdks:go:container:buildLinuxAmd64
> Task :sdks:go:container:goBuild
> Task :sdks:java:extensions:google-cloud-platform-core:compileJava FROM-CACHE
> Task :sdks:java:extensions:google-cloud-platform-core:classes UP-TO-DATE
> Task :sdks:java:extensions:google-cloud-platform-core:jar
> Task :sdks:java:harness:compileJava FROM-CACHE
> Task :sdks:java:harness:classes UP-TO-DATE
> Task :sdks:java:harness:jar
> Task :sdks:java:container:buildLinuxAmd64
> Task :sdks:java:container:goBuild
> Task :sdks:java:container:java11:copySdkHarnessLauncher
> Task :sdks:java:container:java8:copySdkHarnessLauncher
> Task :sdks:go:test:buildLinuxAmd64
> Task :sdks:go:test:goBuild
> Task :sdks:java:harness:shadowJar FROM-CACHE
> Task :sdks:java:container:generateLicenseReport
> Task :runners:java-fn-execution:compileJava FROM-CACHE
> Task :runners:java-fn-execution:classes UP-TO-DATE
> Task :runners:java-fn-execution:jar
> Task :sdks:java:expansion-service:compileJava FROM-CACHE
> Task :sdks:java:expansion-service:classes UP-TO-DATE
> Task :runners:direct-java:compileJava FROM-CACHE
> Task :runners:direct-java:classes UP-TO-DATE
> Task :sdks:java:expansion-service:jar
> Task :runners:java-job-service:compileJava FROM-CACHE
> Task :runners:java-job-service:classes UP-TO-DATE
> Task :sdks:java:testing:expansion-service:compileTestJava FROM-CACHE
> Task :sdks:java:testing:expansion-service:testClasses
> Task :runners:java-job-service:jar
> Task :runners:direct-java:shadowJar FROM-CACHE
> Task :sdks:java:io:kafka:compileJava FROM-CACHE
> Task :sdks:java:io:kafka:classes UP-TO-DATE
> Task :sdks:java:io:kafka:jar
> Task :runners:flink:1.13:compileJava FROM-CACHE
> Task :runners:flink:1.13:classes
> Task :sdks:java:io:google-cloud-platform:compileJava FROM-CACHE
> Task :sdks:java:io:google-cloud-platform:classes UP-TO-DATE
> Task :runners:flink:1.13:jar
> Task :runners:flink:1.13:job-server:compileJava NO-SOURCE
> Task :runners:flink:1.13:job-server:classes UP-TO-DATE
> Task :sdks:java:io:google-cloud-platform:jar
> Task :sdks:java:container:java8:copyDockerfileDependencies
> Task :sdks:java:container:java11:copyDockerfileDependencies
> Task :sdks:java:extensions:sql:compileJava FROM-CACHE
> Task :sdks:java:extensions:sql:classes
> Task :sdks:java:extensions:sql:jar
> Task :sdks:java:extensions:sql:zetasql:compileJava FROM-CACHE
> Task :sdks:java:extensions:sql:zetasql:classes UP-TO-DATE
> Task :sdks:java:extensions:sql:zetasql:jar
> Task :sdks:java:extensions:sql:expansion-service:compileJava FROM-CACHE
> Task :sdks:java:extensions:sql:expansion-service:classes UP-TO-DATE
> Task :sdks:java:extensions:sql:expansion-service:jar
> Task :sdks:java:testing:expansion-service:buildTestExpansionServiceJar FROM-CACHE
> Task :sdks:java:extensions:sql:expansion-service:shadowJar FROM-CACHE

> Task :sdks:java:container:pullLicenses
DEPRECATION: Python 3.5 reached the end of its life on September 13th, 2020. Please upgrade your Python as Python 3.5 is no longer maintained. pip 21.0 will drop support for Python 3.5 in January 2021. pip 21.0 will remove support for this functionality.
INFO:root:Pulling license for 208 dependencies using 16 threads.
INFO:root:pull_licenses_java.py succeed. It took 6.047268 seconds with 16 threads.

> Task :sdks:java:container:java8:copyJavaThirdPartyLicenses
> Task :sdks:java:container:java11:copyJavaThirdPartyLicenses
> Task :runners:flink:1.13:job-server:shadowJar FROM-CACHE

> Task :release:go-licenses:java:dockerRun
+ go-licenses save github.com/apache/beam/sdks/java/container --save_path=/output/licenses

> Task :release:go-licenses:go:dockerRun
+ go-licenses save github.com/apache/beam/sdks/go/container --save_path=/output/licenses
+ go-licenses csv github.com/apache/beam/sdks/go/container
+ tee /output/licenses/list.csv
+ chmod -R a+w /output/licenses

> Task :release:go-licenses:java:dockerRun
+ go-licenses csv github.com/apache/beam/sdks/java/container
+ tee /output/licenses/list.csv
+ chmod -R a+w /output/licenses

> Task :release:go-licenses:java:createLicenses
> Task :sdks:java:container:java11:copyGolangLicenses
> Task :sdks:java:container:java8:copyGolangLicenses
> Task :release:go-licenses:go:createLicenses
> Task :sdks:go:container:copyGolangLicenses
> Task :sdks:java:container:java8:dockerPrepare
> Task :sdks:go:container:dockerPrepare
> Task :sdks:java:container:java11:dockerPrepare
> Task :sdks:java:container:java8:docker
> Task :sdks:go:container:docker
> Task :sdks:java:container:java11:docker

> Task :sdks:go:container:docker
Removing intermediate container 1482838d39f8
 ---> 7e0c6f87b9f2
Step 11/11 : ENTRYPOINT ["/opt/apache/beam/boot"]
 ---> Running in 491a2866de93
Removing intermediate container 491a2866de93
 ---> 7d4c46c5f1c8
Successfully built 7d4c46c5f1c8
Successfully tagged apache/beam_go_sdk:latest

> Task :sdks:go:test:flinkValidatesRunner
Nov 01, 2021 6:05:02 AM org.apache.beam.sdk.expansion.service.ExpansionService loadRegisteredTransforms
INFO: Registering external transforms: [beam:transforms:xlang:test:cgbk, beam:transforms:xlang:test:flatten, beam:transforms:xlang:test:prefix, beam:transforms:xlang:test:multi, beam:transforms:xlang:test:gbk, beam:transforms:xlang:test:comgl, beam:transforms:xlang:test:compk, beam:transforms:xlang:count, beam:transforms:xlang:filter_less_than_eq, beam:transforms:xlang:test:partition, beam:transforms:xlang:test:parquet_write, beam:transforms:xlang:parquet_read, beam:transforms:xlang:textio_read, beam:external:java:generate_sequence:v1]
Nov 01, 2021 6:05:04 AM org.apache.beam.sdk.io.aws2.s3.DefaultS3ClientBuilderFactory createBuilder
INFO: The AWS S3 Beam extension was included in this build, but the awsRegion flag was not specified. If you don't plan to use S3, then ignore this message.
Nov 01, 2021 6:05:06 AM org.apache.beam.runners.jobsubmission.JobServerDriver createArtifactStagingService
INFO: ArtifactStagingService started on localhost:39427
Nov 01, 2021 6:05:06 AM org.apache.beam.runners.jobsubmission.JobServerDriver createExpansionService
INFO: Java ExpansionService started on localhost:35983
Nov 01, 2021 6:05:06 AM org.apache.beam.runners.jobsubmission.JobServerDriver createJobServer
INFO: JobService started on localhost:52193
Nov 01, 2021 6:05:06 AM org.apache.beam.runners.jobsubmission.JobServerDriver run
INFO: Job server now running, terminate with Ctrl+C
./run_validatesrunner_tests.sh: line 399: go: command not found

> Task :sdks:go:test:flinkValidatesRunner FAILED

FAILURE: Build failed with an exception.

* Where:
Build file '<https://ci-beam.apache.org/job/beam_PostCommit_Go_VR_Flink/ws/src/sdks/go/test/build.gradle'> line: 106

* What went wrong:
Execution failed for task ':sdks:go:test:flinkValidatesRunner'.
> Process 'command 'sh'' finished with non-zero exit value 127

* Try:
Run with --stacktrace option to get the stack trace. Run with --info or --debug option to get more log output. Run with --scan to get full insights.

* Get more help at https://help.gradle.org

Deprecated Gradle features were used in this build, making it incompatible with Gradle 7.0.
Use '--warning-mode all' to show the individual deprecation warnings.
See https://docs.gradle.org/6.9.1/userguide/command_line_interface.html#sec:command_line_warnings

BUILD FAILED in 5m 41s
164 actionable tasks: 116 executed, 43 from cache, 5 up-to-date

Publishing build scan...
https://gradle.com/s/jtkgsvuougwx4

Build step 'Invoke Gradle script' changed build result to FAILURE
Build step 'Invoke Gradle script' marked build as failure

---------------------------------------------------------------------
To unsubscribe, e-mail: builds-unsubscribe@beam.apache.org
For additional commands, e-mail: builds-help@beam.apache.org


Jenkins build is back to normal : beam_PostCommit_Go_VR_Flink #5399

Posted by Apache Jenkins Server <je...@builds.apache.org>.
See <https://ci-beam.apache.org/job/beam_PostCommit_Go_VR_Flink/5399/display/redirect?page=changes>


---------------------------------------------------------------------
To unsubscribe, e-mail: builds-unsubscribe@beam.apache.org
For additional commands, e-mail: builds-help@beam.apache.org


Build failed in Jenkins: beam_PostCommit_Go_VR_Flink #5398

Posted by Apache Jenkins Server <je...@builds.apache.org>.
See <https://ci-beam.apache.org/job/beam_PostCommit_Go_VR_Flink/5398/display/redirect?page=changes>

Changes:

[noreply] [BEAM-11936] Fix errorprone warnings (#15821)


------------------------------------------
[...truncated 41.30 KB...]
> Task :model:pipeline:shadowJar FROM-CACHE
> Task :model:fn-execution:extractIncludeProto
> Task :model:job-management:extractIncludeProto
> Task :model:job-management:generateProto FROM-CACHE
> Task :model:fn-execution:generateProto FROM-CACHE
> Task :model:job-management:compileJava FROM-CACHE
> Task :model:job-management:classes
> Task :model:fn-execution:compileJava FROM-CACHE
> Task :model:fn-execution:classes
> Task :model:job-management:shadowJar FROM-CACHE
> Task :model:fn-execution:shadowJar FROM-CACHE

> Task :sdks:java:container:pullLicenses
DEPRECATION: Python 3.5 reached the end of its life on September 13th, 2020. Please upgrade your Python as Python 3.5 is no longer maintained. pip 21.0 will drop support for Python 3.5 in January 2021. pip 21.0 will remove support for this functionality.

> Task :sdks:java:core:compileJava

> Task :sdks:java:container:pullLicenses
INFO:root:Pulling license for 208 dependencies using 16 threads.
INFO:root:pull_licenses_java.py succeed. It took 3.694498 seconds with 16 threads.

> Task :sdks:java:container:java8:copyJavaThirdPartyLicenses
> Task :sdks:java:container:java11:copyJavaThirdPartyLicenses

> Task :release:go-licenses:go:dockerRun
+ go-licenses save github.com/apache/beam/sdks/go/container --save_path=/output/licenses

> Task :release:go-licenses:java:dockerRun
+ go-licenses save github.com/apache/beam/sdks/java/container --save_path=/output/licenses
+ tee /output/licenses/list.csv
+ go-licenses csv github.com/apache/beam/sdks/java/container
+ chmod -R a+w /output/licenses

> Task :release:go-licenses:go:dockerRun
+ go-licenses csv github.com/apache/beam/sdks/go/container
+ tee /output/licenses/list.csv
+ chmod -R a+w /output/licenses

> Task :release:go-licenses:go:createLicenses
> Task :sdks:go:container:copyGolangLicenses
> Task :sdks:go:container:dockerPrepare
> Task :release:go-licenses:java:createLicenses
> Task :sdks:java:container:java8:copyGolangLicenses
> Task :sdks:java:container:java11:copyGolangLicenses
> Task :sdks:go:container:docker

> Task :sdks:java:core:compileJava
Note: Some input files use or override a deprecated API.
Note: Recompile with -Xlint:deprecation for details.
Note: Some input files use unchecked or unsafe operations.
Note: Recompile with -Xlint:unchecked for details.

> Task :sdks:java:core:classes
> Task :sdks:java:core:shadowJar FROM-CACHE
> Task :sdks:java:extensions:protobuf:extractIncludeProto
> Task :sdks:java:extensions:protobuf:generateProto NO-SOURCE
> Task :sdks:java:fn-execution:compileJava
> Task :runners:local-java:compileJava
> Task :sdks:java:extensions:arrow:compileJava
> Task :sdks:java:extensions:join-library:compileJava
> Task :sdks:java:io:hadoop-common:compileJava
> Task :sdks:java:io:mongodb:compileJava
> Task :sdks:java:io:amazon-web-services2:compileJava
> Task :sdks:java:extensions:protobuf:compileJava
warning: Memory constraints are impeding performance; please increase max heap size.
error: warnings found and -Werror specified
warning: Memory constraints are impeding performance; please increase max heap size.

> Task :sdks:java:extensions:join-library:compileJava
Note: <https://ci-beam.apache.org/job/beam_PostCommit_Go_VR_Flink/ws/src/sdks/java/extensions/join-library/src/main/java/org/apache/beam/sdk/extensions/joinlibrary/Join.java> uses unchecked or unsafe operations.
Note: Recompile with -Xlint:unchecked for details.

> Task :runners:local-java:classes
> Task :runners:local-java:jar
> Task :sdks:java:extensions:arrow:classes
> Task :sdks:java:extensions:arrow:jar
> Task :sdks:java:extensions:join-library:classes
> Task :sdks:java:extensions:join-library:jar
> Task :sdks:java:io:hadoop-common:classes
> Task :sdks:java:io:hadoop-common:jar
> Task :sdks:java:io:parquet:compileJava

> Task :sdks:java:io:mongodb:compileJava
Note: Some input files use or override a deprecated API.
Note: Recompile with -Xlint:deprecation for details.
Note: Some input files use unchecked or unsafe operations.
Note: Recompile with -Xlint:unchecked for details.

> Task :sdks:java:io:mongodb:classes
> Task :sdks:java:io:mongodb:jar

> Task :sdks:java:io:parquet:compileJava
Note: <https://ci-beam.apache.org/job/beam_PostCommit_Go_VR_Flink/ws/src/sdks/java/io/parquet/src/main/java/org/apache/beam/sdk/io/parquet/ParquetIO.java> uses or overrides a deprecated API.
Note: Recompile with -Xlint:deprecation for details.

> Task :sdks:java:io:parquet:classes
> Task :sdks:java:io:parquet:jar

> Task :sdks:java:fn-execution:compileJava
Note: Some input files use or override a deprecated API.
Note: Recompile with -Xlint:deprecation for details.
Note: Some input files use unchecked or unsafe operations.
Note: Recompile with -Xlint:unchecked for details.

> Task :sdks:java:fn-execution:classes
> Task :sdks:java:fn-execution:jar

> Task :sdks:java:extensions:protobuf:compileJava
Note: Some input files use or override a deprecated API.
Note: Recompile with -Xlint:deprecation for details.
Note: Some input files use unchecked or unsafe operations.
Note: Recompile with -Xlint:unchecked for details.
1 error
2 warnings

> Task :sdks:java:extensions:protobuf:compileJava FAILED
> Task :runners:core-construction-java:compileJava

> Task :sdks:java:io:amazon-web-services2:compileJava
Note: Some input files use or override a deprecated API.
Note: Recompile with -Xlint:deprecation for details.
Note: Some input files use unchecked or unsafe operations.
Note: Recompile with -Xlint:unchecked for details.

> Task :sdks:java:io:amazon-web-services2:classes
> Task :sdks:java:io:amazon-web-services2:jar

> Task :runners:core-construction-java:compileJava
Note: Some input files use or override a deprecated API.
Note: Recompile with -Xlint:deprecation for details.
Note: Some input files use unchecked or unsafe operations.
Note: Recompile with -Xlint:unchecked for details.

> Task :runners:core-construction-java:classes
> Task :runners:core-construction-java:jar
> Task :runners:core-java:compileJava
Note: Some input files use or override a deprecated API.
Note: Recompile with -Xlint:deprecation for details.
Note: Some input files use unchecked or unsafe operations.
Note: Recompile with -Xlint:unchecked for details.

> Task :runners:core-java:classes
> Task :runners:core-java:jar

> Task :sdks:java:extensions:google-cloud-platform-core:compileJava
Note: Some input files use or override a deprecated API.
Note: Recompile with -Xlint:deprecation for details.

> Task :sdks:java:extensions:google-cloud-platform-core:classes
> Task :sdks:java:extensions:google-cloud-platform-core:jar
> Task :sdks:java:harness:compileJava
Note: Some input files use or override a deprecated API.
Note: Recompile with -Xlint:deprecation for details.
Note: Some input files use unchecked or unsafe operations.
Note: Recompile with -Xlint:unchecked for details.

> Task :sdks:java:harness:classes
> Task :sdks:java:harness:jar
> Task :sdks:java:harness:shadowJar
> Task :runners:java-fn-execution:compileJava
Note: Some input files use or override a deprecated API.
Note: Recompile with -Xlint:deprecation for details.
Note: Some input files use unchecked or unsafe operations.
Note: Recompile with -Xlint:unchecked for details.

> Task :runners:java-fn-execution:classes
> Task :runners:java-fn-execution:jar
> Task :sdks:java:expansion-service:compileJava FROM-CACHE
> Task :sdks:java:expansion-service:classes UP-TO-DATE
> Task :sdks:java:expansion-service:jar

> Task :sdks:java:testing:expansion-service:compileTestJava
Note: <https://ci-beam.apache.org/job/beam_PostCommit_Go_VR_Flink/ws/src/sdks/java/testing/expansion-service/src/test/java/org/apache/beam/sdk/testing/expansion/TestExpansionService.java> uses or overrides a deprecated API.
Note: Recompile with -Xlint:deprecation for details.
Note: <https://ci-beam.apache.org/job/beam_PostCommit_Go_VR_Flink/ws/src/sdks/java/testing/expansion-service/src/test/java/org/apache/beam/sdk/testing/expansion/TestExpansionService.java> uses unchecked or unsafe operations.
Note: Recompile with -Xlint:unchecked for details.

> Task :sdks:java:testing:expansion-service:testClasses
> Task :runners:direct-java:compileJava
> Task :runners:java-job-service:compileJava
> Task :sdks:java:io:kafka:compileJava
> Task :sdks:java:testing:expansion-service:buildTestExpansionServiceJar

> Task :runners:java-job-service:compileJava
Note: <https://ci-beam.apache.org/job/beam_PostCommit_Go_VR_Flink/ws/src/runners/java-job-service/src/main/java/org/apache/beam/runners/jobsubmission/PortablePipelineJarCreator.java> uses unchecked or unsafe operations.
Note: Recompile with -Xlint:unchecked for details.

> Task :runners:java-job-service:classes
> Task :runners:java-job-service:jar
> Task :runners:flink:1.13:compileJava

> Task :sdks:java:io:kafka:compileJava
Note: Some input files use or override a deprecated API.
Note: Recompile with -Xlint:deprecation for details.
Note: Some input files use unchecked or unsafe operations.
Note: Recompile with -Xlint:unchecked for details.

> Task :sdks:java:io:kafka:classes
> Task :sdks:java:io:kafka:jar
> Task :sdks:java:container:java8:copyDockerfileDependencies
> Task :sdks:java:container:java11:copyDockerfileDependencies
> Task :sdks:java:container:java8:dockerPrepare
> Task :sdks:java:container:java11:dockerPrepare
> Task :sdks:java:container:java8:docker

> Task :runners:direct-java:compileJava
Note: Some input files use or override a deprecated API.
Note: Recompile with -Xlint:deprecation for details.
Note: Some input files use unchecked or unsafe operations.
Note: Recompile with -Xlint:unchecked for details.

> Task :sdks:java:container:java11:docker
> Task :runners:direct-java:classes
> Task :runners:direct-java:shadowJar FROM-CACHE

> Task :runners:flink:1.13:compileJava
Note: Some input files use or override a deprecated API.
Note: Recompile with -Xlint:deprecation for details.
Note: Some input files use unchecked or unsafe operations.
Note: Recompile with -Xlint:unchecked for details.

> Task :runners:flink:1.13:classes
> Task :runners:flink:1.13:jar
> Task :runners:flink:1.13:job-server:compileJava NO-SOURCE
> Task :runners:flink:1.13:job-server:classes UP-TO-DATE

FAILURE: Build failed with an exception.

* What went wrong:
Execution failed for task ':sdks:java:extensions:protobuf:compileJava'.
> Compilation failed; see the compiler error output for details.

* Try:
Run with --stacktrace option to get the stack trace. Run with --info or --debug option to get more log output. Run with --scan to get full insights.

* Get more help at https://help.gradle.org

Deprecated Gradle features were used in this build, making it incompatible with Gradle 7.0.
Use '--warning-mode all' to show the individual deprecation warnings.
See https://docs.gradle.org/6.9.1/userguide/command_line_interface.html#sec:command_line_warnings

BUILD FAILED in 18m 56s
152 actionable tasks: 135 executed, 12 from cache, 5 up-to-date

Publishing build scan...
https://gradle.com/s/iko2c2kz432ii

Build step 'Invoke Gradle script' changed build result to FAILURE
Build step 'Invoke Gradle script' marked build as failure

---------------------------------------------------------------------
To unsubscribe, e-mail: builds-unsubscribe@beam.apache.org
For additional commands, e-mail: builds-help@beam.apache.org


Build failed in Jenkins: beam_PostCommit_Go_VR_Flink #5397

Posted by Apache Jenkins Server <je...@builds.apache.org>.
See <https://ci-beam.apache.org/job/beam_PostCommit_Go_VR_Flink/5397/display/redirect>

Changes:


------------------------------------------
[...truncated 49.66 KB...]
+ rm -rf '/output/*'
+ export GO111MODULE=off
+ GO111MODULE=off
+ go get github.com/apache/beam/sdks/go/container

go: downloading golang.org/x/sys v0.0.0-20210630005230-0f9fa26af87c

> Task :runners:core-construction-java:jar
go: downloading golang.org/x/text v0.3.6
> Task :runners:core-java:compileJava FROM-CACHE
> Task :runners:core-java:classes UP-TO-DATE
> Task :runners:core-java:jar
> Task :sdks:java:extensions:google-cloud-platform-core:compileJava FROM-CACHE
> Task :sdks:java:extensions:google-cloud-platform-core:classes UP-TO-DATE
> Task :sdks:java:extensions:google-cloud-platform-core:jar
> Task :sdks:java:harness:compileJava FROM-CACHE
> Task :sdks:java:harness:classes UP-TO-DATE
> Task :sdks:java:harness:jar
> Task :sdks:java:container:buildLinuxAmd64
> Task :sdks:java:container:goBuild
> Task :sdks:java:container:java11:copySdkHarnessLauncher
> Task :sdks:java:container:java8:copySdkHarnessLauncher
> Task :sdks:java:harness:shadowJar FROM-CACHE
> Task :runners:java-fn-execution:compileJava FROM-CACHE
> Task :runners:java-fn-execution:classes UP-TO-DATE
> Task :runners:java-fn-execution:jar
> Task :sdks:java:expansion-service:compileJava FROM-CACHE
> Task :sdks:java:expansion-service:classes UP-TO-DATE
> Task :sdks:java:expansion-service:jar
> Task :runners:direct-java:compileJava FROM-CACHE
> Task :runners:java-job-service:compileJava FROM-CACHE
> Task :runners:direct-java:classes UP-TO-DATE
> Task :runners:java-job-service:classes UP-TO-DATE
> Task :sdks:java:io:kafka:compileJava FROM-CACHE
> Task :sdks:java:io:kafka:classes UP-TO-DATE
> Task :sdks:java:testing:expansion-service:compileTestJava FROM-CACHE
> Task :sdks:java:testing:expansion-service:testClasses
> Task :runners:java-job-service:jar
> Task :sdks:java:io:kafka:jar
> Task :runners:direct-java:shadowJar FROM-CACHE
> Task :runners:flink:1.13:compileJava FROM-CACHE
> Task :runners:flink:1.13:classes
> Task :sdks:java:io:google-cloud-platform:compileJava FROM-CACHE
> Task :sdks:java:io:google-cloud-platform:classes UP-TO-DATE
> Task :runners:flink:1.13:jar
> Task :runners:flink:1.13:job-server:compileJava NO-SOURCE
> Task :runners:flink:1.13:job-server:classes UP-TO-DATE
> Task :sdks:java:io:google-cloud-platform:jar
> Task :sdks:java:container:java8:copyDockerfileDependencies
> Task :sdks:java:container:java11:copyDockerfileDependencies
> Task :sdks:java:extensions:sql:compileJava FROM-CACHE
> Task :sdks:java:extensions:sql:classes
> Task :sdks:java:extensions:sql:jar
> Task :sdks:java:extensions:sql:zetasql:compileJava FROM-CACHE
> Task :sdks:java:extensions:sql:zetasql:classes UP-TO-DATE
> Task :sdks:java:extensions:sql:zetasql:jar
> Task :sdks:java:extensions:sql:expansion-service:compileJava FROM-CACHE
> Task :sdks:java:extensions:sql:expansion-service:classes UP-TO-DATE
> Task :sdks:java:extensions:sql:expansion-service:jar
> Task :sdks:java:container:generateLicenseReport
> Task :sdks:java:testing:expansion-service:buildTestExpansionServiceJar FROM-CACHE
> Task :sdks:java:extensions:sql:expansion-service:shadowJar FROM-CACHE

> Task :sdks:java:container:pullLicenses
DEPRECATION: Python 3.5 reached the end of its life on September 13th, 2020. Please upgrade your Python as Python 3.5 is no longer maintained. pip 21.0 will drop support for Python 3.5 in January 2021. pip 21.0 will remove support for this functionality.

> Task :runners:flink:1.13:job-server:shadowJar FROM-CACHE

> Task :sdks:java:container:pullLicenses
INFO:root:Pulling license for 208 dependencies using 16 threads.
INFO:root:pull_licenses_java.py succeed. It took 5.071955 seconds with 16 threads.

> Task :sdks:java:container:java11:copyJavaThirdPartyLicenses
> Task :sdks:java:container:java8:copyJavaThirdPartyLicenses

> Task :release:go-licenses:go:dockerRun
+ go-licenses save github.com/apache/beam/sdks/go/container --save_path=/output/licenses

> Task :release:go-licenses:java:dockerRun
+ go-licenses save github.com/apache/beam/sdks/java/container --save_path=/output/licenses
+ go-licenses csv github.com/apache/beam/sdks/java/container
+ tee /output/licenses/list.csv
+ chmod -R a+w /output/licenses

> Task :release:go-licenses:go:dockerRun
+ go-licenses csv github.com/apache/beam/sdks/go/container
+ tee /output/licenses/list.csv
+ chmod -R a+w /output/licenses

> Task :release:go-licenses:go:createLicenses
> Task :sdks:go:container:copyGolangLicenses
> Task :sdks:go:container:dockerPrepare
> Task :release:go-licenses:java:createLicenses
> Task :sdks:java:container:java11:copyGolangLicenses
> Task :sdks:java:container:java8:copyGolangLicenses
> Task :sdks:java:container:java11:dockerPrepare
> Task :sdks:java:container:java8:dockerPrepare
> Task :sdks:go:container:docker
> Task :sdks:java:container:java11:docker
> Task :sdks:java:container:java8:docker

> Task :sdks:go:test:flinkValidatesRunner
$ TESTS=./test/integration/... ./test/regression
$ RUNNER=portable
$ TIMEOUT=2h
$ SIMULTANEOUS=3
$ GCS_LOCATION=gs://temp-storage-for-end-to-end-tests
$ PROJECT=apache-beam-testing
$ DATAFLOW_PROJECT=apache-beam-testing
$ REGION=us-central1
$ trap exit_background_processes SIGINT SIGTERM EXIT
$ key=--runner
$ case --runner in
$ RUNNER=flink
$ key=--flink_job_server_jar
$ case --flink_job_server_jar in
$ FLINK_JOB_SERVER_JAR=<https://ci-beam.apache.org/job/beam_PostCommit_Go_VR_Flink/ws/src/runners/flink/1.13/job-server/build/libs/beam-runners-flink-1.13-job-server-2.35.0-SNAPSHOT.jar>
$ key=--test_expansion_jar
$ case --test_expansion_jar in
$ TEST_EXPANSION_JAR=<https://ci-beam.apache.org/job/beam_PostCommit_Go_VR_Flink/ws/src/sdks/java/testing/expansion-service/build/libs/beam-sdks-java-testing-expansion-service-testExpansionService-2.35.0-SNAPSHOT.jar>
$ cd <https://ci-beam.apache.org/job/beam_PostCommit_Go_VR_Flink/ws/src>
$ test -d sdks/go/test
$ JOB_PORT=60419
$ ENDPOINT=localhost:44237
No endpoint specified; starting a new flink job server on localhost:44237
$ java -jar <https://ci-beam.apache.org/job/beam_PostCommit_Go_VR_Flink/ws/src/runners/flink/1.13/job-server/build/libs/beam-runners-flink-1.13-job-server-2.35.0-SNAPSHOT.jar> --flink-master [local] --job-port 44237 --expansion-port 0 --artifact-port 0
$ JOBSERVER_PID=11398
$ EXPANSION_PORT=41427
$ TEST_EXPANSION_ADDR=localhost:54145
No test expansion address specified; starting a new test expansion server on localhost:54145
$ java -jar <https://ci-beam.apache.org/job/beam_PostCommit_Go_VR_Flink/ws/src/sdks/java/testing/expansion-service/build/libs/beam-sdks-java-testing-expansion-service-testExpansionService-2.35.0-SNAPSHOT.jar> 54145
$ TEST_EXPANSION_PID=11476
$ SIMULTANEOUS=1
$ TAG=dev
$ ./gradlew :sdks:go:container:docker -Pdocker-tag=dev
Starting expansion service at localhost:54145
Starting a Gradle Daemon, 4 busy Daemons could not be reused, use --status for details
Nov 01, 2021 12:06:34 PM org.apache.beam.sdk.expansion.service.ExpansionService loadRegisteredTransforms
INFO: Registering external transforms: [beam:transforms:xlang:test:cgbk, beam:transforms:xlang:test:flatten, beam:transforms:xlang:test:prefix, beam:transforms:xlang:test:multi, beam:transforms:xlang:test:gbk, beam:transforms:xlang:test:comgl, beam:transforms:xlang:test:compk, beam:transforms:xlang:count, beam:transforms:xlang:filter_less_than_eq, beam:transforms:xlang:test:partition, beam:transforms:xlang:test:parquet_write, beam:transforms:xlang:parquet_read, beam:transforms:xlang:textio_read, beam:external:java:generate_sequence:v1]
	beam:transforms:xlang:test:cgbk: org.apache.beam.sdk.testing.expansion.TestExpansionService$TestServiceRegistrar$TestCoGroupByKeyTransformProvider@1aafa419
	beam:transforms:xlang:test:flatten: org.apache.beam.sdk.testing.expansion.TestExpansionService$TestServiceRegistrar$TestFlattenTransformProvider@47eaca72
	beam:transforms:xlang:test:prefix: org.apache.beam.sdk.expansion.service.ExpansionService$ExternalTransformRegistrarLoader$1@55141def
	beam:transforms:xlang:test:multi: org.apache.beam.sdk.expansion.service.ExpansionService$ExternalTransformRegistrarLoader$1@55182842
	beam:transforms:xlang:test:gbk: org.apache.beam.sdk.expansion.service.ExpansionService$ExternalTransformRegistrarLoader$1@3270d194
	beam:transforms:xlang:test:comgl: org.apache.beam.sdk.expansion.service.ExpansionService$ExternalTransformRegistrarLoader$1@235834f2
	beam:transforms:xlang:test:compk: org.apache.beam.sdk.expansion.service.ExpansionService$ExternalTransformRegistrarLoader$1@5656be13
	beam:transforms:xlang:count: org.apache.beam.sdk.expansion.service.ExpansionService$ExternalTransformRegistrarLoader$1@4218d6a3
	beam:transforms:xlang:filter_less_than_eq: org.apache.beam.sdk.expansion.service.ExpansionService$ExternalTransformRegistrarLoader$1@76505305
	beam:transforms:xlang:test:partition: org.apache.beam.sdk.expansion.service.ExpansionService$ExternalTransformRegistrarLoader$1@14cd1699
	beam:transforms:xlang:test:parquet_write: org.apache.beam.sdk.expansion.service.ExpansionService$ExternalTransformRegistrarLoader$1@77888435
	beam:transforms:xlang:parquet_read: org.apache.beam.sdk.expansion.service.ExpansionService$ExternalTransformRegistrarLoader$1@73a1e9a9
	beam:transforms:xlang:textio_read: org.apache.beam.sdk.expansion.service.ExpansionService$ExternalTransformRegistrarLoader$1@71d44a3
	beam:external:java:generate_sequence:v1: org.apache.beam.sdk.expansion.service.ExpansionService$ExternalTransformRegistrarLoader$1@7b98f307
Nov 01, 2021 12:06:35 PM org.apache.beam.sdk.io.aws2.s3.DefaultS3ClientBuilderFactory createBuilder
INFO: The AWS S3 Beam extension was included in this build, but the awsRegion flag was not specified. If you don't plan to use S3, then ignore this message.
Nov 01, 2021 12:06:36 PM org.apache.beam.runners.jobsubmission.JobServerDriver createArtifactStagingService
INFO: ArtifactStagingService started on localhost:35771
Nov 01, 2021 12:06:36 PM org.apache.beam.runners.jobsubmission.JobServerDriver createExpansionService
INFO: Java ExpansionService started on localhost:42713
Nov 01, 2021 12:06:36 PM org.apache.beam.runners.jobsubmission.JobServerDriver createJobServer
INFO: JobService started on localhost:44237
Nov 01, 2021 12:06:36 PM org.apache.beam.runners.jobsubmission.JobServerDriver run
INFO: Job server now running, terminate with Ctrl+C
> Task :buildSrc:compileJava NO-SOURCE
> Task :buildSrc:compileGroovy UP-TO-DATE
> Task :buildSrc:pluginDescriptors UP-TO-DATE
> Task :buildSrc:processResources UP-TO-DATE
> Task :buildSrc:classes UP-TO-DATE
> Task :buildSrc:jar UP-TO-DATE
> Task :buildSrc:assemble UP-TO-DATE
> Task :buildSrc:spotlessGroovy UP-TO-DATE
> Task :buildSrc:spotlessGroovyCheck UP-TO-DATE
> Task :buildSrc:spotlessGroovyGradle UP-TO-DATE
> Task :buildSrc:spotlessGroovyGradleCheck UP-TO-DATE
> Task :buildSrc:spotlessCheck UP-TO-DATE
> Task :buildSrc:pluginUnderTestMetadata UP-TO-DATE
> Task :buildSrc:compileTestJava NO-SOURCE
> Task :buildSrc:compileTestGroovy NO-SOURCE
> Task :buildSrc:processTestResources NO-SOURCE
> Task :buildSrc:testClasses UP-TO-DATE
> Task :buildSrc:test NO-SOURCE
> Task :buildSrc:validatePlugins UP-TO-DATE
> Task :buildSrc:check UP-TO-DATE
> Task :buildSrc:build UP-TO-DATE
Configuration on demand is an incubating feature.
> Task :sdks:go:container:copyLicenses UP-TO-DATE
> Task :sdks:go:container:dockerClean

> Task :sdks:go:container:goPrepare
Use project GOPATH: <https://ci-beam.apache.org/job/beam_PostCommit_Go_VR_Flink/ws/src/sdks/go/container/.gogradle/project_gopath>

> Task :sdks:go:container:resolveBuildDependencies SKIPPED
> Task :sdks:go:container:installDependencies SKIPPED
> Task :sdks:go:container:buildLinuxAmd64 UP-TO-DATE
> Task :sdks:go:container:goBuild
> Task :sdks:go:container:skipPullLicenses
> Task :sdks:go:container:dockerPrepare
> Task :sdks:go:container:docker

Deprecated Gradle features were used in this build, making it incompatible with Gradle 7.0.
Use '--warning-mode all' to show the individual deprecation warnings.
See https://docs.gradle.org/6.9.1/userguide/command_line_interface.html#sec:command_line_warnings

BUILD SUCCESSFUL in 53s
8 actionable tasks: 6 executed, 2 up-to-date

Publishing build scan...
Publishing build scan failed due to network error 'java.net.SocketTimeoutException: Read timed out' (2 retries remaining)...
Publishing build scan failed due to network error 'java.net.SocketTimeoutException: Read timed out' (1 retry remaining)...
https://gradle.com/s/ln4cxqv7cd7gc

$ CONTAINER=apache/beam_go_sdk
$ cd sdks/go
>>> RUNNING flink integration tests with pipeline options:  -p 1 -timeout 2h --runner=flink --project=apache-beam-testing --region=us-central1 --environment_type=DOCKER --environment_config=apache/beam_go_sdk:dev --staging_location=gs://temp-storage-for-end-to-end-tests/staging-validatesrunner-test --temp_location=gs://temp-storage-for-end-to-end-tests/temp-validatesrunner-test --dataflow_worker_jar= --endpoint=localhost:44237 --test_expansion_addr=localhost:54145 
$ 
./run_validatesrunner_tests.sh: line 399: go: command not found
$ TEST_EXIT_CODE=0
$ cd ../..
$ exit 127
$ exit 127

> Task :sdks:go:test:flinkValidatesRunner FAILED

FAILURE: Build failed with an exception.

* Where:
Build file '<https://ci-beam.apache.org/job/beam_PostCommit_Go_VR_Flink/ws/src/sdks/go/test/build.gradle'> line: 106

* What went wrong:
Execution failed for task ':sdks:go:test:flinkValidatesRunner'.
> Process 'command 'sh'' finished with non-zero exit value 127

* Try:
Run with --stacktrace option to get the stack trace. Run with --info or --debug option to get more log output. Run with --scan to get full insights.

* Get more help at https://help.gradle.org

Deprecated Gradle features were used in this build, making it incompatible with Gradle 7.0.
Use '--warning-mode all' to show the individual deprecation warnings.
See https://docs.gradle.org/6.9.1/userguide/command_line_interface.html#sec:command_line_warnings

BUILD FAILED in 7m 13s
164 actionable tasks: 116 executed, 43 from cache, 5 up-to-date

Publishing build scan...
https://gradle.com/s/f3vomhqwpske6

Build step 'Invoke Gradle script' changed build result to FAILURE
Build step 'Invoke Gradle script' marked build as failure

---------------------------------------------------------------------
To unsubscribe, e-mail: builds-unsubscribe@beam.apache.org
For additional commands, e-mail: builds-help@beam.apache.org