You are viewing a plain text version of this content. The canonical link for it is here.
Posted to builds@hbase.apache.org by Apache Jenkins Server <je...@builds.apache.org> on 2017/06/28 05:40:16 UTC

Build failed in Jenkins: HBase-Trunk_matrix » JDK 1.8 (latest),Hadoop #3275

See <https://builds.apache.org/job/HBase-Trunk_matrix/jdk=JDK%201.8%20(latest),label=Hadoop/3275/display/redirect?page=changes>

Changes:

[tedyu] HBASE-18275 Formatting and grammar mistakes in schemadoc chapter (Artem

[stack] HBASE-18284 Update hbasecon asia logo on home page of hbase.apache.org

------------------------------------------
[...truncated 387.39 KB...]
[WARNING] 
[WARNING] Some problems were encountered while building the effective model for org.apache.hbase:hbase-hadoop-compat:jar:3.0.0-SNAPSHOT
[WARNING] 'reporting.plugins.plugin.version' for org.scala-tools:maven-scala-plugin is missing. @ org.apache.hbase:hbase:3.0.0-SNAPSHOT, <https://builds.apache.org/job/HBase-Trunk_matrix/jdk=JDK%201.8%20(latest),label=Hadoop/ws/pom.xml,> line 3322, column 15
[WARNING] 
[WARNING] Some problems were encountered while building the effective model for org.apache.hbase:hbase-common:jar:3.0.0-SNAPSHOT
[WARNING] 'reporting.plugins.plugin.version' for org.scala-tools:maven-scala-plugin is missing. @ org.apache.hbase:hbase:3.0.0-SNAPSHOT, <https://builds.apache.org/job/HBase-Trunk_matrix/jdk=JDK%201.8%20(latest),label=Hadoop/ws/pom.xml,> line 3322, column 15
[WARNING] 
[WARNING] Some problems were encountered while building the effective model for org.apache.hbase:hbase-procedure:jar:3.0.0-SNAPSHOT
[WARNING] 'reporting.plugins.plugin.version' for org.scala-tools:maven-scala-plugin is missing. @ org.apache.hbase:hbase:3.0.0-SNAPSHOT, <https://builds.apache.org/job/HBase-Trunk_matrix/jdk=JDK%201.8%20(latest),label=Hadoop/ws/pom.xml,> line 3322, column 15
[WARNING] 
[WARNING] Some problems were encountered while building the effective model for org.apache.hbase:hbase-endpoint:jar:3.0.0-SNAPSHOT
[WARNING] 'reporting.plugins.plugin.version' for org.scala-tools:maven-scala-plugin is missing. @ org.apache.hbase:hbase:3.0.0-SNAPSHOT, <https://builds.apache.org/job/HBase-Trunk_matrix/jdk=JDK%201.8%20(latest),label=Hadoop/ws/pom.xml,> line 3322, column 15
[WARNING] 
[WARNING] Some problems were encountered while building the effective model for org.apache.hbase:hbase-it:jar:3.0.0-SNAPSHOT
[WARNING] 'reporting.plugins.plugin.version' for org.scala-tools:maven-scala-plugin is missing. @ org.apache.hbase:hbase:3.0.0-SNAPSHOT, <https://builds.apache.org/job/HBase-Trunk_matrix/jdk=JDK%201.8%20(latest),label=Hadoop/ws/pom.xml,> line 3322, column 15
[WARNING] 
[WARNING] Some problems were encountered while building the effective model for org.apache.hbase:hbase-examples:jar:3.0.0-SNAPSHOT
[WARNING] 'reporting.plugins.plugin.version' for org.scala-tools:maven-scala-plugin is missing. @ org.apache.hbase:hbase:3.0.0-SNAPSHOT, <https://builds.apache.org/job/HBase-Trunk_matrix/jdk=JDK%201.8%20(latest),label=Hadoop/ws/pom.xml,> line 3322, column 15
[WARNING] 
[WARNING] Some problems were encountered while building the effective model for org.apache.hbase:hbase-prefix-tree:jar:3.0.0-SNAPSHOT
[WARNING] 'reporting.plugins.plugin.version' for org.scala-tools:maven-scala-plugin is missing. @ org.apache.hbase:hbase:3.0.0-SNAPSHOT, <https://builds.apache.org/job/HBase-Trunk_matrix/jdk=JDK%201.8%20(latest),label=Hadoop/ws/pom.xml,> line 3322, column 15
[WARNING] 
[WARNING] Some problems were encountered while building the effective model for org.apache.hbase:hbase-assembly:pom:3.0.0-SNAPSHOT
[WARNING] 'reporting.plugins.plugin.version' for org.scala-tools:maven-scala-plugin is missing. @ org.apache.hbase:hbase:3.0.0-SNAPSHOT, <https://builds.apache.org/job/HBase-Trunk_matrix/jdk=JDK%201.8%20(latest),label=Hadoop/ws/pom.xml,> line 3322, column 15
[WARNING] 
[WARNING] Some problems were encountered while building the effective model for org.apache.hbase:hbase-testing-util:jar:3.0.0-SNAPSHOT
[WARNING] 'reporting.plugins.plugin.version' for org.scala-tools:maven-scala-plugin is missing. @ org.apache.hbase:hbase:3.0.0-SNAPSHOT, <https://builds.apache.org/job/HBase-Trunk_matrix/jdk=JDK%201.8%20(latest),label=Hadoop/ws/pom.xml,> line 3322, column 15
[WARNING] 
[WARNING] Some problems were encountered while building the effective model for org.apache.hbase:hbase-annotations:jar:3.0.0-SNAPSHOT
[WARNING] 'reporting.plugins.plugin.version' for org.scala-tools:maven-scala-plugin is missing. @ org.apache.hbase:hbase:3.0.0-SNAPSHOT, <https://builds.apache.org/job/HBase-Trunk_matrix/jdk=JDK%201.8%20(latest),label=Hadoop/ws/pom.xml,> line 3322, column 15
[WARNING] 
[WARNING] Some problems were encountered while building the effective model for org.apache.hbase:hbase-rest:jar:3.0.0-SNAPSHOT
[WARNING] 'reporting.plugins.plugin.version' for org.scala-tools:maven-scala-plugin is missing. @ org.apache.hbase:hbase:3.0.0-SNAPSHOT, <https://builds.apache.org/job/HBase-Trunk_matrix/jdk=JDK%201.8%20(latest),label=Hadoop/ws/pom.xml,> line 3322, column 15
[WARNING] 
[WARNING] Some problems were encountered while building the effective model for org.apache.hbase:hbase-checkstyle:jar:3.0.0-SNAPSHOT
[WARNING] 'reporting.plugins.plugin.version' for org.scala-tools:maven-scala-plugin is missing. @ org.apache.hbase:hbase:3.0.0-SNAPSHOT, <https://builds.apache.org/job/HBase-Trunk_matrix/jdk=JDK%201.8%20(latest),label=Hadoop/ws/pom.xml,> line 3322, column 15
[WARNING] 
[WARNING] Some problems were encountered while building the effective model for org.apache.hbase:hbase-external-blockcache:jar:3.0.0-SNAPSHOT
[WARNING] 'reporting.plugins.plugin.version' for org.scala-tools:maven-scala-plugin is missing. @ org.apache.hbase:hbase:3.0.0-SNAPSHOT, <https://builds.apache.org/job/HBase-Trunk_matrix/jdk=JDK%201.8%20(latest),label=Hadoop/ws/pom.xml,> line 3322, column 15
[WARNING] 
[WARNING] Some problems were encountered while building the effective model for org.apache.hbase:hbase-shaded-client:jar:3.0.0-SNAPSHOT
[WARNING] 'reporting.plugins.plugin.version' for org.scala-tools:maven-scala-plugin is missing. @ org.apache.hbase:hbase:3.0.0-SNAPSHOT, <https://builds.apache.org/job/HBase-Trunk_matrix/jdk=JDK%201.8%20(latest),label=Hadoop/ws/pom.xml,> line 3322, column 15
[WARNING] 
[WARNING] Some problems were encountered while building the effective model for org.apache.hbase:hbase-shaded-server:jar:3.0.0-SNAPSHOT
[WARNING] 'reporting.plugins.plugin.version' for org.scala-tools:maven-scala-plugin is missing. @ org.apache.hbase:hbase:3.0.0-SNAPSHOT, <https://builds.apache.org/job/HBase-Trunk_matrix/jdk=JDK%201.8%20(latest),label=Hadoop/ws/pom.xml,> line 3322, column 15
[WARNING] 
[WARNING] Some problems were encountered while building the effective model for org.apache.hbase:hbase-shaded:pom:3.0.0-SNAPSHOT
[WARNING] 'reporting.plugins.plugin.version' for org.scala-tools:maven-scala-plugin is missing. @ org.apache.hbase:hbase:3.0.0-SNAPSHOT, <https://builds.apache.org/job/HBase-Trunk_matrix/jdk=JDK%201.8%20(latest),label=Hadoop/ws/pom.xml,> line 3322, column 15
[WARNING] 
[WARNING] Some problems were encountered while building the effective model for org.apache.hbase:hbase-spark:jar:3.0.0-SNAPSHOT
[WARNING] 'reporting.plugins.plugin.version' for org.scala-tools:maven-scala-plugin is missing. @ org.apache.hbase:hbase:3.0.0-SNAPSHOT, <https://builds.apache.org/job/HBase-Trunk_matrix/jdk=JDK%201.8%20(latest),label=Hadoop/ws/pom.xml,> line 3322, column 15
[WARNING] 
[WARNING] Some problems were encountered while building the effective model for org.apache.hbase:hbase-client-project:jar:3.0.0-SNAPSHOT
[WARNING] 'reporting.plugins.plugin.version' for org.scala-tools:maven-scala-plugin is missing. @ org.apache.hbase:hbase:3.0.0-SNAPSHOT, <https://builds.apache.org/job/HBase-Trunk_matrix/jdk=JDK%201.8%20(latest),label=Hadoop/ws/pom.xml,> line 3322, column 15
[WARNING] 
[WARNING] Some problems were encountered while building the effective model for org.apache.hbase:hbase-shaded-client-project:jar:3.0.0-SNAPSHOT
[WARNING] 'reporting.plugins.plugin.version' for org.scala-tools:maven-scala-plugin is missing. @ org.apache.hbase:hbase:3.0.0-SNAPSHOT, <https://builds.apache.org/job/HBase-Trunk_matrix/jdk=JDK%201.8%20(latest),label=Hadoop/ws/pom.xml,> line 3322, column 15
[WARNING] 
[WARNING] Some problems were encountered while building the effective model for org.apache.hbase:hbase-archetype-builder:pom:3.0.0-SNAPSHOT
[WARNING] 'reporting.plugins.plugin.version' for org.scala-tools:maven-scala-plugin is missing. @ org.apache.hbase:hbase:3.0.0-SNAPSHOT, <https://builds.apache.org/job/HBase-Trunk_matrix/jdk=JDK%201.8%20(latest),label=Hadoop/ws/pom.xml,> line 3322, column 15
[WARNING] 
[WARNING] Some problems were encountered while building the effective model for org.apache.hbase:hbase-archetypes:pom:3.0.0-SNAPSHOT
[WARNING] 'reporting.plugins.plugin.version' for org.scala-tools:maven-scala-plugin is missing. @ org.apache.hbase:hbase:3.0.0-SNAPSHOT, <https://builds.apache.org/job/HBase-Trunk_matrix/jdk=JDK%201.8%20(latest),label=Hadoop/ws/pom.xml,> line 3322, column 15
[WARNING] 
[WARNING] Some problems were encountered while building the effective model for org.apache.hbase:hbase-metrics-api:jar:3.0.0-SNAPSHOT
[WARNING] 'reporting.plugins.plugin.version' for org.scala-tools:maven-scala-plugin is missing. @ org.apache.hbase:hbase:3.0.0-SNAPSHOT, <https://builds.apache.org/job/HBase-Trunk_matrix/jdk=JDK%201.8%20(latest),label=Hadoop/ws/pom.xml,> line 3322, column 15
[WARNING] 
[WARNING] Some problems were encountered while building the effective model for org.apache.hbase:hbase-metrics:jar:3.0.0-SNAPSHOT
[WARNING] 'reporting.plugins.plugin.version' for org.scala-tools:maven-scala-plugin is missing. @ org.apache.hbase:hbase:3.0.0-SNAPSHOT, <https://builds.apache.org/job/HBase-Trunk_matrix/jdk=JDK%201.8%20(latest),label=Hadoop/ws/pom.xml,> line 3322, column 15
[WARNING] 
[WARNING] Some problems were encountered while building the effective model for org.apache.hbase:hbase-rsgroup:jar:3.0.0-SNAPSHOT
[WARNING] 'reporting.plugins.plugin.version' for org.scala-tools:maven-scala-plugin is missing. @ org.apache.hbase:hbase:3.0.0-SNAPSHOT, <https://builds.apache.org/job/HBase-Trunk_matrix/jdk=JDK%201.8%20(latest),label=Hadoop/ws/pom.xml,> line 3322, column 15
[WARNING] 
[WARNING] Some problems were encountered while building the effective model for org.apache.hbase:hbase-hadoop2-compat:jar:3.0.0-SNAPSHOT
[WARNING] 'reporting.plugins.plugin.version' for org.scala-tools:maven-scala-plugin is missing. @ org.apache.hbase:hbase:3.0.0-SNAPSHOT, <https://builds.apache.org/job/HBase-Trunk_matrix/jdk=JDK%201.8%20(latest),label=Hadoop/ws/pom.xml,> line 3322, column 15
[WARNING] 
[WARNING] Some problems were encountered while building the effective model for org.apache.hbase:hbase:pom:3.0.0-SNAPSHOT
[WARNING] 'reporting.plugins.plugin.version' for org.scala-tools:maven-scala-plugin is missing. @ line 3322, column 15
[WARNING] 
[WARNING] It is highly recommended to fix these problems because they threaten the stability of your build.
[WARNING] 
[WARNING] For this reason, future Maven versions might no longer support building such malformed projects.
[WARNING] 
[INFO] ------------------------------------------------------------------------
[INFO] Detecting the operating system and CPU architecture
[INFO] ------------------------------------------------------------------------
[INFO] os.detected.name: linux
[INFO] os.detected.arch: x86_64
[INFO] os.detected.version: 3.13
[INFO] os.detected.version.major: 3
[INFO] os.detected.version.minor: 13
[INFO] os.detected.release: ubuntu
[INFO] os.detected.release.version: 14.04
[INFO] os.detected.release.like.ubuntu: true
[INFO] os.detected.release.like.debian: true
[INFO] os.detected.classifier: linux-x86_64
[WARNING] Failed to inject repository session properties.
java.lang.NoSuchMethodError: org.apache.maven.execution.MavenSession.getRepositorySession()Lorg/eclipse/aether/RepositorySystemSession;
	at kr.motd.maven.os.RepositorySessionInjector.injectRepositorySession(RepositorySessionInjector.java:22)
	at kr.motd.maven.os.DetectExtension.injectSession(DetectExtension.java:151)
	at kr.motd.maven.os.DetectExtension.afterProjectsRead(DetectExtension.java:110)
	at org.apache.maven.DefaultMaven.doExecute(DefaultMaven.java:274)
	at org.apache.maven.DefaultMaven.execute(DefaultMaven.java:156)
	at org.apache.maven.cli.MavenCli.execute(MavenCli.java:537)
	at org.apache.maven.cli.MavenCli.doMain(MavenCli.java:196)
	at org.apache.maven.cli.MavenCli.main(MavenCli.java:141)
	at sun.reflect.NativeMethodAccessorImpl.invoke0(Native Method)
	at sun.reflect.NativeMethodAccessorImpl.invoke(NativeMethodAccessorImpl.java:62)
	at sun.reflect.DelegatingMethodAccessorImpl.invoke(DelegatingMethodAccessorImpl.java:43)
	at java.lang.reflect.Method.invoke(Method.java:498)
	at org.codehaus.plexus.classworlds.launcher.Launcher.launchEnhanced(Launcher.java:290)
	at org.codehaus.plexus.classworlds.launcher.Launcher.launch(Launcher.java:230)
	at org.codehaus.plexus.classworlds.launcher.Launcher.mainWithExitCode(Launcher.java:409)
	at org.codehaus.plexus.classworlds.launcher.Launcher.main(Launcher.java:352)
[INFO] ------------------------------------------------------------------------
[INFO] Reactor Build Order:
[INFO] 
[INFO] Apache HBase
[INFO] Apache HBase - Checkstyle
[INFO] Apache HBase - Resource Bundle
[INFO] Apache HBase - Annotations
[INFO] Apache HBase - Common
[INFO] Apache HBase - Shaded Protocol
[INFO] Apache HBase - Metrics API
[INFO] Apache HBase - Procedure
[INFO] Apache HBase - Hadoop Compatibility
[INFO] Apache HBase - Metrics Implementation
[INFO] Apache HBase - Hadoop Two Compatibility
[INFO] Apache HBase - Protocol
[INFO] Apache HBase - Client
[INFO] Apache HBase - Prefix Tree
[INFO] Apache HBase - Server
[INFO] Apache HBase - Testing Util
[INFO] Apache HBase - Thrift
[INFO] Apache HBase - RSGroup
[INFO] Apache HBase - Shell
[INFO] Apache HBase - Coprocessor Endpoint
[INFO] Apache HBase - Integration Tests
[INFO] Apache HBase - Examples
[INFO] Apache HBase - Rest
[INFO] Apache HBase - External Block Cache
[INFO] Apache HBase - Spark
[INFO] Apache HBase - Assembly
[INFO] Apache HBase - Shaded
[INFO] Apache HBase - Shaded - Client
[INFO] Apache HBase - Shaded - Server
[INFO] Apache HBase - Archetypes
[INFO] Apache HBase - Exemplar for hbase-client archetype
[INFO] Apache HBase - Exemplar for hbase-shaded-client archetype
[INFO] Apache HBase - Archetype builder
[INFO]                                                                         
[INFO] ------------------------------------------------------------------------
[INFO] Building Apache HBase 3.0.0-SNAPSHOT
[INFO] ------------------------------------------------------------------------
[INFO] 
[INFO] --- build-helper-maven-plugin:1.9.1:bsh-property (negate-license-bundles-property) @ hbase ---
[INFO] 
[INFO] --- maven-enforcer-plugin:1.4:enforce (min-maven-min-java-banned-xerces) @ hbase ---
[INFO] 
[INFO] --- maven-enforcer-plugin:1.4:enforce (banned-jsr305) @ hbase ---
[INFO] 
[INFO] --- maven-enforcer-plugin:1.4:enforce (banned-scala) @ hbase ---
[INFO] 
[INFO] --- maven-enforcer-plugin:1.4:enforce (banned-hbase-spark) @ hbase ---
[INFO] 
[INFO] --- buildnumber-maven-plugin:1.3:create-timestamp (default) @ hbase ---
[INFO] 
[INFO] --- maven-remote-resources-plugin:1.5:process (process-resource-bundles) @ hbase ---
[INFO] 
[INFO] --- maven-enforcer-plugin:1.4:enforce (check-aggregate-license) @ hbase ---
[INFO] Skipping Rule Enforcement.
[INFO] 
[INFO] --- findbugs-maven-plugin:3.0.0:findbugs (default) @ hbase ---
[INFO] 
[INFO] --- maven-site-plugin:3.4:attach-descriptor (attach-descriptor) @ hbase ---
[INFO] 
[INFO] --- maven-checkstyle-plugin:2.17:checkstyle (default-cli) @ hbase ---
Downloading: http://repository.apache.org/snapshots/org/apache/hbase/hbase-checkstyle/3.0.0-SNAPSHOT/maven-metadata.xml
Downloading: http://repository.apache.org/snapshots/org/apache/hbase/hbase-checkstyle/3.0.0-SNAPSHOT/hbase-checkstyle-3.0.0-SNAPSHOT.jar
[INFO] ------------------------------------------------------------------------
[INFO] Reactor Summary:
[INFO] 
[INFO] Apache HBase ...................................... FAILURE [4.664s]
[INFO] Apache HBase - Checkstyle ......................... SKIPPED
[INFO] Apache HBase - Resource Bundle .................... SKIPPED
[INFO] Apache HBase - Annotations ........................ SKIPPED
[INFO] Apache HBase - Common ............................. SKIPPED
[INFO] Apache HBase - Shaded Protocol .................... SKIPPED
[INFO] Apache HBase - Metrics API ........................ SKIPPED
[INFO] Apache HBase - Procedure .......................... SKIPPED
[INFO] Apache HBase - Hadoop Compatibility ............... SKIPPED
[INFO] Apache HBase - Metrics Implementation ............. SKIPPED
[INFO] Apache HBase - Hadoop Two Compatibility ........... SKIPPED
[INFO] Apache HBase - Protocol ........................... SKIPPED
[INFO] Apache HBase - Client ............................. SKIPPED
[INFO] Apache HBase - Prefix Tree ........................ SKIPPED
[INFO] Apache HBase - Server ............................. SKIPPED
[INFO] Apache HBase - Testing Util ....................... SKIPPED
[INFO] Apache HBase - Thrift ............................. SKIPPED
[INFO] Apache HBase - RSGroup ............................ SKIPPED
[INFO] Apache HBase - Shell .............................. SKIPPED
[INFO] Apache HBase - Coprocessor Endpoint ............... SKIPPED
[INFO] Apache HBase - Integration Tests .................. SKIPPED
[INFO] Apache HBase - Examples ........................... SKIPPED
[INFO] Apache HBase - Rest ............................... SKIPPED
[INFO] Apache HBase - External Block Cache ............... SKIPPED
[INFO] Apache HBase - Spark .............................. SKIPPED
[INFO] Apache HBase - Assembly ........................... SKIPPED
[INFO] Apache HBase - Shaded ............................. SKIPPED
[INFO] Apache HBase - Shaded - Client .................... SKIPPED
[INFO] Apache HBase - Shaded - Server .................... SKIPPED
[INFO] Apache HBase - Archetypes ......................... SKIPPED
[INFO] Apache HBase - Exemplar for hbase-client archetype  SKIPPED
[INFO] Apache HBase - Exemplar for hbase-shaded-client archetype  SKIPPED
[INFO] Apache HBase - Archetype builder .................. SKIPPED
[INFO] ------------------------------------------------------------------------
[INFO] BUILD FAILURE
[INFO] ------------------------------------------------------------------------
[INFO] Total time: 6.856s
[INFO] Finished at: Wed Jun 28 05:39:34 UTC 2017
[INFO] Final Memory: 46M/903M
[INFO] ------------------------------------------------------------------------
[ERROR] Failed to execute goal org.apache.maven.plugins:maven-checkstyle-plugin:2.17:checkstyle (default-cli) on project hbase: Execution default-cli of goal org.apache.maven.plugins:maven-checkstyle-plugin:2.17:checkstyle failed: Plugin org.apache.maven.plugins:maven-checkstyle-plugin:2.17 or one of its dependencies could not be resolved: Could not find artifact org.apache.hbase:hbase-checkstyle:jar:3.0.0-SNAPSHOT in Nexus (http://repository.apache.org/snapshots) -> [Help 1]
[ERROR] 
[ERROR] To see the full stack trace of the errors, re-run Maven with the -e switch.
[ERROR] Re-run Maven using the -X switch to enable full debug logging.
[ERROR] 
[ERROR] For more information about the errors and possible solutions, please read the following articles:
[ERROR] [Help 1] http://cwiki.apache.org/confluence/display/MAVEN/PluginResolutionException
Build step 'Invoke top-level Maven targets' marked build as failure
Performing Post build task...
Match found for :.* : True
Logical operation result is TRUE
Running script  : # Run zombie detector script
./dev-support/zombie-detector.sh --jenkins ${BUILD_ID}
[a3159d73] $ /bin/bash -xe /tmp/hudson5062139813838387660.sh
+ ./dev-support/zombie-detector.sh --jenkins 3275
Wed Jun 28 05:39:35 UTC 2017 We're ok: there is no zombie test


    {color:green}+1 zombies{color}. No zombie tests found running at the end of the build.
POST BUILD TASK : SUCCESS
END OF POST BUILD TASK : 0
Archiving artifacts
Compressed 4.61 MB of artifacts by 60.3% relative to #3274
Recording test results
ERROR: Step ?Publish JUnit test result report? failed: No test report files were found. Configuration error?
[FINDBUGS] Skipping publisher since build result is FAILURE
[CHECKSTYLE] Skipping publisher since build result is FAILURE

Jenkins build is back to normal : HBase-Trunk_matrix » JDK 1.8 (latest),Hadoop #3277

Posted by Apache Jenkins Server <je...@builds.apache.org>.
See <https://builds.apache.org/job/HBase-Trunk_matrix/jdk=JDK%201.8%20(latest),label=Hadoop/3277/display/redirect>


Build failed in Jenkins: HBase-Trunk_matrix » JDK 1.8 (latest),Hadoop #3276

Posted by Apache Jenkins Server <je...@builds.apache.org>.
See <https://builds.apache.org/job/HBase-Trunk_matrix/jdk=JDK%201.8%20(latest),label=Hadoop/3276/display/redirect>

------------------------------------------
[...truncated 943.37 KB...]
[WARNING] Using platform encoding (ISO-8859-1 actually) to copy filtered resources, i.e. build is platform dependent!
[INFO] Copying 2 resources
[INFO] 
[INFO] --- maven-archetype-plugin:2.4:jar (default-jar) @ hbase-client-project-archetype ---
[INFO] Building archetype jar: <https://builds.apache.org/job/HBase-Trunk_matrix/jdk=JDK%201.8%20(latest),label=Hadoop/ws/hbase-archetypes/hbase-client-project/target/build-archetype/target/generated-sources/archetype/target/hbase-client-project-archetype-3.0.0-SNAPSHOT>
[INFO] ------------------------------------------------------------------------
[INFO] BUILD SUCCESS
[INFO] ------------------------------------------------------------------------
[INFO] Total time: 1.433s
[INFO] Finished at: Wed Jun 28 10:12:48 UTC 2017
[INFO] Final Memory: 23M/1447M
[INFO] ------------------------------------------------------------------------
[INFO] Archetype project created in <https://builds.apache.org/job/HBase-Trunk_matrix/jdk=JDK%201.8%20(latest),label=Hadoop/ws/hbase-archetypes/hbase-client-project/target/build-archetype/target/generated-sources/archetype>
[INFO] ------------------------------------------------------------------------
[INFO] BUILD SUCCESS
[INFO] ------------------------------------------------------------------------
[INFO] Total time: 4.226s
[INFO] Finished at: Wed Jun 28 10:12:48 UTC 2017
[INFO] Final Memory: 24M/1447M
[INFO] ------------------------------------------------------------------------
[INFO] Scanning for projects...
[INFO]                                                                         
[INFO] ------------------------------------------------------------------------
[INFO] Building Apache HBase - Exemplar for hbase-shaded-client archetype 3.0.0-SNAPSHOT
[INFO] ------------------------------------------------------------------------
[INFO] 
[INFO] >>> maven-archetype-plugin:2.4:create-from-project (default-cli) @ hbase-shaded-client-project >>>
[INFO] 
[INFO] <<< maven-archetype-plugin:2.4:create-from-project (default-cli) @ hbase-shaded-client-project <<<
[INFO] 
[INFO] --- maven-archetype-plugin:2.4:create-from-project (default-cli) @ hbase-shaded-client-project ---
[INFO] Setting default groupId: org.apache.hbase
[INFO] Setting default artifactId: hbase-shaded-client-project
[INFO] Setting default version: 3.0.0-SNAPSHOT
[INFO] Setting default package: org.apache.hbase
[INFO] Scanning for projects...
[INFO]                                                                         
[INFO] ------------------------------------------------------------------------
[INFO] Building hbase-shaded-client-project-archetype 3.0.0-SNAPSHOT
[INFO] ------------------------------------------------------------------------
[INFO] 
[INFO] --- maven-resources-plugin:3.0.1:resources (default-resources) @ hbase-shaded-client-project-archetype ---
[WARNING] Using platform encoding (ISO-8859-1 actually) to copy filtered resources, i.e. build is platform dependent!
[INFO] Copying 9 resources
[INFO] 
[INFO] --- maven-resources-plugin:3.0.1:testResources (default-testResources) @ hbase-shaded-client-project-archetype ---
[WARNING] Using platform encoding (ISO-8859-1 actually) to copy filtered resources, i.e. build is platform dependent!
[INFO] Copying 2 resources
[INFO] 
[INFO] --- maven-archetype-plugin:2.4:jar (default-jar) @ hbase-shaded-client-project-archetype ---
[INFO] Building archetype jar: <https://builds.apache.org/job/HBase-Trunk_matrix/jdk=JDK%201.8%20(latest),label=Hadoop/ws/hbase-archetypes/hbase-shaded-client-project/target/build-archetype/target/generated-sources/archetype/target/hbase-shaded-client-project-archetype-3.0.0-SNAPSHOT>
[INFO] ------------------------------------------------------------------------
[INFO] BUILD SUCCESS
[INFO] ------------------------------------------------------------------------
[INFO] Total time: 1.341s
[INFO] Finished at: Wed Jun 28 10:12:53 UTC 2017
[INFO] Final Memory: 23M/1447M
[INFO] ------------------------------------------------------------------------
[INFO] Archetype project created in <https://builds.apache.org/job/HBase-Trunk_matrix/jdk=JDK%201.8%20(latest),label=Hadoop/ws/hbase-archetypes/hbase-shaded-client-project/target/build-archetype/target/generated-sources/archetype>
[INFO] ------------------------------------------------------------------------
[INFO] BUILD SUCCESS
[INFO] ------------------------------------------------------------------------
[INFO] Total time: 4.039s
[INFO] Finished at: Wed Jun 28 10:12:53 UTC 2017
[INFO] Final Memory: 24M/1447M
[INFO] ------------------------------------------------------------------------
[INFO] 
[INFO] --- maven-resources-plugin:2.7:copy-resources (hbase-client-ARCHETYPE__copy-pom-to-temp-for-xslt-processing) @ hbase-archetype-builder ---
[INFO] Using 'UTF-8' encoding to copy filtered resources.
[INFO] Copying 1 resource
[INFO] 
[INFO] --- maven-resources-plugin:2.7:copy-resources (hbase-shaded-client-ARCHETYPE__copy-pom-to-temp-for-xslt-processing) @ hbase-archetype-builder ---
[INFO] Using 'UTF-8' encoding to copy filtered resources.
[INFO] Copying 1 resource
[INFO] 
[INFO] --- xml-maven-plugin:1.0.1:transform (modify-archetype-pom-files-via-xslt) @ hbase-archetype-builder ---
[INFO] Transforming file: <https://builds.apache.org/job/HBase-Trunk_matrix/jdk=JDK%201.8%20(latest),label=Hadoop/3276/artifact/hbase-archetypes/hbase-archetype-builder/../hbase-client-project/target/temp-arch/pom.xml>
[INFO] Transformed 1 file(s).
[INFO] Transforming file: <https://builds.apache.org/job/HBase-Trunk_matrix/jdk=JDK%201.8%20(latest),label=Hadoop/3276/artifact/hbase-archetypes/hbase-archetype-builder/../hbase-shaded-client-project/target/temp-arch/pom.xml>
[INFO] Transformed 1 file(s).
[INFO] 
[INFO] --- maven-install-plugin:2.5.2:install (default-install) @ hbase-archetype-builder ---
[INFO] Installing <https://builds.apache.org/job/HBase-Trunk_matrix/jdk=JDK%201.8%20(latest),label=Hadoop/3276/artifact/hbase-archetypes/hbase-archetype-builder/pom.xml> to /home/jenkins/.m2/repository/org/apache/hbase/hbase-archetype-builder/3.0.0-SNAPSHOT/hbase-archetype-builder-3.0.0-SNAPSHOT.pom
[INFO] 
[INFO] --- exec-maven-plugin:1.4.0:exec (run-installArchetypes-script) @ hbase-archetype-builder ---
[INFO] Scanning for projects...
[INFO]                                                                         
[INFO] ------------------------------------------------------------------------
[INFO] Building hbase-client-project-archetype 3.0.0-SNAPSHOT
[INFO] ------------------------------------------------------------------------
[INFO] 
[INFO] --- maven-resources-plugin:3.0.1:resources (default-resources) @ hbase-client-project-archetype ---
[INFO] Using 'UTF-8' encoding to copy filtered resources.
[INFO] Copying 9 resources
[INFO] 
[INFO] --- maven-resources-plugin:3.0.1:testResources (default-testResources) @ hbase-client-project-archetype ---
[INFO] Using 'UTF-8' encoding to copy filtered resources.
[INFO] Copying 2 resources
[INFO] 
[INFO] --- maven-archetype-plugin:2.4:jar (default-jar) @ hbase-client-project-archetype ---
[INFO] Building archetype jar: <https://builds.apache.org/job/HBase-Trunk_matrix/jdk=JDK%201.8%20(latest),label=Hadoop/ws/hbase-archetypes/hbase-client-project/target/build-archetype/target/generated-sources/archetype/target/hbase-client-project-archetype-3.0.0-SNAPSHOT>
[INFO] 
[INFO] --- maven-archetype-plugin:2.4:integration-test (default-integration-test) @ hbase-client-project-archetype ---
[INFO] Processing Archetype IT project: basic
[INFO] ----------------------------------------------------------------------------
[INFO] Using following parameters for creating project from Archetype: hbase-client-project-archetype:3.0.0-SNAPSHOT
[INFO] ----------------------------------------------------------------------------
[INFO] Parameter: groupId, Value: archetype.it
[INFO] Parameter: artifactId, Value: basic
[INFO] Parameter: version, Value: 0.1-SNAPSHOT
[INFO] Parameter: package, Value: it.pkg
[INFO] Parameter: packageInPathFormat, Value: it/pkg
[INFO] Parameter: version, Value: 0.1-SNAPSHOT
[INFO] Parameter: package, Value: it.pkg
[INFO] Parameter: groupId, Value: archetype.it
[INFO] Parameter: artifactId, Value: basic
[INFO] project created from Archetype in dir: <https://builds.apache.org/job/HBase-Trunk_matrix/jdk=JDK%201.8%20(latest),label=Hadoop/ws/hbase-archetypes/hbase-client-project/target/build-archetype/target/generated-sources/archetype/target/test-classes/projects/basic/project/basic>
[INFO] 
[INFO] --- maven-install-plugin:2.5.2:install (default-install) @ hbase-client-project-archetype ---
[INFO] Installing <https://builds.apache.org/job/HBase-Trunk_matrix/jdk=JDK%201.8%20(latest),label=Hadoop/ws/hbase-archetypes/hbase-client-project/target/build-archetype/target/generated-sources/archetype/target/hbase-client-project-archetype-3.0.0-SNAPSHOT.jar> to /home/jenkins/.m2/repository/org/apache/hbase/hbase-client-project-archetype/3.0.0-SNAPSHOT/hbase-client-project-archetype-3.0.0-SNAPSHOT.jar
[INFO] Installing <https://builds.apache.org/job/HBase-Trunk_matrix/jdk=JDK%201.8%20(latest),label=Hadoop/3276/artifact/hbase-archetypes/hbase-client-project/target/build-archetype/target/generated-sources/archetype/pom.xml> to /home/jenkins/.m2/repository/org/apache/hbase/hbase-client-project-archetype/3.0.0-SNAPSHOT/hbase-client-project-archetype-3.0.0-SNAPSHOT.pom
[INFO] 
[INFO] --- maven-archetype-plugin:2.4:update-local-catalog (default-update-local-catalog) @ hbase-client-project-archetype ---
[INFO] ------------------------------------------------------------------------
[INFO] BUILD SUCCESS
[INFO] ------------------------------------------------------------------------
[INFO] Total time: 1.669s
[INFO] Finished at: Wed Jun 28 10:12:57 UTC 2017
[INFO] Final Memory: 24M/1447M
[INFO] ------------------------------------------------------------------------
[INFO] Scanning for projects...
[INFO]                                                                         
[INFO] ------------------------------------------------------------------------
[INFO] Building hbase-shaded-client-project-archetype 3.0.0-SNAPSHOT
[INFO] ------------------------------------------------------------------------
[INFO] 
[INFO] --- maven-resources-plugin:3.0.1:resources (default-resources) @ hbase-shaded-client-project-archetype ---
[INFO] Using 'UTF-8' encoding to copy filtered resources.
[INFO] Copying 9 resources
[INFO] 
[INFO] --- maven-resources-plugin:3.0.1:testResources (default-testResources) @ hbase-shaded-client-project-archetype ---
[INFO] Using 'UTF-8' encoding to copy filtered resources.
[INFO] Copying 2 resources
[INFO] 
[INFO] --- maven-archetype-plugin:2.4:jar (default-jar) @ hbase-shaded-client-project-archetype ---
[INFO] Building archetype jar: <https://builds.apache.org/job/HBase-Trunk_matrix/jdk=JDK%201.8%20(latest),label=Hadoop/ws/hbase-archetypes/hbase-shaded-client-project/target/build-archetype/target/generated-sources/archetype/target/hbase-shaded-client-project-archetype-3.0.0-SNAPSHOT>
[INFO] 
[INFO] --- maven-archetype-plugin:2.4:integration-test (default-integration-test) @ hbase-shaded-client-project-archetype ---
[INFO] Processing Archetype IT project: basic
[INFO] ----------------------------------------------------------------------------
[INFO] Using following parameters for creating project from Archetype: hbase-shaded-client-project-archetype:3.0.0-SNAPSHOT
[INFO] ----------------------------------------------------------------------------
[INFO] Parameter: groupId, Value: archetype.it
[INFO] Parameter: artifactId, Value: basic
[INFO] Parameter: version, Value: 0.1-SNAPSHOT
[INFO] Parameter: package, Value: it.pkg
[INFO] Parameter: packageInPathFormat, Value: it/pkg
[INFO] Parameter: version, Value: 0.1-SNAPSHOT
[INFO] Parameter: package, Value: it.pkg
[INFO] Parameter: groupId, Value: archetype.it
[INFO] Parameter: artifactId, Value: basic
[INFO] project created from Archetype in dir: <https://builds.apache.org/job/HBase-Trunk_matrix/jdk=JDK%201.8%20(latest),label=Hadoop/ws/hbase-archetypes/hbase-shaded-client-project/target/build-archetype/target/generated-sources/archetype/target/test-classes/projects/basic/project/basic>
[INFO] 
[INFO] --- maven-install-plugin:2.5.2:install (default-install) @ hbase-shaded-client-project-archetype ---
[INFO] Installing <https://builds.apache.org/job/HBase-Trunk_matrix/jdk=JDK%201.8%20(latest),label=Hadoop/ws/hbase-archetypes/hbase-shaded-client-project/target/build-archetype/target/generated-sources/archetype/target/hbase-shaded-client-project-archetype-3.0.0-SNAPSHOT.jar> to /home/jenkins/.m2/repository/org/apache/hbase/hbase-shaded-client-project-archetype/3.0.0-SNAPSHOT/hbase-shaded-client-project-archetype-3.0.0-SNAPSHOT.jar
[INFO] Installing <https://builds.apache.org/job/HBase-Trunk_matrix/jdk=JDK%201.8%20(latest),label=Hadoop/3276/artifact/hbase-archetypes/hbase-shaded-client-project/target/build-archetype/target/generated-sources/archetype/pom.xml> to /home/jenkins/.m2/repository/org/apache/hbase/hbase-shaded-client-project-archetype/3.0.0-SNAPSHOT/hbase-shaded-client-project-archetype-3.0.0-SNAPSHOT.pom
[INFO] 
[INFO] --- maven-archetype-plugin:2.4:update-local-catalog (default-update-local-catalog) @ hbase-shaded-client-project-archetype ---
[INFO] ------------------------------------------------------------------------
[INFO] BUILD SUCCESS
[INFO] ------------------------------------------------------------------------
[INFO] Total time: 1.587s
[INFO] Finished at: Wed Jun 28 10:13:00 UTC 2017
[INFO] Final Memory: 24M/1447M
[INFO] ------------------------------------------------------------------------
[INFO] ------------------------------------------------------------------------
[INFO] Reactor Summary:
[INFO] 
[INFO] Apache HBase ...................................... SUCCESS [2.436s]
[INFO] Apache HBase - Checkstyle ......................... SUCCESS [0.586s]
[INFO] Apache HBase - Resource Bundle .................... SUCCESS [0.211s]
[INFO] Apache HBase - Annotations ........................ SUCCESS [0.290s]
[INFO] Apache HBase - Common ............................. SUCCESS [1:50.250s]
[INFO] Apache HBase - Shaded Protocol .................... SUCCESS [1.437s]
[INFO] Apache HBase - Metrics API ........................ SUCCESS [1.380s]
[INFO] Apache HBase - Procedure .......................... SUCCESS [2:40.065s]
[INFO] Apache HBase - Hadoop Compatibility ............... SUCCESS [9.886s]
[INFO] Apache HBase - Metrics Implementation ............. SUCCESS [4.187s]
[INFO] Apache HBase - Hadoop Two Compatibility ........... SUCCESS [12.922s]
[INFO] Apache HBase - Protocol ........................... SUCCESS [0.497s]
[INFO] Apache HBase - Client ............................. SUCCESS [2:15.118s]
[INFO] Apache HBase - Prefix Tree ........................ SUCCESS [10.546s]
[INFO] Apache HBase - Server ............................. FAILURE [19:49.496s]
[INFO] Apache HBase - Testing Util ....................... SKIPPED
[INFO] Apache HBase - Thrift ............................. SKIPPED
[INFO] Apache HBase - RSGroup ............................ SKIPPED
[INFO] Apache HBase - Shell .............................. SKIPPED
[INFO] Apache HBase - Coprocessor Endpoint ............... SKIPPED
[INFO] Apache HBase - Integration Tests .................. SKIPPED
[INFO] Apache HBase - Examples ........................... SKIPPED
[INFO] Apache HBase - Rest ............................... SKIPPED
[INFO] Apache HBase - External Block Cache ............... SKIPPED
[INFO] Apache HBase - Spark .............................. SKIPPED
[INFO] Apache HBase - Assembly ........................... SKIPPED
[INFO] Apache HBase - Shaded ............................. SUCCESS [0.511s]
[INFO] Apache HBase - Shaded - Client .................... SUCCESS [2.153s]
[INFO] Apache HBase - Shaded - Server .................... SKIPPED
[INFO] Apache HBase - Archetypes ......................... SUCCESS [0.108s]
[INFO] Apache HBase - Exemplar for hbase-client archetype  SKIPPED
[INFO] Apache HBase - Exemplar for hbase-shaded-client archetype  SKIPPED
[INFO] Apache HBase - Archetype builder .................. SUCCESS [18.318s]
[INFO] ------------------------------------------------------------------------
[INFO] BUILD FAILURE
[INFO] ------------------------------------------------------------------------
[INFO] Total time: 27:41.684s
[INFO] Finished at: Wed Jun 28 10:13:00 UTC 2017
[INFO] Final Memory: 81M/6713M
[INFO] ------------------------------------------------------------------------
[ERROR] Failed to execute goal org.apache.maven.plugins:maven-surefire-plugin:2.18.1:test (default-test) on project hbase-server: There are test failures.
[ERROR] 
[ERROR] Please refer to <https://builds.apache.org/job/HBase-Trunk_matrix/jdk=JDK%201.8%20(latest),label=Hadoop/ws/hbase-server/target/surefire-reports> for the individual test results.
[ERROR] -> [Help 1]
[ERROR] 
[ERROR] To see the full stack trace of the errors, re-run Maven with the -e switch.
[ERROR] Re-run Maven using the -X switch to enable full debug logging.
[ERROR] 
[ERROR] For more information about the errors and possible solutions, please read the following articles:
[ERROR] [Help 1] http://cwiki.apache.org/confluence/display/MAVEN/MojoFailureException
[ERROR] 
[ERROR] After correcting the problems, you can resume the build with the command
[ERROR]   mvn <goals> -rf :hbase-server
Build step 'Invoke top-level Maven targets' marked build as failure
Performing Post build task...
Match found for :.* : True
Logical operation result is TRUE
Running script  : # Run zombie detector script
./dev-support/zombie-detector.sh --jenkins ${BUILD_ID}
[a3159d73] $ /bin/bash -xe /tmp/hudson2672379512853792390.sh
+ ./dev-support/zombie-detector.sh --jenkins 3276
Wed Jun 28 10:13:04 UTC 2017 We're ok: there is no zombie test


    {color:green}+1 zombies{color}. No zombie tests found running at the end of the build.
POST BUILD TASK : SUCCESS
END OF POST BUILD TASK : 0
Archiving artifacts
Recording test results
[FINDBUGS] Skipping publisher since build result is FAILURE
[CHECKSTYLE] Skipping publisher since build result is FAILURE