You are viewing a plain text version of this content. The canonical link for it is here.
Posted to dev@lucene.apache.org by Apache Jenkins Server <je...@builds.apache.org> on 2019/06/07 06:58:34 UTC
[JENKINS] Lucene-Solr-NightlyTests-8.x - Build # 114 - Still
unstable
Build: https://builds.apache.org/job/Lucene-Solr-NightlyTests-8.x/114/
1 tests failed.
FAILED: org.apache.solr.cloud.autoscaling.HdfsAutoAddReplicasIntegrationTest.testSimple
Error Message:
Waiting for collection testSimple2 Timeout waiting to see state for collection=testSimple2 :DocCollection(testSimple2//collections/testSimple2/state.json/25)={ "pullReplicas":"0", "replicationFactor":"2", "shards":{ "shard1":{ "range":"80000000-ffffffff", "state":"active", "replicas":{ "core_node3":{ "dataDir":"hdfs://localhost:36531/solr_hdfs_home/testSimple2/core_node3/data/", "base_url":"https://127.0.0.1:43678/solr", "node_name":"127.0.0.1:43678_solr", "type":"NRT", "force_set_state":"false", "ulogDir":"hdfs://localhost:36531/solr_hdfs_home/testSimple2/core_node3/data/tlog", "core":"testSimple2_shard1_replica_n1", "shared_storage":"true", "state":"active", "leader":"true"}, "core_node5":{ "dataDir":"hdfs://localhost:36531/solr_hdfs_home/testSimple2/core_node5/data/", "base_url":"https://127.0.0.1:38044/solr", "node_name":"127.0.0.1:38044_solr", "type":"NRT", "force_set_state":"false", "ulogDir":"hdfs://localhost:36531/solr_hdfs_home/testSimple2/core_node5/data/tlog", "core":"testSimple2_shard1_replica_n2", "shared_storage":"true", "state":"down"}}}, "shard2":{ "range":"0-7fffffff", "state":"active", "replicas":{ "core_node7":{ "dataDir":"hdfs://localhost:36531/solr_hdfs_home/testSimple2/core_node7/data/", "base_url":"https://127.0.0.1:43678/solr", "node_name":"127.0.0.1:43678_solr", "type":"NRT", "force_set_state":"false", "ulogDir":"hdfs://localhost:36531/solr_hdfs_home/testSimple2/core_node7/data/tlog", "core":"testSimple2_shard2_replica_n4", "shared_storage":"true", "state":"active", "leader":"true"}, "core_node8":{ "dataDir":"hdfs://localhost:36531/solr_hdfs_home/testSimple2/core_node8/data/", "base_url":"https://127.0.0.1:38044/solr", "node_name":"127.0.0.1:38044_solr", "type":"NRT", "force_set_state":"false", "ulogDir":"hdfs://localhost:36531/solr_hdfs_home/testSimple2/core_node8/data/tlog", "core":"testSimple2_shard2_replica_n6", "shared_storage":"true", "state":"down"}}}}, "router":{"name":"compositeId"}, "maxShardsPerNode":"2", "autoAddReplicas":"true", "nrtReplicas":"2", "tlogReplicas":"0"} Live Nodes: [127.0.0.1:36309_solr, 127.0.0.1:43678_solr] Last available state: DocCollection(testSimple2//collections/testSimple2/state.json/25)={ "pullReplicas":"0", "replicationFactor":"2", "shards":{ "shard1":{ "range":"80000000-ffffffff", "state":"active", "replicas":{ "core_node3":{ "dataDir":"hdfs://localhost:36531/solr_hdfs_home/testSimple2/core_node3/data/", "base_url":"https://127.0.0.1:43678/solr", "node_name":"127.0.0.1:43678_solr", "type":"NRT", "force_set_state":"false", "ulogDir":"hdfs://localhost:36531/solr_hdfs_home/testSimple2/core_node3/data/tlog", "core":"testSimple2_shard1_replica_n1", "shared_storage":"true", "state":"active", "leader":"true"}, "core_node5":{ "dataDir":"hdfs://localhost:36531/solr_hdfs_home/testSimple2/core_node5/data/", "base_url":"https://127.0.0.1:38044/solr", "node_name":"127.0.0.1:38044_solr", "type":"NRT", "force_set_state":"false", "ulogDir":"hdfs://localhost:36531/solr_hdfs_home/testSimple2/core_node5/data/tlog", "core":"testSimple2_shard1_replica_n2", "shared_storage":"true", "state":"down"}}}, "shard2":{ "range":"0-7fffffff", "state":"active", "replicas":{ "core_node7":{ "dataDir":"hdfs://localhost:36531/solr_hdfs_home/testSimple2/core_node7/data/", "base_url":"https://127.0.0.1:43678/solr", "node_name":"127.0.0.1:43678_solr", "type":"NRT", "force_set_state":"false", "ulogDir":"hdfs://localhost:36531/solr_hdfs_home/testSimple2/core_node7/data/tlog", "core":"testSimple2_shard2_replica_n4", "shared_storage":"true", "state":"active", "leader":"true"}, "core_node8":{ "dataDir":"hdfs://localhost:36531/solr_hdfs_home/testSimple2/core_node8/data/", "base_url":"https://127.0.0.1:38044/solr", "node_name":"127.0.0.1:38044_solr", "type":"NRT", "force_set_state":"false", "ulogDir":"hdfs://localhost:36531/solr_hdfs_home/testSimple2/core_node8/data/tlog", "core":"testSimple2_shard2_replica_n6", "shared_storage":"true", "state":"down"}}}}, "router":{"name":"compositeId"}, "maxShardsPerNode":"2", "autoAddReplicas":"true", "nrtReplicas":"2", "tlogReplicas":"0"}
Stack Trace:
java.lang.AssertionError: Waiting for collection testSimple2
Timeout waiting to see state for collection=testSimple2 :DocCollection(testSimple2//collections/testSimple2/state.json/25)={
"pullReplicas":"0",
"replicationFactor":"2",
"shards":{
"shard1":{
"range":"80000000-ffffffff",
"state":"active",
"replicas":{
"core_node3":{
"dataDir":"hdfs://localhost:36531/solr_hdfs_home/testSimple2/core_node3/data/",
"base_url":"https://127.0.0.1:43678/solr",
"node_name":"127.0.0.1:43678_solr",
"type":"NRT",
"force_set_state":"false",
"ulogDir":"hdfs://localhost:36531/solr_hdfs_home/testSimple2/core_node3/data/tlog",
"core":"testSimple2_shard1_replica_n1",
"shared_storage":"true",
"state":"active",
"leader":"true"},
"core_node5":{
"dataDir":"hdfs://localhost:36531/solr_hdfs_home/testSimple2/core_node5/data/",
"base_url":"https://127.0.0.1:38044/solr",
"node_name":"127.0.0.1:38044_solr",
"type":"NRT",
"force_set_state":"false",
"ulogDir":"hdfs://localhost:36531/solr_hdfs_home/testSimple2/core_node5/data/tlog",
"core":"testSimple2_shard1_replica_n2",
"shared_storage":"true",
"state":"down"}}},
"shard2":{
"range":"0-7fffffff",
"state":"active",
"replicas":{
"core_node7":{
"dataDir":"hdfs://localhost:36531/solr_hdfs_home/testSimple2/core_node7/data/",
"base_url":"https://127.0.0.1:43678/solr",
"node_name":"127.0.0.1:43678_solr",
"type":"NRT",
"force_set_state":"false",
"ulogDir":"hdfs://localhost:36531/solr_hdfs_home/testSimple2/core_node7/data/tlog",
"core":"testSimple2_shard2_replica_n4",
"shared_storage":"true",
"state":"active",
"leader":"true"},
"core_node8":{
"dataDir":"hdfs://localhost:36531/solr_hdfs_home/testSimple2/core_node8/data/",
"base_url":"https://127.0.0.1:38044/solr",
"node_name":"127.0.0.1:38044_solr",
"type":"NRT",
"force_set_state":"false",
"ulogDir":"hdfs://localhost:36531/solr_hdfs_home/testSimple2/core_node8/data/tlog",
"core":"testSimple2_shard2_replica_n6",
"shared_storage":"true",
"state":"down"}}}},
"router":{"name":"compositeId"},
"maxShardsPerNode":"2",
"autoAddReplicas":"true",
"nrtReplicas":"2",
"tlogReplicas":"0"}
Live Nodes: [127.0.0.1:36309_solr, 127.0.0.1:43678_solr]
Last available state: DocCollection(testSimple2//collections/testSimple2/state.json/25)={
"pullReplicas":"0",
"replicationFactor":"2",
"shards":{
"shard1":{
"range":"80000000-ffffffff",
"state":"active",
"replicas":{
"core_node3":{
"dataDir":"hdfs://localhost:36531/solr_hdfs_home/testSimple2/core_node3/data/",
"base_url":"https://127.0.0.1:43678/solr",
"node_name":"127.0.0.1:43678_solr",
"type":"NRT",
"force_set_state":"false",
"ulogDir":"hdfs://localhost:36531/solr_hdfs_home/testSimple2/core_node3/data/tlog",
"core":"testSimple2_shard1_replica_n1",
"shared_storage":"true",
"state":"active",
"leader":"true"},
"core_node5":{
"dataDir":"hdfs://localhost:36531/solr_hdfs_home/testSimple2/core_node5/data/",
"base_url":"https://127.0.0.1:38044/solr",
"node_name":"127.0.0.1:38044_solr",
"type":"NRT",
"force_set_state":"false",
"ulogDir":"hdfs://localhost:36531/solr_hdfs_home/testSimple2/core_node5/data/tlog",
"core":"testSimple2_shard1_replica_n2",
"shared_storage":"true",
"state":"down"}}},
"shard2":{
"range":"0-7fffffff",
"state":"active",
"replicas":{
"core_node7":{
"dataDir":"hdfs://localhost:36531/solr_hdfs_home/testSimple2/core_node7/data/",
"base_url":"https://127.0.0.1:43678/solr",
"node_name":"127.0.0.1:43678_solr",
"type":"NRT",
"force_set_state":"false",
"ulogDir":"hdfs://localhost:36531/solr_hdfs_home/testSimple2/core_node7/data/tlog",
"core":"testSimple2_shard2_replica_n4",
"shared_storage":"true",
"state":"active",
"leader":"true"},
"core_node8":{
"dataDir":"hdfs://localhost:36531/solr_hdfs_home/testSimple2/core_node8/data/",
"base_url":"https://127.0.0.1:38044/solr",
"node_name":"127.0.0.1:38044_solr",
"type":"NRT",
"force_set_state":"false",
"ulogDir":"hdfs://localhost:36531/solr_hdfs_home/testSimple2/core_node8/data/tlog",
"core":"testSimple2_shard2_replica_n6",
"shared_storage":"true",
"state":"down"}}}},
"router":{"name":"compositeId"},
"maxShardsPerNode":"2",
"autoAddReplicas":"true",
"nrtReplicas":"2",
"tlogReplicas":"0"}
at __randomizedtesting.SeedInfo.seed([2DB99868DD93FE30:150ABC96FA602AE1]:0)
at org.junit.Assert.fail(Assert.java:88)
at org.apache.solr.cloud.SolrCloudTestCase.waitForState(SolrCloudTestCase.java:310)
at org.apache.solr.cloud.autoscaling.AutoAddReplicasIntegrationTest.testSimple(AutoAddReplicasIntegrationTest.java:169)
at sun.reflect.NativeMethodAccessorImpl.invoke0(Native Method)
at sun.reflect.NativeMethodAccessorImpl.invoke(NativeMethodAccessorImpl.java:62)
at sun.reflect.DelegatingMethodAccessorImpl.invoke(DelegatingMethodAccessorImpl.java:43)
at java.lang.reflect.Method.invoke(Method.java:498)
at com.carrotsearch.randomizedtesting.RandomizedRunner.invoke(RandomizedRunner.java:1750)
at com.carrotsearch.randomizedtesting.RandomizedRunner$8.evaluate(RandomizedRunner.java:938)
at com.carrotsearch.randomizedtesting.RandomizedRunner$9.evaluate(RandomizedRunner.java:974)
at com.carrotsearch.randomizedtesting.RandomizedRunner$10.evaluate(RandomizedRunner.java:988)
at com.carrotsearch.randomizedtesting.rules.SystemPropertiesRestoreRule$1.evaluate(SystemPropertiesRestoreRule.java:57)
at org.apache.lucene.util.TestRuleSetupTeardownChained$1.evaluate(TestRuleSetupTeardownChained.java:49)
at org.apache.lucene.util.AbstractBeforeAfterRule$1.evaluate(AbstractBeforeAfterRule.java:45)
at org.apache.lucene.util.TestRuleThreadAndTestName$1.evaluate(TestRuleThreadAndTestName.java:48)
at org.apache.lucene.util.TestRuleIgnoreAfterMaxFailures$1.evaluate(TestRuleIgnoreAfterMaxFailures.java:64)
at org.apache.lucene.util.TestRuleMarkFailure$1.evaluate(TestRuleMarkFailure.java:47)
at com.carrotsearch.randomizedtesting.rules.StatementAdapter.evaluate(StatementAdapter.java:36)
at com.carrotsearch.randomizedtesting.ThreadLeakControl$StatementRunner.run(ThreadLeakControl.java:368)
at com.carrotsearch.randomizedtesting.ThreadLeakControl.forkTimeoutingTask(ThreadLeakControl.java:817)
at com.carrotsearch.randomizedtesting.ThreadLeakControl$3.evaluate(ThreadLeakControl.java:468)
at com.carrotsearch.randomizedtesting.RandomizedRunner.runSingleTest(RandomizedRunner.java:947)
at com.carrotsearch.randomizedtesting.RandomizedRunner$5.evaluate(RandomizedRunner.java:832)
at com.carrotsearch.randomizedtesting.RandomizedRunner$6.evaluate(RandomizedRunner.java:883)
at com.carrotsearch.randomizedtesting.RandomizedRunner$7.evaluate(RandomizedRunner.java:894)
at com.carrotsearch.randomizedtesting.rules.StatementAdapter.evaluate(StatementAdapter.java:36)
at com.carrotsearch.randomizedtesting.rules.SystemPropertiesRestoreRule$1.evaluate(SystemPropertiesRestoreRule.java:57)
at org.apache.lucene.util.AbstractBeforeAfterRule$1.evaluate(AbstractBeforeAfterRule.java:45)
at com.carrotsearch.randomizedtesting.rules.StatementAdapter.evaluate(StatementAdapter.java:36)
at org.apache.lucene.util.TestRuleStoreClassName$1.evaluate(TestRuleStoreClassName.java:41)
at com.carrotsearch.randomizedtesting.rules.NoShadowingOrOverridesOnMethodsRule$1.evaluate(NoShadowingOrOverridesOnMethodsRule.java:40)
at com.carrotsearch.randomizedtesting.rules.NoShadowingOrOverridesOnMethodsRule$1.evaluate(NoShadowingOrOverridesOnMethodsRule.java:40)
at com.carrotsearch.randomizedtesting.rules.StatementAdapter.evaluate(StatementAdapter.java:36)
at com.carrotsearch.randomizedtesting.rules.StatementAdapter.evaluate(StatementAdapter.java:36)
at com.carrotsearch.randomizedtesting.rules.StatementAdapter.evaluate(StatementAdapter.java:36)
at org.apache.lucene.util.TestRuleAssertionsRequired$1.evaluate(TestRuleAssertionsRequired.java:53)
at org.apache.lucene.util.TestRuleMarkFailure$1.evaluate(TestRuleMarkFailure.java:47)
at org.apache.lucene.util.TestRuleIgnoreAfterMaxFailures$1.evaluate(TestRuleIgnoreAfterMaxFailures.java:64)
at org.apache.lucene.util.TestRuleIgnoreTestSuites$1.evaluate(TestRuleIgnoreTestSuites.java:54)
at com.carrotsearch.randomizedtesting.rules.StatementAdapter.evaluate(StatementAdapter.java:36)
at com.carrotsearch.randomizedtesting.ThreadLeakControl$StatementRunner.run(ThreadLeakControl.java:368)
at java.lang.Thread.run(Thread.java:748)
Build Log:
[...truncated 15044 lines...]
[junit4] Suite: org.apache.solr.cloud.autoscaling.HdfsAutoAddReplicasIntegrationTest
[junit4] 2> Creating dataDir: /x1/jenkins/jenkins-slave/workspace/Lucene-Solr-NightlyTests-8.x/checkout/solr/build/solr-core/test/J2/temp/solr.cloud.autoscaling.HdfsAutoAddReplicasIntegrationTest_2DB99868DD93FE30-001/init-core-data-001
[junit4] 2> 4278004 WARN (SUITE-HdfsAutoAddReplicasIntegrationTest-seed#[2DB99868DD93FE30]-worker) [ ] o.a.s.SolrTestCaseJ4 startTrackingSearchers: numOpens=8 numCloses=8
[junit4] 2> 4278004 INFO (SUITE-HdfsAutoAddReplicasIntegrationTest-seed#[2DB99868DD93FE30]-worker) [ ] o.a.s.SolrTestCaseJ4 Using TrieFields (NUMERIC_POINTS_SYSPROP=false) w/NUMERIC_DOCVALUES_SYSPROP=false
[junit4] 2> 4278007 INFO (SUITE-HdfsAutoAddReplicasIntegrationTest-seed#[2DB99868DD93FE30]-worker) [ ] o.a.s.SolrTestCaseJ4 Randomized ssl (true) and clientAuth (true) via: @org.apache.solr.util.RandomizeSSL(reason=, ssl=NaN, value=NaN, clientAuth=NaN)
[junit4] 2> 4278007 INFO (SUITE-HdfsAutoAddReplicasIntegrationTest-seed#[2DB99868DD93FE30]-worker) [ ] o.a.s.SolrTestCaseJ4 SecureRandom sanity checks: test.solr.allowed.securerandom=null & java.security.egd=file:/dev/./urandom
[junit4] 1> Formatting using clusterid: testClusterID
[junit4] 2> 4278048 WARN (SUITE-HdfsAutoAddReplicasIntegrationTest-seed#[2DB99868DD93FE30]-worker) [ ] o.a.h.m.i.MetricsConfig Cannot locate configuration: tried hadoop-metrics2-namenode.properties,hadoop-metrics2.properties
[junit4] 2> 4278061 WARN (SUITE-HdfsAutoAddReplicasIntegrationTest-seed#[2DB99868DD93FE30]-worker) [ ] o.a.h.h.HttpRequestLog Jetty request log can only be enabled using Log4j
[junit4] 2> 4278063 INFO (SUITE-HdfsAutoAddReplicasIntegrationTest-seed#[2DB99868DD93FE30]-worker) [ ] o.e.j.s.Server jetty-9.4.14.v20181114; built: 2018-11-14T21:20:31.478Z; git: c4550056e785fb5665914545889f21dc136ad9e6; jvm 1.8.0_191-b12
[junit4] 2> 4278064 INFO (SUITE-HdfsAutoAddReplicasIntegrationTest-seed#[2DB99868DD93FE30]-worker) [ ] o.e.j.s.session DefaultSessionIdManager workerName=node0
[junit4] 2> 4278064 INFO (SUITE-HdfsAutoAddReplicasIntegrationTest-seed#[2DB99868DD93FE30]-worker) [ ] o.e.j.s.session No SessionScavenger set, using defaults
[junit4] 2> 4278064 INFO (SUITE-HdfsAutoAddReplicasIntegrationTest-seed#[2DB99868DD93FE30]-worker) [ ] o.e.j.s.session node0 Scavenging every 600000ms
[junit4] 2> 4278065 INFO (SUITE-HdfsAutoAddReplicasIntegrationTest-seed#[2DB99868DD93FE30]-worker) [ ] o.e.j.s.h.ContextHandler Started o.e.j.s.ServletContextHandler@2b4a0617{static,/static,jar:file:/x1/jenkins/.ivy2/cache/org.apache.hadoop/hadoop-hdfs/tests/hadoop-hdfs-3.2.0-tests.jar!/webapps/static,AVAILABLE}
[junit4] 2> 4278226 INFO (SUITE-HdfsAutoAddReplicasIntegrationTest-seed#[2DB99868DD93FE30]-worker) [ ] o.e.j.s.h.ContextHandler Started o.e.j.w.WebAppContext@673601c6{hdfs,/,file:///x1/jenkins/jenkins-slave/workspace/Lucene-Solr-NightlyTests-8.x/checkout/solr/build/solr-core/test/J2/temp/jetty-localhost-41463-hdfs-_-any-5513797641455961916.dir/webapp/,AVAILABLE}{/hdfs}
[junit4] 2> 4278226 INFO (SUITE-HdfsAutoAddReplicasIntegrationTest-seed#[2DB99868DD93FE30]-worker) [ ] o.e.j.s.AbstractConnector Started ServerConnector@b2e2a86{HTTP/1.1,[http/1.1]}{localhost:41463}
[junit4] 2> 4278226 INFO (SUITE-HdfsAutoAddReplicasIntegrationTest-seed#[2DB99868DD93FE30]-worker) [ ] o.e.j.s.Server Started @4278303ms
[junit4] 2> 4278302 WARN (SUITE-HdfsAutoAddReplicasIntegrationTest-seed#[2DB99868DD93FE30]-worker) [ ] o.a.h.h.HttpRequestLog Jetty request log can only be enabled using Log4j
[junit4] 2> 4278304 INFO (SUITE-HdfsAutoAddReplicasIntegrationTest-seed#[2DB99868DD93FE30]-worker) [ ] o.e.j.s.Server jetty-9.4.14.v20181114; built: 2018-11-14T21:20:31.478Z; git: c4550056e785fb5665914545889f21dc136ad9e6; jvm 1.8.0_191-b12
[junit4] 2> 4278305 INFO (SUITE-HdfsAutoAddReplicasIntegrationTest-seed#[2DB99868DD93FE30]-worker) [ ] o.e.j.s.session DefaultSessionIdManager workerName=node0
[junit4] 2> 4278305 INFO (SUITE-HdfsAutoAddReplicasIntegrationTest-seed#[2DB99868DD93FE30]-worker) [ ] o.e.j.s.session No SessionScavenger set, using defaults
[junit4] 2> 4278305 INFO (SUITE-HdfsAutoAddReplicasIntegrationTest-seed#[2DB99868DD93FE30]-worker) [ ] o.e.j.s.session node0 Scavenging every 660000ms
[junit4] 2> 4278305 INFO (SUITE-HdfsAutoAddReplicasIntegrationTest-seed#[2DB99868DD93FE30]-worker) [ ] o.e.j.s.h.ContextHandler Started o.e.j.s.ServletContextHandler@26dc39ec{static,/static,jar:file:/x1/jenkins/.ivy2/cache/org.apache.hadoop/hadoop-hdfs/tests/hadoop-hdfs-3.2.0-tests.jar!/webapps/static,AVAILABLE}
[junit4] 2> 4278460 INFO (SUITE-HdfsAutoAddReplicasIntegrationTest-seed#[2DB99868DD93FE30]-worker) [ ] o.e.j.s.h.ContextHandler Started o.e.j.w.WebAppContext@a5893c4{datanode,/,file:///x1/jenkins/jenkins-slave/workspace/Lucene-Solr-NightlyTests-8.x/checkout/solr/build/solr-core/test/J2/temp/jetty-localhost-46012-datanode-_-any-8613383558122960109.dir/webapp/,AVAILABLE}{/datanode}
[junit4] 2> 4278460 INFO (SUITE-HdfsAutoAddReplicasIntegrationTest-seed#[2DB99868DD93FE30]-worker) [ ] o.e.j.s.AbstractConnector Started ServerConnector@c94a88d{HTTP/1.1,[http/1.1]}{localhost:46012}
[junit4] 2> 4278460 INFO (SUITE-HdfsAutoAddReplicasIntegrationTest-seed#[2DB99868DD93FE30]-worker) [ ] o.e.j.s.Server Started @4278537ms
[junit4] 2> 4278501 WARN (SUITE-HdfsAutoAddReplicasIntegrationTest-seed#[2DB99868DD93FE30]-worker) [ ] o.a.h.h.HttpRequestLog Jetty request log can only be enabled using Log4j
[junit4] 2> 4278503 INFO (SUITE-HdfsAutoAddReplicasIntegrationTest-seed#[2DB99868DD93FE30]-worker) [ ] o.e.j.s.Server jetty-9.4.14.v20181114; built: 2018-11-14T21:20:31.478Z; git: c4550056e785fb5665914545889f21dc136ad9e6; jvm 1.8.0_191-b12
[junit4] 2> 4278504 INFO (SUITE-HdfsAutoAddReplicasIntegrationTest-seed#[2DB99868DD93FE30]-worker) [ ] o.e.j.s.session DefaultSessionIdManager workerName=node0
[junit4] 2> 4278504 INFO (SUITE-HdfsAutoAddReplicasIntegrationTest-seed#[2DB99868DD93FE30]-worker) [ ] o.e.j.s.session No SessionScavenger set, using defaults
[junit4] 2> 4278504 INFO (SUITE-HdfsAutoAddReplicasIntegrationTest-seed#[2DB99868DD93FE30]-worker) [ ] o.e.j.s.session node0 Scavenging every 600000ms
[junit4] 2> 4278505 INFO (SUITE-HdfsAutoAddReplicasIntegrationTest-seed#[2DB99868DD93FE30]-worker) [ ] o.e.j.s.h.ContextHandler Started o.e.j.s.ServletContextHandler@7bdba2e{static,/static,jar:file:/x1/jenkins/.ivy2/cache/org.apache.hadoop/hadoop-hdfs/tests/hadoop-hdfs-3.2.0-tests.jar!/webapps/static,AVAILABLE}
[junit4] 2> 4278611 INFO (Block report processor) [ ] BlockStateChange BLOCK* processReport 0x65d2a4ebfdd1b830: Processing first storage report for DS-1e16cc0c-2c0f-4fb6-94a8-069a1b24736a from datanode b141bd2d-d64d-4c83-8ab4-1a3e4d46fd10
[junit4] 2> 4278611 INFO (Block report processor) [ ] BlockStateChange BLOCK* processReport 0x65d2a4ebfdd1b830: from storage DS-1e16cc0c-2c0f-4fb6-94a8-069a1b24736a node DatanodeRegistration(127.0.0.1:41648, datanodeUuid=b141bd2d-d64d-4c83-8ab4-1a3e4d46fd10, infoPort=44428, infoSecurePort=0, ipcPort=34293, storageInfo=lv=-57;cid=testClusterID;nsid=1612510995;c=1559886825197), blocks: 0, hasStaleStorage: true, processing time: 0 msecs, invalidatedBlocks: 0
[junit4] 2> 4278611 INFO (Block report processor) [ ] BlockStateChange BLOCK* processReport 0x65d2a4ebfdd1b830: Processing first storage report for DS-e7fb8667-67cf-49b0-84ec-82338b1fb918 from datanode b141bd2d-d64d-4c83-8ab4-1a3e4d46fd10
[junit4] 2> 4278611 INFO (Block report processor) [ ] BlockStateChange BLOCK* processReport 0x65d2a4ebfdd1b830: from storage DS-e7fb8667-67cf-49b0-84ec-82338b1fb918 node DatanodeRegistration(127.0.0.1:41648, datanodeUuid=b141bd2d-d64d-4c83-8ab4-1a3e4d46fd10, infoPort=44428, infoSecurePort=0, ipcPort=34293, storageInfo=lv=-57;cid=testClusterID;nsid=1612510995;c=1559886825197), blocks: 0, hasStaleStorage: false, processing time: 0 msecs, invalidatedBlocks: 0
[junit4] 2> 4278694 INFO (SUITE-HdfsAutoAddReplicasIntegrationTest-seed#[2DB99868DD93FE30]-worker) [ ] o.e.j.s.h.ContextHandler Started o.e.j.w.WebAppContext@5c84af0f{datanode,/,file:///x1/jenkins/jenkins-slave/workspace/Lucene-Solr-NightlyTests-8.x/checkout/solr/build/solr-core/test/J2/temp/jetty-localhost-38590-datanode-_-any-8522419405702724240.dir/webapp/,AVAILABLE}{/datanode}
[junit4] 2> 4278694 INFO (SUITE-HdfsAutoAddReplicasIntegrationTest-seed#[2DB99868DD93FE30]-worker) [ ] o.e.j.s.AbstractConnector Started ServerConnector@73df29f4{HTTP/1.1,[http/1.1]}{localhost:38590}
[junit4] 2> 4278694 INFO (SUITE-HdfsAutoAddReplicasIntegrationTest-seed#[2DB99868DD93FE30]-worker) [ ] o.e.j.s.Server Started @4278771ms
[junit4] 2> 4278811 INFO (Block report processor) [ ] BlockStateChange BLOCK* processReport 0x6be9659248c7199e: Processing first storage report for DS-569477f7-2ef2-49ee-a763-deb23d220628 from datanode e2f57ba0-493c-4885-b0ac-7ebeb141ba67
[junit4] 2> 4278811 INFO (Block report processor) [ ] BlockStateChange BLOCK* processReport 0x6be9659248c7199e: from storage DS-569477f7-2ef2-49ee-a763-deb23d220628 node DatanodeRegistration(127.0.0.1:35415, datanodeUuid=e2f57ba0-493c-4885-b0ac-7ebeb141ba67, infoPort=42668, infoSecurePort=0, ipcPort=35920, storageInfo=lv=-57;cid=testClusterID;nsid=1612510995;c=1559886825197), blocks: 0, hasStaleStorage: true, processing time: 0 msecs, invalidatedBlocks: 0
[junit4] 2> 4278811 INFO (Block report processor) [ ] BlockStateChange BLOCK* processReport 0x6be9659248c7199e: Processing first storage report for DS-ba8ff65e-5a3d-435f-b10a-aa6851ed1463 from datanode e2f57ba0-493c-4885-b0ac-7ebeb141ba67
[junit4] 2> 4278811 INFO (Block report processor) [ ] BlockStateChange BLOCK* processReport 0x6be9659248c7199e: from storage DS-ba8ff65e-5a3d-435f-b10a-aa6851ed1463 node DatanodeRegistration(127.0.0.1:35415, datanodeUuid=e2f57ba0-493c-4885-b0ac-7ebeb141ba67, infoPort=42668, infoSecurePort=0, ipcPort=35920, storageInfo=lv=-57;cid=testClusterID;nsid=1612510995;c=1559886825197), blocks: 0, hasStaleStorage: false, processing time: 0 msecs, invalidatedBlocks: 0
[junit4] 2> 4279012 INFO (TEST-HdfsAutoAddReplicasIntegrationTest.testSimple-seed#[2DB99868DD93FE30]) [ ] o.a.s.SolrTestCaseJ4 ###Starting testSimple
[junit4] 2> 4279013 INFO (TEST-HdfsAutoAddReplicasIntegrationTest.testSimple-seed#[2DB99868DD93FE30]) [ ] o.a.s.c.MiniSolrCloudCluster Starting cluster of 3 servers in /x1/jenkins/jenkins-slave/workspace/Lucene-Solr-NightlyTests-8.x/checkout/solr/build/solr-core/test/J2/temp/solr.cloud.autoscaling.HdfsAutoAddReplicasIntegrationTest_2DB99868DD93FE30-001/tempDir-002
[junit4] 2> 4279014 INFO (TEST-HdfsAutoAddReplicasIntegrationTest.testSimple-seed#[2DB99868DD93FE30]) [ ] o.a.s.c.ZkTestServer STARTING ZK TEST SERVER
[junit4] 2> 4279014 INFO (ZkTestServer Run Thread) [ ] o.a.s.c.ZkTestServer client port:0.0.0.0/0.0.0.0:0
[junit4] 2> 4279014 INFO (ZkTestServer Run Thread) [ ] o.a.s.c.ZkTestServer Starting server
[junit4] 2> 4279114 INFO (TEST-HdfsAutoAddReplicasIntegrationTest.testSimple-seed#[2DB99868DD93FE30]) [ ] o.a.s.c.ZkTestServer start zk server on port:34844
[junit4] 2> 4279114 INFO (TEST-HdfsAutoAddReplicasIntegrationTest.testSimple-seed#[2DB99868DD93FE30]) [ ] o.a.s.c.ZkTestServer parse host and port list: 127.0.0.1:34844
[junit4] 2> 4279114 INFO (TEST-HdfsAutoAddReplicasIntegrationTest.testSimple-seed#[2DB99868DD93FE30]) [ ] o.a.s.c.ZkTestServer connecting to 127.0.0.1 34844
[junit4] 2> 4279116 INFO (TEST-HdfsAutoAddReplicasIntegrationTest.testSimple-seed#[2DB99868DD93FE30]) [ ] o.a.s.c.c.ConnectionManager Waiting for client to connect to ZooKeeper
[junit4] 2> 4279120 INFO (zkConnectionManagerCallback-21919-thread-1) [ ] o.a.s.c.c.ConnectionManager zkClient has connected
[junit4] 2> 4279120 INFO (TEST-HdfsAutoAddReplicasIntegrationTest.testSimple-seed#[2DB99868DD93FE30]) [ ] o.a.s.c.c.ConnectionManager Client is connected to ZooKeeper
[junit4] 2> 4279124 INFO (TEST-HdfsAutoAddReplicasIntegrationTest.testSimple-seed#[2DB99868DD93FE30]) [ ] o.a.s.c.c.ConnectionManager Waiting for client to connect to ZooKeeper
[junit4] 2> 4279125 INFO (zkConnectionManagerCallback-21921-thread-1) [ ] o.a.s.c.c.ConnectionManager zkClient has connected
[junit4] 2> 4279125 INFO (TEST-HdfsAutoAddReplicasIntegrationTest.testSimple-seed#[2DB99868DD93FE30]) [ ] o.a.s.c.c.ConnectionManager Client is connected to ZooKeeper
[junit4] 2> 4279126 INFO (TEST-HdfsAutoAddReplicasIntegrationTest.testSimple-seed#[2DB99868DD93FE30]) [ ] o.a.s.c.c.ConnectionManager Waiting for client to connect to ZooKeeper
[junit4] 2> 4279128 INFO (zkConnectionManagerCallback-21923-thread-1) [ ] o.a.s.c.c.ConnectionManager zkClient has connected
[junit4] 2> 4279128 INFO (TEST-HdfsAutoAddReplicasIntegrationTest.testSimple-seed#[2DB99868DD93FE30]) [ ] o.a.s.c.c.ConnectionManager Client is connected to ZooKeeper
[junit4] 2> 4279233 WARN (jetty-launcher-21924-thread-2) [ ] o.e.j.s.AbstractConnector Ignoring deprecated socket close linger time
[junit4] 2> 4279233 WARN (jetty-launcher-21924-thread-1) [ ] o.e.j.s.AbstractConnector Ignoring deprecated socket close linger time
[junit4] 2> 4279233 WARN (jetty-launcher-21924-thread-3) [ ] o.e.j.s.AbstractConnector Ignoring deprecated socket close linger time
[junit4] 2> 4279233 INFO (jetty-launcher-21924-thread-2) [ ] o.a.s.c.s.e.JettySolrRunner Start Jetty (original configured port=0)
[junit4] 2> 4279233 INFO (jetty-launcher-21924-thread-1) [ ] o.a.s.c.s.e.JettySolrRunner Start Jetty (original configured port=0)
[junit4] 2> 4279233 INFO (jetty-launcher-21924-thread-2) [ ] o.a.s.c.s.e.JettySolrRunner Trying to start Jetty on port 0 try number 1 ...
[junit4] 2> 4279233 INFO (jetty-launcher-21924-thread-1) [ ] o.a.s.c.s.e.JettySolrRunner Trying to start Jetty on port 0 try number 1 ...
[junit4] 2> 4279234 INFO (jetty-launcher-21924-thread-2) [ ] o.e.j.s.Server jetty-9.4.14.v20181114; built: 2018-11-14T21:20:31.478Z; git: c4550056e785fb5665914545889f21dc136ad9e6; jvm 1.8.0_191-b12
[junit4] 2> 4279234 INFO (jetty-launcher-21924-thread-1) [ ] o.e.j.s.Server jetty-9.4.14.v20181114; built: 2018-11-14T21:20:31.478Z; git: c4550056e785fb5665914545889f21dc136ad9e6; jvm 1.8.0_191-b12
[junit4] 2> 4279234 INFO (jetty-launcher-21924-thread-3) [ ] o.a.s.c.s.e.JettySolrRunner Start Jetty (original configured port=0)
[junit4] 2> 4279234 INFO (jetty-launcher-21924-thread-3) [ ] o.a.s.c.s.e.JettySolrRunner Trying to start Jetty on port 0 try number 1 ...
[junit4] 2> 4279234 INFO (jetty-launcher-21924-thread-3) [ ] o.e.j.s.Server jetty-9.4.14.v20181114; built: 2018-11-14T21:20:31.478Z; git: c4550056e785fb5665914545889f21dc136ad9e6; jvm 1.8.0_191-b12
[junit4] 2> 4279236 INFO (jetty-launcher-21924-thread-1) [ ] o.e.j.s.session DefaultSessionIdManager workerName=node0
[junit4] 2> 4279236 INFO (jetty-launcher-21924-thread-1) [ ] o.e.j.s.session No SessionScavenger set, using defaults
[junit4] 2> 4279236 INFO (jetty-launcher-21924-thread-1) [ ] o.e.j.s.session node0 Scavenging every 600000ms
[junit4] 2> 4279237 INFO (jetty-launcher-21924-thread-2) [ ] o.e.j.s.session DefaultSessionIdManager workerName=node0
[junit4] 2> 4279237 INFO (jetty-launcher-21924-thread-2) [ ] o.e.j.s.session No SessionScavenger set, using defaults
[junit4] 2> 4279237 INFO (jetty-launcher-21924-thread-2) [ ] o.e.j.s.session node0 Scavenging every 660000ms
[junit4] 2> 4279237 INFO (jetty-launcher-21924-thread-1) [ ] o.e.j.s.h.ContextHandler Started o.e.j.s.ServletContextHandler@5a2488de{/solr,null,AVAILABLE}
[junit4] 2> 4279237 INFO (jetty-launcher-21924-thread-2) [ ] o.e.j.s.h.ContextHandler Started o.e.j.s.ServletContextHandler@55c4a3d3{/solr,null,AVAILABLE}
[junit4] 2> 4279238 INFO (jetty-launcher-21924-thread-3) [ ] o.e.j.s.session DefaultSessionIdManager workerName=node0
[junit4] 2> 4279238 INFO (jetty-launcher-21924-thread-3) [ ] o.e.j.s.session No SessionScavenger set, using defaults
[junit4] 2> 4279238 INFO (jetty-launcher-21924-thread-3) [ ] o.e.j.s.session node0 Scavenging every 600000ms
[junit4] 2> 4279238 WARN (jetty-launcher-21924-thread-1) [ ] o.e.j.u.s.S.config No Client EndPointIdentificationAlgorithm configured for SslContextFactory@332f5a28[provider=null,keyStore=null,trustStore=null]
[junit4] 2> 4279238 WARN (jetty-launcher-21924-thread-2) [ ] o.e.j.u.s.S.config No Client EndPointIdentificationAlgorithm configured for SslContextFactory@6bca0b50[provider=null,keyStore=null,trustStore=null]
[junit4] 2> 4279238 INFO (jetty-launcher-21924-thread-3) [ ] o.e.j.s.h.ContextHandler Started o.e.j.s.ServletContextHandler@4185b99d{/solr,null,AVAILABLE}
[junit4] 2> 4279238 WARN (jetty-launcher-21924-thread-3) [ ] o.e.j.u.s.S.config No Client EndPointIdentificationAlgorithm configured for SslContextFactory@6e3bbc13[provider=null,keyStore=null,trustStore=null]
[junit4] 2> 4279238 INFO (jetty-launcher-21924-thread-1) [ ] o.e.j.s.AbstractConnector Started ServerConnector@8289b6a{SSL,[ssl, http/1.1]}{127.0.0.1:43678}
[junit4] 2> 4279238 INFO (jetty-launcher-21924-thread-1) [ ] o.e.j.s.Server Started @4279315ms
[junit4] 2> 4279238 INFO (jetty-launcher-21924-thread-1) [ ] o.a.s.c.s.e.JettySolrRunner Jetty properties: {hostContext=/solr, hostPort=43678}
[junit4] 2> 4279238 INFO (jetty-launcher-21924-thread-2) [ ] o.e.j.s.AbstractConnector Started ServerConnector@331a3e0f{SSL,[ssl, http/1.1]}{127.0.0.1:36309}
[junit4] 2> 4279238 INFO (jetty-launcher-21924-thread-2) [ ] o.e.j.s.Server Started @4279315ms
[junit4] 2> 4279238 INFO (jetty-launcher-21924-thread-2) [ ] o.a.s.c.s.e.JettySolrRunner Jetty properties: {hostContext=/solr, hostPort=36309}
[junit4] 2> 4279239 ERROR (jetty-launcher-21924-thread-1) [ ] o.a.s.u.StartupLoggingUtils Missing Java Option solr.log.dir. Logging may be missing or incomplete.
[junit4] 2> 4279239 INFO (jetty-launcher-21924-thread-1) [ ] o.a.s.s.SolrDispatchFilter Using logger factory org.apache.logging.slf4j.Log4jLoggerFactory
[junit4] 2> 4279239 INFO (jetty-launcher-21924-thread-3) [ ] o.e.j.s.AbstractConnector Started ServerConnector@405dc06f{SSL,[ssl, http/1.1]}{127.0.0.1:38044}
[junit4] 2> 4279239 INFO (jetty-launcher-21924-thread-3) [ ] o.e.j.s.Server Started @4279315ms
[junit4] 2> 4279239 ERROR (jetty-launcher-21924-thread-2) [ ] o.a.s.u.StartupLoggingUtils Missing Java Option solr.log.dir. Logging may be missing or incomplete.
[junit4] 2> 4279239 INFO (jetty-launcher-21924-thread-2) [ ] o.a.s.s.SolrDispatchFilter Using logger factory org.apache.logging.slf4j.Log4jLoggerFactory
[junit4] 2> 4279239 INFO (jetty-launcher-21924-thread-3) [ ] o.a.s.c.s.e.JettySolrRunner Jetty properties: {hostContext=/solr, hostPort=38044}
[junit4] 2> 4279239 INFO (jetty-launcher-21924-thread-1) [ ] o.a.s.s.SolrDispatchFilter ___ _ Welcome to Apache Solr? version 8.2.0
[junit4] 2> 4279239 INFO (jetty-launcher-21924-thread-2) [ ] o.a.s.s.SolrDispatchFilter ___ _ Welcome to Apache Solr? version 8.2.0
[junit4] 2> 4279239 INFO (jetty-launcher-21924-thread-1) [ ] o.a.s.s.SolrDispatchFilter / __| ___| |_ _ Starting in cloud mode on port null
[junit4] 2> 4279239 INFO (jetty-launcher-21924-thread-1) [ ] o.a.s.s.SolrDispatchFilter \__ \/ _ \ | '_| Install dir: null
[junit4] 2> 4279239 INFO (jetty-launcher-21924-thread-1) [ ] o.a.s.s.SolrDispatchFilter |___/\___/_|_| Start time: 2019-06-07T05:53:46.414Z
[junit4] 2> 4279239 INFO (jetty-launcher-21924-thread-2) [ ] o.a.s.s.SolrDispatchFilter / __| ___| |_ _ Starting in cloud mode on port null
[junit4] 2> 4279239 INFO (jetty-launcher-21924-thread-2) [ ] o.a.s.s.SolrDispatchFilter \__ \/ _ \ | '_| Install dir: null
[junit4] 2> 4279239 INFO (jetty-launcher-21924-thread-2) [ ] o.a.s.s.SolrDispatchFilter |___/\___/_|_| Start time: 2019-06-07T05:53:46.414Z
[junit4] 2> 4279239 ERROR (jetty-launcher-21924-thread-3) [ ] o.a.s.u.StartupLoggingUtils Missing Java Option solr.log.dir. Logging may be missing or incomplete.
[junit4] 2> 4279239 INFO (jetty-launcher-21924-thread-3) [ ] o.a.s.s.SolrDispatchFilter Using logger factory org.apache.logging.slf4j.Log4jLoggerFactory
[junit4] 2> 4279239 INFO (jetty-launcher-21924-thread-3) [ ] o.a.s.s.SolrDispatchFilter ___ _ Welcome to Apache Solr? version 8.2.0
[junit4] 2> 4279239 INFO (jetty-launcher-21924-thread-3) [ ] o.a.s.s.SolrDispatchFilter / __| ___| |_ _ Starting in cloud mode on port null
[junit4] 2> 4279239 INFO (jetty-launcher-21924-thread-3) [ ] o.a.s.s.SolrDispatchFilter \__ \/ _ \ | '_| Install dir: null
[junit4] 2> 4279239 INFO (jetty-launcher-21924-thread-3) [ ] o.a.s.s.SolrDispatchFilter |___/\___/_|_| Start time: 2019-06-07T05:53:46.414Z
[junit4] 2> 4279240 INFO (jetty-launcher-21924-thread-2) [ ] o.a.s.c.c.ConnectionManager Waiting for client to connect to ZooKeeper
[junit4] 2> 4279240 INFO (jetty-launcher-21924-thread-3) [ ] o.a.s.c.c.ConnectionManager Waiting for client to connect to ZooKeeper
[junit4] 2> 4279241 INFO (jetty-launcher-21924-thread-1) [ ] o.a.s.c.c.ConnectionManager Waiting for client to connect to ZooKeeper
[junit4] 2> 4279242 INFO (zkConnectionManagerCallback-21930-thread-1) [ ] o.a.s.c.c.ConnectionManager zkClient has connected
[junit4] 2> 4279242 INFO (jetty-launcher-21924-thread-3) [ ] o.a.s.c.c.ConnectionManager Client is connected to ZooKeeper
[junit4] 2> 4279242 INFO (zkConnectionManagerCallback-21926-thread-1) [ ] o.a.s.c.c.ConnectionManager zkClient has connected
[junit4] 2> 4279242 INFO (jetty-launcher-21924-thread-2) [ ] o.a.s.c.c.ConnectionManager Client is connected to ZooKeeper
[junit4] 2> 4279242 INFO (zkConnectionManagerCallback-21928-thread-1) [ ] o.a.s.c.c.ConnectionManager zkClient has connected
[junit4] 2> 4279242 INFO (jetty-launcher-21924-thread-1) [ ] o.a.s.c.c.ConnectionManager Client is connected to ZooKeeper
[junit4] 2> 4279242 INFO (jetty-launcher-21924-thread-3) [ ] o.a.s.s.SolrDispatchFilter solr.xml found in ZooKeeper. Loading...
[junit4] 2> 4279243 INFO (jetty-launcher-21924-thread-2) [ ] o.a.s.s.SolrDispatchFilter solr.xml found in ZooKeeper. Loading...
[junit4] 2> 4279248 INFO (jetty-launcher-21924-thread-3) [ ] o.a.s.c.SolrXmlConfig Configuration parameter autoReplicaFailoverWorkLoopDelay is ignored
[junit4] 2> 4279248 INFO (jetty-launcher-21924-thread-2) [ ] o.a.s.c.SolrXmlConfig Configuration parameter autoReplicaFailoverWorkLoopDelay is ignored
[junit4] 2> 4279248 INFO (jetty-launcher-21924-thread-2) [ ] o.a.s.c.SolrXmlConfig Configuration parameter autoReplicaFailoverBadNodeExpiration is ignored
[junit4] 2> 4279248 INFO (jetty-launcher-21924-thread-3) [ ] o.a.s.c.SolrXmlConfig Configuration parameter autoReplicaFailoverBadNodeExpiration is ignored
[junit4] 2> 4279248 INFO (jetty-launcher-21924-thread-1) [ ] o.a.s.s.SolrDispatchFilter solr.xml found in ZooKeeper. Loading...
[junit4] 2> 4279250 INFO (jetty-launcher-21924-thread-3) [ ] o.a.s.c.SolrXmlConfig MBean server found: com.sun.jmx.mbeanserver.JmxMBeanServer@7d5b8ed, but no JMX reporters were configured - adding default JMX reporter.
[junit4] 2> 4279250 INFO (jetty-launcher-21924-thread-2) [ ] o.a.s.c.SolrXmlConfig MBean server found: com.sun.jmx.mbeanserver.JmxMBeanServer@7d5b8ed, but no JMX reporters were configured - adding default JMX reporter.
[junit4] 2> 4279252 INFO (jetty-launcher-21924-thread-1) [ ] o.a.s.c.SolrXmlConfig Configuration parameter autoReplicaFailoverWorkLoopDelay is ignored
[junit4] 2> 4279252 INFO (jetty-launcher-21924-thread-1) [ ] o.a.s.c.SolrXmlConfig Configuration parameter autoReplicaFailoverBadNodeExpiration is ignored
[junit4] 2> 4279254 INFO (jetty-launcher-21924-thread-1) [ ] o.a.s.c.SolrXmlConfig MBean server found: com.sun.jmx.mbeanserver.JmxMBeanServer@7d5b8ed, but no JMX reporters were configured - adding default JMX reporter.
[junit4] 2> 4279472 INFO (jetty-launcher-21924-thread-2) [ ] o.a.s.h.c.HttpShardHandlerFactory Host whitelist initialized: WhitelistHostChecker [whitelistHosts=null, whitelistHostCheckingEnabled=true]
[junit4] 2> 4279473 WARN (jetty-launcher-21924-thread-2) [ ] o.a.s.c.s.i.Http2SolrClient Create Http2SolrClient with HTTP/1.1 transport since Java 8 or lower versions does not support SSL + HTTP/2
[junit4] 2> 4279474 WARN (jetty-launcher-21924-thread-2) [ ] o.e.j.u.s.S.config No Client EndPointIdentificationAlgorithm configured for SslContextFactory@fd7efb8[provider=null,keyStore=null,trustStore=null]
[junit4] 2> 4279477 WARN (jetty-launcher-21924-thread-2) [ ] o.a.s.c.s.i.Http2SolrClient Create Http2SolrClient with HTTP/1.1 transport since Java 8 or lower versions does not support SSL + HTTP/2
[junit4] 2> 4279478 WARN (jetty-launcher-21924-thread-2) [ ] o.e.j.u.s.S.config No Client EndPointIdentificationAlgorithm configured for SslContextFactory@6ada4479[provider=null,keyStore=null,trustStore=null]
[junit4] 2> 4279479 INFO (jetty-launcher-21924-thread-2) [ ] o.a.s.c.ZkContainer Zookeeper client=127.0.0.1:34844/solr
[junit4] 2> 4279480 INFO (jetty-launcher-21924-thread-2) [ ] o.a.s.c.c.ConnectionManager Waiting for client to connect to ZooKeeper
[junit4] 2> 4279481 INFO (zkConnectionManagerCallback-21939-thread-1) [ ] o.a.s.c.c.ConnectionManager zkClient has connected
[junit4] 2> 4279481 INFO (jetty-launcher-21924-thread-2) [ ] o.a.s.c.c.ConnectionManager Client is connected to ZooKeeper
[junit4] 2> 4279584 INFO (jetty-launcher-21924-thread-2) [n:127.0.0.1:36309_solr ] o.a.s.c.c.ConnectionManager Waiting for client to connect to ZooKeeper
[junit4] 2> 4279585 INFO (zkConnectionManagerCallback-21941-thread-1) [ ] o.a.s.c.c.ConnectionManager zkClient has connected
[junit4] 2> 4279585 INFO (jetty-launcher-21924-thread-2) [n:127.0.0.1:36309_solr ] o.a.s.c.c.ConnectionManager Client is connected to ZooKeeper
[junit4] 2> 4279680 INFO (jetty-launcher-21924-thread-2) [n:127.0.0.1:36309_solr ] o.a.s.c.OverseerElectionContext I am going to be the leader 127.0.0.1:36309_solr
[junit4] 2> 4279681 INFO (jetty-launcher-21924-thread-2) [n:127.0.0.1:36309_solr ] o.a.s.c.Overseer Overseer (id=73435264012779527-127.0.0.1:36309_solr-n_0000000000) starting
[junit4] 2> 4279689 INFO (jetty-launcher-21924-thread-2) [n:127.0.0.1:36309_solr ] o.a.s.c.c.ConnectionManager Waiting for client to connect to ZooKeeper
[junit4] 2> 4279690 INFO (zkConnectionManagerCallback-21948-thread-1) [ ] o.a.s.c.c.ConnectionManager zkClient has connected
[junit4] 2> 4279690 INFO (jetty-launcher-21924-thread-2) [n:127.0.0.1:36309_solr ] o.a.s.c.c.ConnectionManager Client is connected to ZooKeeper
[junit4] 2> 4279693 INFO (jetty-launcher-21924-thread-2) [n:127.0.0.1:36309_solr ] o.a.s.c.s.i.ZkClientClusterStateProvider Cluster at 127.0.0.1:34844/solr ready
[junit4] 2> 4279695 INFO (jetty-launcher-21924-thread-2) [n:127.0.0.1:36309_solr ] o.a.s.c.ZkController Register node as live in ZooKeeper:/live_nodes/127.0.0.1:36309_solr
[junit4] 2> 4279695 INFO (OverseerStateUpdate-73435264012779527-127.0.0.1:36309_solr-n_0000000000) [n:127.0.0.1:36309_solr ] o.a.s.c.Overseer Starting to work on the main queue : 127.0.0.1:36309_solr
[junit4] 2> 4279698 INFO (zkCallback-21947-thread-1) [ ] o.a.s.c.c.ZkStateReader Updated live nodes from ZooKeeper... (0) -> (1)
[junit4] 2> 4279703 INFO (jetty-launcher-21924-thread-3) [ ] o.a.s.h.c.HttpShardHandlerFactory Host whitelist initialized: WhitelistHostChecker [whitelistHosts=null, whitelistHostCheckingEnabled=true]
[junit4] 2> 4279703 WARN (jetty-launcher-21924-thread-3) [ ] o.a.s.c.s.i.Http2SolrClient Create Http2SolrClient with HTTP/1.1 transport since Java 8 or lower versions does not support SSL + HTTP/2
[junit4] 2> 4279704 WARN (jetty-launcher-21924-thread-3) [ ] o.e.j.u.s.S.config No Client EndPointIdentificationAlgorithm configured for SslContextFactory@5ab159db[provider=null,keyStore=null,trustStore=null]
[junit4] 2> 4279706 INFO (OverseerStateUpdate-73435264012779527-127.0.0.1:36309_solr-n_0000000000) [n:127.0.0.1:36309_solr ] o.a.s.c.c.ZkStateReader Updated live nodes from ZooKeeper... (0) -> (1)
[junit4] 2> 4279707 INFO (jetty-launcher-21924-thread-1) [ ] o.a.s.h.c.HttpShardHandlerFactory Host whitelist initialized: WhitelistHostChecker [whitelistHosts=null, whitelistHostCheckingEnabled=true]
[junit4] 2> 4279708 WARN (jetty-launcher-21924-thread-1) [ ] o.a.s.c.s.i.Http2SolrClient Create Http2SolrClient with HTTP/1.1 transport since Java 8 or lower versions does not support SSL + HTTP/2
[junit4] 2> 4279710 WARN (jetty-launcher-21924-thread-3) [ ] o.a.s.c.s.i.Http2SolrClient Create Http2SolrClient with HTTP/1.1 transport since Java 8 or lower versions does not support SSL + HTTP/2
[junit4] 2> 4279711 WARN (jetty-launcher-21924-thread-1) [ ] o.e.j.u.s.S.config No Client EndPointIdentificationAlgorithm configured for SslContextFactory@35b60d12[provider=null,keyStore=null,trustStore=null]
[junit4] 2> 4279712 WARN (jetty-launcher-21924-thread-3) [ ] o.e.j.u.s.S.config No Client EndPointIdentificationAlgorithm configured for SslContextFactory@480967d6[provider=null,keyStore=null,trustStore=null]
[junit4] 2> 4279713 INFO (jetty-launcher-21924-thread-3) [ ] o.a.s.c.ZkContainer Zookeeper client=127.0.0.1:34844/solr
[junit4] 2> 4279716 WARN (jetty-launcher-21924-thread-1) [ ] o.a.s.c.s.i.Http2SolrClient Create Http2SolrClient with HTTP/1.1 transport since Java 8 or lower versions does not support SSL + HTTP/2
[junit4] 2> 4279717 INFO (jetty-launcher-21924-thread-3) [ ] o.a.s.c.c.ConnectionManager Waiting for client to connect to ZooKeeper
[junit4] 2> 4279718 WARN (jetty-launcher-21924-thread-1) [ ] o.e.j.u.s.S.config No Client EndPointIdentificationAlgorithm configured for SslContextFactory@34541037[provider=null,keyStore=null,trustStore=null]
[junit4] 2> 4279718 INFO (zkConnectionManagerCallback-21956-thread-1) [ ] o.a.s.c.c.ConnectionManager zkClient has connected
[junit4] 2> 4279718 INFO (jetty-launcher-21924-thread-3) [ ] o.a.s.c.c.ConnectionManager Client is connected to ZooKeeper
[junit4] 2> 4279719 INFO (jetty-launcher-21924-thread-1) [ ] o.a.s.c.ZkContainer Zookeeper client=127.0.0.1:34844/solr
[junit4] 2> 4279720 INFO (jetty-launcher-21924-thread-1) [ ] o.a.s.c.c.ConnectionManager Waiting for client to connect to ZooKeeper
[junit4] 2> 4279722 INFO (zkConnectionManagerCallback-21960-thread-1) [ ] o.a.s.c.c.ConnectionManager zkClient has connected
[junit4] 2> 4279722 INFO (jetty-launcher-21924-thread-1) [ ] o.a.s.c.c.ConnectionManager Client is connected to ZooKeeper
[junit4] 2> 4279725 INFO (jetty-launcher-21924-thread-2) [n:127.0.0.1:36309_solr ] o.a.s.h.a.MetricsHistoryHandler No .system collection, keeping metrics history in memory.
[junit4] 2> 4279752 INFO (jetty-launcher-21924-thread-2) [n:127.0.0.1:36309_solr ] o.a.s.m.r.SolrJmxReporter JMX monitoring for 'solr.node' (registry 'solr.node') enabled at server: com.sun.jmx.mbeanserver.JmxMBeanServer@7d5b8ed
[junit4] 2> 4279766 INFO (jetty-launcher-21924-thread-2) [n:127.0.0.1:36309_solr ] o.a.s.m.r.SolrJmxReporter JMX monitoring for 'solr.jvm' (registry 'solr.jvm') enabled at server: com.sun.jmx.mbeanserver.JmxMBeanServer@7d5b8ed
[junit4] 2> 4279766 INFO (jetty-launcher-21924-thread-2) [n:127.0.0.1:36309_solr ] o.a.s.m.r.SolrJmxReporter JMX monitoring for 'solr.jetty' (registry 'solr.jetty') enabled at server: com.sun.jmx.mbeanserver.JmxMBeanServer@7d5b8ed
[junit4] 2> 4279767 INFO (jetty-launcher-21924-thread-2) [n:127.0.0.1:36309_solr ] o.a.s.c.CorePropertiesLocator Found 0 core definitions underneath /x1/jenkins/jenkins-slave/workspace/Lucene-Solr-NightlyTests-8.x/checkout/solr/build/solr-core/test/J2/temp/solr.cloud.autoscaling.HdfsAutoAddReplicasIntegrationTest_2DB99868DD93FE30-001/tempDir-002/node2/.
[junit4] 2> 4279822 INFO (jetty-launcher-21924-thread-3) [n:127.0.0.1:38044_solr ] o.a.s.c.c.ConnectionManager Waiting for client to connect to ZooKeeper
[junit4] 2> 4279823 INFO (zkConnectionManagerCallback-21963-thread-1) [ ] o.a.s.c.c.ConnectionManager zkClient has connected
[junit4] 2> 4279823 INFO (jetty-launcher-21924-thread-3) [n:127.0.0.1:38044_solr ] o.a.s.c.c.ConnectionManager Client is connected to ZooKeeper
[junit4] 2> 4279830 INFO (jetty-launcher-21924-thread-3) [n:127.0.0.1:38044_solr ] o.a.s.c.c.ZkStateReader Updated live nodes from ZooKeeper... (0) -> (1)
[junit4] 2> 4279835 INFO (jetty-launcher-21924-thread-3) [n:127.0.0.1:38044_solr ] o.a.s.c.ZkController Publish node=127.0.0.1:38044_solr as DOWN
[junit4] 2> 4279837 INFO (jetty-launcher-21924-thread-3) [n:127.0.0.1:38044_solr ] o.a.s.c.TransientSolrCoreCacheDefault Allocating transient cache for 4 transient cores
[junit4] 2> 4279837 INFO (jetty-launcher-21924-thread-3) [n:127.0.0.1:38044_solr ] o.a.s.c.ZkController Register node as live in ZooKeeper:/live_nodes/127.0.0.1:38044_solr
[junit4] 2> 4279838 INFO (zkCallback-21940-thread-1) [ ] o.a.s.c.c.ZkStateReader Updated live nodes from ZooKeeper... (1) -> (2)
[junit4] 2> 4279839 INFO (zkCallback-21947-thread-1) [ ] o.a.s.c.c.ZkStateReader Updated live nodes from ZooKeeper... (1) -> (2)
[junit4] 2> 4279839 INFO (zkCallback-21962-thread-1) [ ] o.a.s.c.c.ZkStateReader Updated live nodes from ZooKeeper... (1) -> (2)
[junit4] 2> 4279840 INFO (jetty-launcher-21924-thread-3) [n:127.0.0.1:38044_solr ] o.a.s.c.c.ConnectionManager Waiting for client to connect to ZooKeeper
[junit4] 2> 4279842 INFO (zkConnectionManagerCallback-21970-thread-1) [ ] o.a.s.c.c.ConnectionManager zkClient has connected
[junit4] 2> 4279842 INFO (jetty-launcher-21924-thread-3) [n:127.0.0.1:38044_solr ] o.a.s.c.c.ConnectionManager Client is connected to ZooKeeper
[junit4] 2> 4279843 INFO (jetty-launcher-21924-thread-3) [n:127.0.0.1:38044_solr ] o.a.s.c.c.ZkStateReader Updated live nodes from ZooKeeper... (0) -> (2)
[junit4] 2> 4279845 INFO (jetty-launcher-21924-thread-3) [n:127.0.0.1:38044_solr ] o.a.s.c.s.i.ZkClientClusterStateProvider Cluster at 127.0.0.1:34844/solr ready
[junit4] 2> 4279871 INFO (jetty-launcher-21924-thread-3) [n:127.0.0.1:38044_solr ] o.a.s.h.a.MetricsHistoryHandler No .system collection, keeping metrics history in memory.
[junit4] 2> 4279900 INFO (jetty-launcher-21924-thread-3) [n:127.0.0.1:38044_solr ] o.a.s.m.r.SolrJmxReporter JMX monitoring for 'solr.node' (registry 'solr.node') enabled at server: com.sun.jmx.mbeanserver.JmxMBeanServer@7d5b8ed
[junit4] 2> 4279917 INFO (jetty-launcher-21924-thread-3) [n:127.0.0.1:38044_solr ] o.a.s.m.r.SolrJmxReporter JMX monitoring for 'solr.jvm' (registry 'solr.jvm') enabled at server: com.sun.jmx.mbeanserver.JmxMBeanServer@7d5b8ed
[junit4] 2> 4279917 INFO (jetty-launcher-21924-thread-3) [n:127.0.0.1:38044_solr ] o.a.s.m.r.SolrJmxReporter JMX monitoring for 'solr.jetty' (registry 'solr.jetty') enabled at server: com.sun.jmx.mbeanserver.JmxMBeanServer@7d5b8ed
[junit4] 2> 4279919 INFO (jetty-launcher-21924-thread-3) [n:127.0.0.1:38044_solr ] o.a.s.c.CorePropertiesLocator Found 0 core definitions underneath /x1/jenkins/jenkins-slave/workspace/Lucene-Solr-NightlyTests-8.x/checkout/solr/build/solr-core/test/J2/temp/solr.cloud.autoscaling.HdfsAutoAddReplicasIntegrationTest_2DB99868DD93FE30-001/tempDir-002/node3/.
[junit4] 2> 4279923 INFO (jetty-launcher-21924-thread-1) [n:127.0.0.1:43678_solr ] o.a.s.c.c.ConnectionManager Waiting for client to connect to ZooKeeper
[junit4] 2> 4279923 INFO (zkConnectionManagerCallback-21973-thread-1) [ ] o.a.s.c.c.ConnectionManager zkClient has connected
[junit4] 2> 4279923 INFO (jetty-launcher-21924-thread-1) [n:127.0.0.1:43678_solr ] o.a.s.c.c.ConnectionManager Client is connected to ZooKeeper
[junit4] 2> 4279934 INFO (jetty-launcher-21924-thread-1) [n:127.0.0.1:43678_solr ] o.a.s.c.c.ZkStateReader Updated live nodes from ZooKeeper... (0) -> (2)
[junit4] 2> 4279941 INFO (jetty-launcher-21924-thread-1) [n:127.0.0.1:43678_solr ] o.a.s.c.ZkController Publish node=127.0.0.1:43678_solr as DOWN
[junit4] 2> 4279942 INFO (jetty-launcher-21924-thread-1) [n:127.0.0.1:43678_solr ] o.a.s.c.TransientSolrCoreCacheDefault Allocating transient cache for 4 transient cores
[junit4] 2> 4279942 INFO (jetty-launcher-21924-thread-1) [n:127.0.0.1:43678_solr ] o.a.s.c.ZkController Register node as live in ZooKeeper:/live_nodes/127.0.0.1:43678_solr
[junit4] 2> 4279944 INFO (zkCallback-21947-thread-1) [ ] o.a.s.c.c.ZkStateReader Updated live nodes from ZooKeeper... (2) -> (3)
[junit4] 2> 4279944 INFO (zkCallback-21940-thread-1) [ ] o.a.s.c.c.ZkStateReader Updated live nodes from ZooKeeper... (2) -> (3)
[junit4] 2> 4279945 INFO (zkCallback-21962-thread-1) [ ] o.a.s.c.c.ZkStateReader Updated live nodes from ZooKeeper... (2) -> (3)
[junit4] 2> 4279946 INFO (zkCallback-21972-thread-1) [ ] o.a.s.c.c.ZkStateReader Updated live nodes from ZooKeeper... (2) -> (3)
[junit4] 2> 4279948 INFO (jetty-launcher-21924-thread-1) [n:127.0.0.1:43678_solr ] o.a.s.c.c.ConnectionManager Waiting for client to connect to ZooKeeper
[junit4] 2> 4279949 INFO (zkConnectionManagerCallback-21980-thread-1) [ ] o.a.s.c.c.ConnectionManager zkClient has connected
[junit4] 2> 4279949 INFO (jetty-launcher-21924-thread-1) [n:127.0.0.1:43678_solr ] o.a.s.c.c.ConnectionManager Client is connected to ZooKeeper
[junit4] 2> 4279951 INFO (jetty-launcher-21924-thread-1) [n:127.0.0.1:43678_solr ] o.a.s.c.c.ZkStateReader Updated live nodes from ZooKeeper... (0) -> (3)
[junit4] 2> 4279952 INFO (jetty-launcher-21924-thread-1) [n:127.0.0.1:43678_solr ] o.a.s.c.s.i.ZkClientClusterStateProvider Cluster at 127.0.0.1:34844/solr ready
[junit4] 2> 4279958 INFO (zkCallback-21969-thread-1) [ ] o.a.s.c.c.ZkStateReader Updated live nodes from ZooKeeper... (2) -> (3)
[junit4] 2> 4279984 INFO (jetty-launcher-21924-thread-1) [n:127.0.0.1:43678_solr ] o.a.s.h.a.MetricsHistoryHandler No .system collection, keeping metrics history in memory.
[junit4] 2> 4280015 INFO (jetty-launcher-21924-thread-1) [n:127.0.0.1:43678_solr ] o.a.s.m.r.SolrJmxReporter JMX monitoring for 'solr.node' (registry 'solr.node') enabled at server: com.sun.jmx.mbeanserver.JmxMBeanServer@7d5b8ed
[junit4] 2> 4280033 INFO (jetty-launcher-21924-thread-1) [n:127.0.0.1:43678_solr ] o.a.s.m.r.SolrJmxReporter JMX monitoring for 'solr.jvm' (registry 'solr.jvm') enabled at server: com.sun.jmx.mbeanserver.JmxMBeanServer@7d5b8ed
[junit4] 2> 4280033 INFO (jetty-launcher-21924-thread-1) [n:127.0.0.1:43678_solr ] o.a.s.m.r.SolrJmxReporter JMX monitoring for 'solr.jetty' (registry 'solr.jetty') enabled at server: com.sun.jmx.mbeanserver.JmxMBeanServer@7d5b8ed
[junit4] 2> 4280038 INFO (jetty-launcher-21924-thread-1) [n:127.0.0.1:43678_solr ] o.a.s.c.CorePropertiesLocator Found 0 core definitions underneath /x1/jenkins/jenkins-slave/workspace/Lucene-Solr-NightlyTests-8.x/checkout/solr/build/solr-core/test/J2/temp/solr.cloud.autoscaling.HdfsAutoAddReplicasIntegrationTest_2DB99868DD93FE30-001/tempDir-002/node1/.
[junit4] 2> 4280096 INFO (TEST-HdfsAutoAddReplicasIntegrationTest.testSimple-seed#[2DB99868DD93FE30]) [ ] o.a.s.c.c.ConnectionManager Waiting for client to connect to ZooKeeper
[junit4] 2> 4280097 INFO (zkConnectionManagerCallback-21986-thread-1) [ ] o.a.s.c.c.ConnectionManager zkClient has connected
[junit4] 2> 4280097 INFO (TEST-HdfsAutoAddReplicasIntegrationTest.testSimple-seed#[2DB99868DD93FE30]) [ ] o.a.s.c.c.ConnectionManager Client is connected to ZooKeeper
[junit4] 2> 4280099 INFO (TEST-HdfsAutoAddReplicasIntegrationTest.testSimple-seed#[2DB99868DD93FE30]) [ ] o.a.s.c.c.ZkStateReader Updated live nodes from ZooKeeper... (0) -> (3)
[junit4] 2> 4280101 INFO (TEST-HdfsAutoAddReplicasIntegrationTest.testSimple-seed#[2DB99868DD93FE30]) [ ] o.a.s.c.s.i.ZkClientClusterStateProvider Cluster at 127.0.0.1:34844/solr ready
[junit4] 2> 4280125 INFO (qtp229807167-124916) [n:127.0.0.1:38044_solr ] o.a.s.s.HttpSolrCall [admin] webapp=null path=/cluster params={wt=javabin&version=2} status=0 QTime=2
[junit4] 2> 4280142 INFO (qtp106664756-124926) [n:127.0.0.1:43678_solr ] o.a.s.h.a.CollectionsHandler Invoked Collection Action :create with params collection.configName=conf&maxShardsPerNode=2&autoAddReplicas=true&name=testSimple1&nrtReplicas=2&action=CREATE&numShards=2&createNodeSet=127.0.0.1:36309_solr,127.0.0.1:38044_solr&wt=javabin&version=2 and sendToOCPQueue=true
[junit4] 2> 4280152 INFO (OverseerThreadFactory-16445-thread-1-processing-n:127.0.0.1:36309_solr) [n:127.0.0.1:36309_solr ] o.a.s.c.a.c.CreateCollectionCmd Create collection testSimple1
[junit4] 2> 4280274 INFO (OverseerStateUpdate-73435264012779527-127.0.0.1:36309_solr-n_0000000000) [n:127.0.0.1:36309_solr ] o.a.s.c.o.SliceMutator createReplica() {
[junit4] 2> "operation":"ADDREPLICA",
[junit4] 2> "collection":"testSimple1",
[junit4] 2> "shard":"shard1",
[junit4] 2> "core":"testSimple1_shard1_replica_n1",
[junit4] 2> "state":"down",
[junit4] 2> "base_url":"https://127.0.0.1:36309/solr",
[junit4] 2> "type":"NRT",
[junit4] 2> "waitForFinalState":"false"}
[junit4] 2> 4280278 INFO (OverseerStateUpdate-73435264012779527-127.0.0.1:36309_solr-n_0000000000) [n:127.0.0.1:36309_solr ] o.a.s.c.o.SliceMutator createReplica() {
[junit4] 2> "operation":"ADDREPLICA",
[junit4] 2> "collection":"testSimple1",
[junit4] 2> "shard":"shard1",
[junit4] 2> "core":"testSimple1_shard1_replica_n2",
[junit4] 2> "state":"down",
[junit4] 2> "base_url":"https://127.0.0.1:38044/solr",
[junit4] 2> "type":"NRT",
[junit4] 2> "waitForFinalState":"false"}
[junit4] 2> 4280283 INFO (OverseerStateUpdate-73435264012779527-127.0.0.1:36309_solr-n_0000000000) [n:127.0.0.1:36309_solr ] o.a.s.c.o.SliceMutator createReplica() {
[junit4] 2> "operation":"ADDREPLICA",
[junit4] 2> "collection":"testSimple1",
[junit4] 2> "shard":"shard2",
[junit4] 2> "core":"testSimple1_shard2_replica_n4",
[junit4] 2> "state":"down",
[junit4] 2> "base_url":"https://127.0.0.1:36309/solr",
[junit4] 2> "type":"NRT",
[junit4] 2> "waitForFinalState":"false"}
[junit4] 2> 4280287 INFO (OverseerStateUpdate-73435264012779527-127.0.0.1:36309_solr-n_0000000000) [n:127.0.0.1:36309_solr ] o.a.s.c.o.SliceMutator createReplica() {
[junit4] 2> "operation":"ADDREPLICA",
[junit4] 2> "collection":"testSimple1",
[junit4] 2> "shard":"shard2",
[junit4] 2> "core":"testSimple1_shard2_replica_n6",
[junit4] 2> "state":"down",
[junit4] 2> "base_url":"https://127.0.0.1:38044/solr",
[junit4] 2> "type":"NRT",
[junit4] 2> "waitForFinalState":"false"}
[junit4] 2> 4280511 INFO (qtp229807167-124925) [n:127.0.0.1:38044_solr x:testSimple1_shard1_replica_n2 ] o.a.s.h.a.CoreAdminOperation core create command qt=/admin/cores&coreNodeName=core_node5&collection.configName=conf&newCollection=true&name=testSimple1_shard1_replica_n2&action=CREATE&numShards=2&collection=testSimple1&shard=shard1&wt=javabin&version=2&replicaType=NRT
[junit4] 2> 4280512 INFO (qtp229807167-124930) [n:127.0.0.1:38044_solr x:testSimple1_shard2_replica_n6 ] o.a.s.h.a.CoreAdminOperation core create command qt=/admin/cores&coreNodeName=core_node8&collection.configName=conf&newCollection=true&name=testSimple1_shard2_replica_n6&action=CREATE&numShards=2&collection=testSimple1&shard=shard2&wt=javabin&version=2&replicaType=NRT
[junit4] 2> 4280527 INFO (qtp1706487383-124927) [n:127.0.0.1:36309_solr x:testSimple1_shard2_replica_n4 ] o.a.s.h.a.CoreAdminOperation core create command qt=/admin/cores&coreNodeName=core_node7&collection.configName=conf&newCollection=true&name=testSimple1_shard2_replica_n4&action=CREATE&numShards=2&collection=testSimple1&shard=shard2&wt=javabin&version=2&replicaType=NRT
[junit4] 2> 4280527 INFO (qtp1706487383-124927) [n:127.0.0.1:36309_solr x:testSimple1_shard2_replica_n4 ] o.a.s.c.TransientSolrCoreCacheDefault Allocating transient cache for 4 transient cores
[junit4] 2> 4280532 INFO (qtp1706487383-124929) [n:127.0.0.1:36309_solr x:testSimple1_shard1_replica_n1 ] o.a.s.h.a.CoreAdminOperation core create command qt=/admin/cores&coreNodeName=core_node3&collection.configName=conf&newCollection=true&name=testSimple1_shard1_replica_n1&action=CREATE&numShards=2&collection=testSimple1&shard=shard1&wt=javabin&version=2&replicaType=NRT
[junit4] 2> 4281527 INFO (qtp229807167-124930) [n:127.0.0.1:38044_solr c:testSimple1 s:shard2 r:core_node8 x:testSimple1_shard2_replica_n6 ] o.a.s.c.SolrConfig Using Lucene MatchVersion: 8.2.0
[junit4] 2> 4281532 INFO (qtp229807167-124925) [n:127.0.0.1:38044_solr c:testSimple1 s:shard1 r:core_node5 x:testSimple1_shard1_replica_n2 ] o.a.s.c.SolrConfig Using Lucene MatchVersion: 8.2.0
[junit4] 2> 4281539 INFO (qtp229807167-124930) [n:127.0.0.1:38044_solr c:testSimple1 s:shard2 r:core_node8 x:testSimple1_shard2_replica_n6 ] o.a.s.s.IndexSchema [testSimple1_shard2_replica_n6] Schema name=minimal
[junit4] 2> 4281541 INFO (qtp1706487383-124927) [n:127.0.0.1:36309_solr c:testSimple1 s:shard2 r:core_node7 x:testSimple1_shard2_replica_n4 ] o.a.s.c.SolrConfig Using Lucene MatchVersion: 8.2.0
[junit4] 2> 4281543 INFO (qtp229807167-124925) [n:127.0.0.1:38044_solr c:testSimple1 s:shard1 r:core_node5 x:testSimple1_shard1_replica_n2 ] o.a.s.s.IndexSchema [testSimple1_shard1_replica_n2] Schema name=minimal
[junit4] 2> 4281543 INFO (qtp229807167-124930) [n:127.0.0.1:38044_solr c:testSimple1 s:shard2 r:core_node8 x:testSimple1_shard2_replica_n6 ] o.a.s.s.IndexSchema Loaded schema minimal/1.1 with uniqueid field id
[junit4] 2> 4281543 INFO (qtp229807167-124930) [n:127.0.0.1:38044_solr c:testSimple1 s:shard2 r:core_node8 x:testSimple1_shard2_replica_n6 ] o.a.s.c.CoreContainer Creating SolrCore 'testSimple1_shard2_replica_n6' using configuration from collection testSimple1, trusted=true
[junit4] 2> 4281544 INFO (qtp229807167-124930) [n:127.0.0.1:38044_solr c:testSimple1 s:shard2 r:core_node8 x:testSimple1_shard2_replica_n6 ] o.a.s.m.r.SolrJmxReporter JMX monitoring for 'solr.core.testSimple1.shard2.replica_n6' (registry 'solr.core.testSimple1.shard2.replica_n6') enabled at server: com.sun.jmx.mbeanserver.JmxMBeanServer@7d5b8ed
[junit4] 2> 4281544 INFO (qtp229807167-124930) [n:127.0.0.1:38044_solr c:testSimple1 s:shard2 r:core_node8 x:testSimple1_shard2_replica_n6 ] o.a.s.c.HdfsDirectoryFactory solr.hdfs.home=hdfs://localhost:36531/solr_hdfs_home
[junit4] 2> 4281544 INFO (qtp229807167-124930) [n:127.0.0.1:38044_solr c:testSimple1 s:shard2 r:core_node8 x:testSimple1_shard2_replica_n6 ] o.a.s.c.HdfsDirectoryFactory Solr Kerberos Authentication disabled
[junit4] 2> 4281544 INFO (qtp229807167-124930) [n:127.0.0.1:38044_solr c:testSimple1 s:shard2 r:core_node8 x:testSimple1_shard2_replica_n6 ] o.a.s.c.SolrCore [[testSimple1_shard2_replica_n6] ] Opening new SolrCore at [/x1/jenkins/jenkins-slave/workspace/Lucene-Solr-NightlyTests-8.x/checkout/solr/build/solr-core/test/J2/temp/solr.cloud.autoscaling.HdfsAutoAddReplicasIntegrationTest_2DB99868DD93FE30-001/tempDir-002/node3/testSimple1_shard2_replica_n6], dataDir=[hdfs://localhost:36531/solr_hdfs_home/testSimple1/core_node8/data/]
[junit4] 2> 4281545 INFO (qtp229807167-124925) [n:127.0.0.1:38044_solr c:testSimple1 s:shard1 r:core_node5 x:testSimple1_shard1_replica_n2 ] o.a.s.s.IndexSchema Loaded schema minimal/1.1 with uniqueid field id
[junit4] 2> 4281545 INFO (qtp229807167-124925) [n:127.0.0.1:38044_solr c:testSimple1 s:shard1 r:core_node5 x:testSimple1_shard1_replica_n2 ] o.a.s.c.CoreContainer Creating SolrCore 'testSimple1_shard1_replica_n2' using configuration from collection testSimple1, trusted=true
[junit4] 2> 4281546 INFO (qtp229807167-124930) [n:127.0.0.1:38044_solr c:testSimple1 s:shard2 r:core_node8 x:testSimple1_shard2_replica_n6 ] o.a.s.c.HdfsDirectoryFactory creating directory factory for path hdfs://localhost:36531/solr_hdfs_home/testSimple1/core_node8/data/snapshot_metadata
[junit4] 2> 4281546 INFO (qtp229807167-124925) [n:127.0.0.1:38044_solr c:testSimple1 s:shard1 r:core_node5 x:testSimple1_shard1_replica_n2 ] o.a.s.m.r.SolrJmxReporter JMX monitoring for 'solr.core.testSimple1.shard1.replica_n2' (registry 'solr.core.testSimple1.shard1.replica_n2') enabled at server: com.sun.jmx.mbeanserver.JmxMBeanServer@7d5b8ed
[junit4] 2> 4281546 INFO (qtp229807167-124925) [n:127.0.0.1:38044_solr c:testSimple1 s:shard1 r:core_node5 x:testSimple1_shard1_replica_n2 ] o.a.s.c.HdfsDirectoryFactory solr.hdfs.home=hdfs://localhost:36531/solr_hdfs_home
[junit4] 2> 4281546 INFO (qtp229807167-124925) [n:127.0.0.1:38044_solr c:testSimple1 s:shard1 r:core_node5 x:testSimple1_shard1_replica_n2 ] o.a.s.c.HdfsDirectoryFactory Solr Kerberos Authentication disabled
[junit4] 2> 4281546 INFO (qtp229807167-124925) [n:127.0.0.1:38044_solr c:testSimple1 s:shard1 r:core_node5 x:testSimple1_shard1_replica_n2 ] o.a.s.c.SolrCore [[testSimple1_shard1_replica_n2] ] Opening new SolrCore at [/x1/jenkins/jenkins-slave/workspace/Lucene-Solr-NightlyTests-8.x/checkout/solr/build/solr-core/test/J2/temp/solr.cloud.autoscaling.HdfsAutoAddReplicasIntegrationTest_2DB99868DD93FE30-001/tempDir-002/node3/testSimple1_shard1_replica_n2], dataDir=[hdfs://localhost:36531/solr_hdfs_home/testSimple1/core_node5/data/]
[junit4] 2> 4281548 INFO (qtp229807167-124925) [n:127.0.0.1:38044_solr c:testSimple1 s:shard1 r:core_node5 x:testSimple1_shard1_replica_n2 ] o.a.s.c.HdfsDirectoryFactory creating directory factory for path hdfs://localhost:36531/solr_hdfs_home/testSimple1/core_node5/data/snapshot_metadata
[junit4] 2> 4281550 INFO (qtp1706487383-124929) [n:127.0.0.1:36309_solr c:testSimple1 s:shard1 r:core_node3 x:testSimple1_shard1_replica_n1 ] o.a.s.c.SolrConfig Using Lucene MatchVersion: 8.2.0
[junit4] 2> 4281556 INFO (qtp229807167-124925) [n:127.0.0.1:38044_solr c:testSimple1 s:shard1 r:core_node5 x:testSimple1_shard1_replica_n2 ] o.a.s.c.HdfsDirectoryFactory Number of slabs of block cache [1] with direct memory allocation set to [true]
[junit4] 2> 4281556 INFO (qtp229807167-124930) [n:127.0.0.1:38044_solr c:testSimple1 s:shard2 r:core_node8 x:testSimple1_shard2_replica_n6 ] o.a.s.c.HdfsDirectoryFactory Number of slabs of block cache [1] with direct memory allocation set to [true]
[junit4] 2> 4281556 INFO (qtp229807167-124925) [n:127.0.0.1:38044_solr c:testSimple1 s:shard1 r:core_node5 x:testSimple1_shard1_replica_n2 ] o.a.s.c.HdfsDirectoryFactory Block cache target memory usage, slab size of [33554432] will allocate [1] slabs and use ~[33554432] bytes
[junit4] 2> 4281556 INFO (qtp229807167-124930) [n:127.0.0.1:38044_solr c:testSimple1 s:shard2 r:core_node8 x:testSimple1_shard2_replica_n6 ] o.a.s.c.HdfsDirectoryFactory Block cache target memory usage, slab size of [33554432] will allocate [1] slabs and use ~[33554432] bytes
[junit4] 2> 4281573 INFO (qtp229807167-124930) [n:127.0.0.1:38044_solr c:testSimple1 s:shard2 r:core_node8 x:testSimple1_shard2_replica_n6 ] o.a.s.s.b.BlockDirectory Block cache on write is disabled
[junit4] 2> 4281574 INFO (qtp229807167-124925) [n:127.0.0.1:38044_solr c:testSimple1 s:shard1 r:core_node5 x:testSimple1_shard1_replica_n2 ] o.a.s.s.b.BlockDirectory Block cache on write is disabled
[junit4] 2> 4281575 INFO (qtp229807167-124925) [n:127.0.0.1:38044_solr c:testSimple1 s:shard1 r:core_node5 x:testSimple1_shard1_replica_n2 ] o.a.s.c.HdfsDirectoryFactory creating directory factory for path hdfs://localhost:36531/solr_hdfs_home/testSimple1/core_node5/data
[junit4] 2> 4281575 INFO (qtp229807167-124930) [n:127.0.0.1:38044_solr c:testSimple1 s:shard2 r:core_node8 x:testSimple1_shard2_replica_n6 ] o.a.s.c.HdfsDirectoryFactory creating directory factory for path hdfs://localhost:36531/solr_hdfs_home/testSimple1/core_node8/data
[junit4] 2> 4281576 INFO (qtp1706487383-124929) [n:127.0.0.1:36309_solr c:testSimple1 s:shard1 r:core_node3 x:testSimple1_shard1_replica_n1 ] o.a.s.s.IndexSchema [testSimple1_shard1_replica_n1] Schema name=minimal
[junit4] 2> 4281577 INFO (qtp1706487383-124927) [n:127.0.0.1:36309_solr c:testSimple1 s:shard2 r:core_node7 x:testSimple1_shard2_replica_n4 ] o.a.s.s.IndexSchema [testSimple1_shard2_replica_n4] Schema name=minimal
[junit4] 2> 4281580 INFO (qtp1706487383-124929) [n:127.0.0.1:36309_solr c:testSimple1 s:shard1 r:core_node3 x:testSimple1_shard1_replica_n1 ] o.a.s.s.IndexSchema Loaded schema minimal/1.1 with uniqueid field id
[junit4] 2> 4281580 INFO (qtp1706487383-124929) [n:127.0.0.1:36309_solr c:testSimple1 s:shard1 r:core_node3 x:testSimple1_shard1_replica_n1 ] o.a.s.c.CoreContainer Creating SolrCore 'testSimple1_shard1_replica_n1' using configuration from collection testSimple1, trusted=true
[junit4] 2> 4281580 INFO (qtp1706487383-124929) [n:127.0.0.1:36309_solr c:testSimple1 s:shard1 r:core_node3 x:testSimple1_shard1_replica_n1 ] o.a.s.m.r.SolrJmxReporter JMX monitoring for 'solr.core.testSimple1.shard1.replica_n1' (registry 'solr.core.testSimple1.shard1.replica_n1') enabled at server: com.sun.jmx.mbeanserver.JmxMBeanServer@7d5b8ed
[junit4] 2> 4281580 INFO (qtp1706487383-124927) [n:127.0.0.1:36309_solr c:testSimple1 s:shard2 r:core_node7 x:testSimple1_shard2_replica_n4 ] o.a.s.s.IndexSchema Loaded schema minimal/1.1 with uniqueid field id
[junit4] 2> 4281580 INFO (qtp1706487383-124927) [n:127.0.0.1:36309_solr c:testSimple1 s:shard2 r:core_node7 x:testSimple1_shard2_replica_n4 ] o.a.s.c.CoreContainer Creating SolrCore 'testSimple1_shard2_replica_n4' using configuration from collection testSimple1, trusted=true
[junit4] 2> 4281580 INFO (qtp1706487383-124929) [n:127.0.0.1:36309_solr c:testSimple1 s:shard1 r:core_node3 x:testSimple1_shard1_replica_n1 ] o.a.s.c.HdfsDirectoryFactory solr.hdfs.home=hdfs://localhost:36531/solr_hdfs_home
[junit4] 2> 4281581 INFO (qtp1706487383-124927) [n:127.0.0.1:36309_solr c:testSimple1 s:shard2 r:core_node7 x:testSimple1_shard2_replica_n4 ] o.a.s.m.r.SolrJmxReporter JMX monitoring for 'solr.core.testSimple1.shard2.replica_n4' (registry 'solr.core.testSimple1.shard2.replica_n4') enabled at server: com.sun.jmx.mbeanserver.JmxMBeanServer@7d5b8ed
[junit4] 2> 4281581 INFO (qtp1706487383-124929) [n:127.0.0.1:36309_solr c:testSimple1 s:shard1 r:core_node3 x:testSimple1_shard1_replica_n1 ] o.a.s.c.HdfsDirectoryFactory Solr Kerberos Authentication disabled
[junit4] 2> 4281581 INFO (qtp1706487383-124927) [n:127.0.0.1:36309_solr c:testSimple1 s:shard2 r:core_node7 x:testSimple1_shard2_replica_n4 ] o.a.s.c.HdfsDirectoryFactory solr.hdfs.home=hdfs://localhost:36531/solr_hdfs_home
[junit4] 2> 4281581 INFO (qtp1706487383-124927) [n:127.0.0.1:36309_solr c:testSimple1 s:shard2 r:core_node7 x:testSimple1_shard2_replica_n4 ] o.a.s.c.HdfsDirectoryFactory Solr Kerberos Authentication disabled
[junit4] 2> 4281581 INFO (qtp1706487383-124929) [n:127.0.0.1:36309_solr c:testSimple1 s:shard1 r:core_node3 x:testSimple1_shard1_replica_n1 ] o.a.s.c.SolrCore [[testSimple1_shard1_replica_n1] ] Opening new SolrCore at [/x1/jenkins/jenkins-slave/workspace/Lucene-Solr-NightlyTests-8.x/checkout/solr/build/solr-core/test/J2/temp/solr.cloud.autoscaling.HdfsAutoAddReplicasIntegrationTest_2DB99868DD93FE30-001/tempDir-002/node2/testSimple1_shard1_replica_n1], dataDir=[hdfs://localhost:36531/solr_hdfs_home/testSimple1/core_node3/data/]
[junit4] 2> 4281581 INFO (qtp1706487383-124927) [n:127.0.0.1:36309_solr c:testSimple1 s:shard2 r:core_node7 x:testSimple1_shard2_replica_n4 ] o.a.s.c.SolrCore [[testSimple1_shard2_replica_n4] ] Opening new SolrCore at [/x1/jenkins/jenkins-slave/workspace/Lucene-Solr-NightlyTests-8.x/checkout/solr/build/solr-core/test/J2/temp/solr.cloud.autoscaling.HdfsAutoAddReplicasIntegrationTest_2DB99868DD93FE30-001/tempDir-002/node2/testSimple1_shard2_replica_n4], dataDir=[hdfs://localhost:36531/solr_hdfs_home/testSimple1/core_node7/data/]
[junit4] 2> 4281583 INFO (qtp1706487383-124929) [n:127.0.0.1:36309_solr c:testSimple1 s:shard1 r:core_node3 x:testSimple1_shard1_replica_n1 ] o.a.s.c.HdfsDirectoryFactory creating directory factory for path hdfs://localhost:36531/solr_hdfs_home/testSimple1/core_node3/data/snapshot_metadata
[junit4] 2> 4281583 INFO (qtp1706487383-124927) [n:127.0.0.1:36309_solr c:testSimple1 s:shard2 r:core_node7 x:testSimple1_shard2_replica_n4 ] o.a.s.c.HdfsDirectoryFactory creating directory factory for path hdfs://localhost:36531/solr_hdfs_home/testSimple1/core_node7/data/snapshot_metadata
[junit4] 2> 4281590 INFO (qtp1706487383-124927) [n:127.0.0.1:36309_solr c:testSimple1 s:shard2 r:core_node7 x:testSimple1_shard2_replica_n4 ] o.a.s.c.HdfsDirectoryFactory Number of slabs of block cache [1] with direct memory allocation set to [true]
[junit4] 2> 4281590 INFO (qtp1706487383-124927) [n:127.0.0.1:36309_solr c:testSimple1 s:shard2 r:core_node7 x:testSimple1_shard2_replica_n4 ] o.a.s.c.HdfsDirectoryFactory Block cache target memory usage, slab size of [33554432] will allocate [1] slabs and use ~[33554432] bytes
[junit4] 2> 4281591 INFO (qtp1706487383-124929) [n:127.0.0.1:36309_solr c:testSimple1 s:shard1 r:core_node3 x:testSimple1_shard1_replica_n1 ] o.a.s.c.HdfsDirectoryFactory Number of slabs of block cache [1] with direct memory allocation set to [true]
[junit4] 2> 4281591 INFO (qtp1706487383-124929) [n:127.0.0.1:36309_solr c:testSimple1 s:shard1 r:core_node3 x:testSimple1_shard1_replica_n1 ] o.a.s.c.HdfsDirectoryFactory Block cache target memory usage, slab size of [33554432] will allocate [1] slabs and use ~[33554432] bytes
[junit4] 2> 4281593 INFO (qtp1706487383-124927) [n:127.0.0.1:36309_solr c:testSimple1 s:shard2 r:core_node7 x:testSimple1_shard2_replica_n4 ] o.a.s.s.b.BlockDirectory Block cache on write is disabled
[junit4] 2> 4281594 INFO (qtp229807167-124930) [n:127.0.0.1:38044_solr c:testSimple1 s:shard2 r:core_node8 x:testSimple1_shard2_replica_n6 ] o.a.s.c.HdfsDirectoryFactory creating directory factory for path hdfs://localhost:36531/solr_hdfs_home/testSimple1/core_node8/data/index
[junit4] 2> 4281594 INFO (qtp1706487383-124927) [n:127.0.0.1:36309_solr c:testSimple1 s:shard2 r:core_node7 x:testSimple1_shard2_replica_n4 ] o.a.s.c.HdfsDirectoryFactory creating directory factory for path hdfs://localhost:36531/solr_hdfs_home/testSimple1/core_node7/data
[junit4] 2> 4281595 INFO (qtp1706487383-124929) [n:127.0.0.1:36309_solr c:testSimple1 s:shard1 r:core_node3 x:testSimple1_shard1_replica_n1 ] o.a.s.s.b.BlockDirectory Block cache on write is disabled
[junit4] 2> 4281595 INFO (qtp229807167-124925) [n:127.0.0.1:38044_solr c:testSimple1 s:shard1 r:core_node5 x:testSimple1_shard1_replica_n2 ] o.a.s.c.HdfsDirectoryFactory creating directory factory for path hdfs://localhost:36531/solr_hdfs_home/testSimple1/core_node5/data/index
[junit4] 2> 4281595 INFO (qtp1706487383-124929) [n:127.0.0.1:36309_solr c:testSimple1 s:shard1 r:core_node3 x:testSimple1_shard1_replica_n1 ] o.a.s.c.HdfsDirectoryFactory creating directory factory for path hdfs://localhost:36531/solr_hdfs_home/testSimple1/core_node3/data
[junit4] 2> 4281602 INFO (qtp229807167-124925) [n:127.0.0.1:38044_solr c:testSimple1 s:shard1 r:core_node5 x:testSimple1_shard1_replica_n2 ] o.a.s.c.HdfsDirectoryFactory Number of slabs of block cache [1] with direct memory allocation set to [true]
[junit4] 2> 4281602 INFO (qtp229807167-124925) [n:127.0.0.1:38044_solr c:testSimple1 s:shard1 r:core_node5 x:testSimple1_shard1_replica_n2 ] o.a.s.c.HdfsDirectoryFactory Block cache target memory usage, slab size of [33554432] will allocate [1] slabs and use ~[33554432] bytes
[junit4] 2> 4281602 INFO (qtp229807167-124930) [n:127.0.0.1:38044_solr c:testSimple1 s:shard2 r:core_node8 x:testSimple1_shard2_replica_n6 ] o.a.s.c.HdfsDirectoryFactory Number of slabs of block cache [1] with direct memory allocation set to [true]
[junit4] 2> 4281603 INFO (qtp229807167-124930) [n:127.0.0.1:38044_solr c:testSimple1 s:shard2 r:core_node8 x:testSimple1_shard2_replica_n6 ] o.a.s.c.HdfsDirectoryFactory Block cache target memory usage, slab size of [33554432] will allocate [1] slabs and use ~[33554432] bytes
[junit4] 2> 4281606 INFO (qtp229807167-124930) [n:127.0.0.1:38044_solr c:testSimple1 s:shard2 r:core_node8 x:testSimple1_shard2_replica_n6 ] o.a.s.s.b.BlockDirectory Block cache on write is disabled
[junit4] 2> 4281606 INFO (qtp229807167-124925) [n:127.0.0.1:38044_solr c:testSimple1 s:shard1 r:core_node5 x:testSimple1_shard1_replica_n2 ] o.a.s.s.b.BlockDirectory Block cache on write is disabled
[junit4] 2> 4281615 INFO (qtp1706487383-124927) [n:127.0.0.1:36309_solr c:testSimple1 s:shard2 r:core_node7 x:testSimple1_shard2_replica_n4 ] o.a.s.c.HdfsDirectoryFactory creating directory factory for path hdfs://localhost:36531/solr_hdfs_home/testSimple1/core_node7/data/index
[junit4] 2> 4281615 INFO (qtp1706487383-124929) [n:127.0.0.1:36309_solr c:testSimple1 s:shard1 r:core_node3 x:testSimple1_shard1_replica_n1 ] o.a.s.c.HdfsDirectoryFactory creating directory factory for path hdfs://localhost:36531/solr_hdfs_home/testSimple1/core_node3/data/index
[junit4] 2> 4281641 INFO (qtp1706487383-124929) [n:127.0.0.1:36309_solr c:testSimple1 s:shard1 r:core_node3 x:testSimple1_shard1_replica_n1 ] o.a.s.c.HdfsDirectoryFactory Number of slabs of block cache [1] with direct memory allocation set to [true]
[junit4] 2> 4281641 INFO (qtp1706487383-124929) [n:127.0.0.1:36309_solr c:testSimple1 s:shard1 r:core_node3 x:testSimple1_shard1_replica_n1 ] o.a.s.c.HdfsDirectoryFactory Block cache target memory usage, slab size of [33554432] will allocate [1] slabs and use ~[33554432] bytes
[junit4] 2> 4281641 INFO (qtp1706487383-124927) [n:127.0.0.1:36309_solr c:testSimple1 s:shard2 r:core_node7 x:testSimple1_shard2_replica_n4 ] o.a.s.c.HdfsDirectoryFactory Number of slabs of block cache [1] with direct memory allocation set to [true]
[junit4] 2> 4281641 INFO (qtp1706487383-124927) [n:127.0.0.1:36309_solr c:testSimple1 s:shard2 r:core_node7 x:testSimple1_shard2_replica_n4 ] o.a.s.c.HdfsDirectoryFactory Block cache target memory usage, slab size of [33554432] will allocate [1] slabs and use ~[33554432] bytes
[junit4] 2> 4281658 INFO (qtp1706487383-124927) [n:127.0.0.1:36309_solr c:testSimple1 s:shard2 r:core_node7 x:testSimple1_shard2_replica_n4 ] o.a.s.s.b.BlockDirectory Block cache on write is disabled
[junit4] 2> 4281666 INFO (qtp1706487383-124929) [n:127.0.0.1:36309_solr c:testSimple1 s:shard1 r:core_node3 x:testSimple1_shard1_replica_n1 ] o.a.s.s.b.BlockDirectory Block cache on write is disabled
[junit4] 2> 4281769 INFO (qtp229807167-124925) [n:127.0.0.1:38044_solr c:testSimple1 s:shard1 r:core_node5 x:testSimple1_shard1_replica_n2 ] o.a.s.u.UpdateHandler Using UpdateLog implementation: org.apache.solr.update.HdfsUpdateLog
[junit4] 2> 4281769 INFO (qtp229807167-124925) [n:127.0.0.1:38044_solr c:testSimple1 s:shard1 r:core_node5 x:testSimple1_shard1_replica_n2 ] o.a.s.u.UpdateLog Initializing UpdateLog: dataDir=null defaultSyncLevel=FLUSH numRecordsToKeep=100 maxNumLogsToKeep=10 numVersionBuckets=65536
[junit4] 2> 4281769 INFO (qtp229807167-124925) [n:127.0.0.1:38044_solr c:testSimple1 s:shard1 r:core_node5 x:testSimple1_shard1_replica_n2 ] o.a.s.u.HdfsUpdateLog Initializing HdfsUpdateLog: tlogDfsReplication=3
[junit4] 2> 4281794 INFO (qtp229807167-124930) [n:127.0.0.1:38044_solr c:testSimple1 s:shard2 r:core_node8 x:testSimple1_shard2_replica_n6 ] o.a.s.u.UpdateHandler Using UpdateLog implementation: org.apache.solr.update.HdfsUpdateLog
[junit4] 2> 4281794 INFO (qtp229807167-124930) [n:127.0.0.1:38044_solr c:testSimple1 s:shard2 r:core_node8 x:testSimple1_shard2_replica_n6 ] o.a.s.u.UpdateLog Initializing UpdateLog: dataDir=null defaultSyncLevel=FLUSH numRecordsToKeep=100 maxNumLogsToKeep=10 numVersionBuckets=65536
[junit4] 2> 4281794 INFO (qtp229807167-124930) [n:127.0.0.1:38044_solr c:testSimple1 s:shard2 r:core_node8 x:testSimple1_shard2_replica_n6 ] o.a.s.u.HdfsUpdateLog Initializing HdfsUpdateLog: tlogDfsReplication=3
[junit4] 2> 4281798 INFO (qtp1706487383-124927) [n:127.0.0.1:36309_solr c:testSimple1 s:shard2 r:core_node7 x:testSimple1_shard2_replica_n4 ] o.a.s.u.UpdateHandler Using UpdateLog implementation: org.apache.solr.update.HdfsUpdateLog
[junit4] 2> 4281798 INFO (qtp1706487383-124927) [n:127.0.0.1:36309_solr c:testSimple1 s:shard2 r:core_node7 x:testSimple1_shard2_replica_n4 ] o.a.s.u.UpdateLog Initializing UpdateLog: dataDir=null defaultSyncLevel=FLUSH numRecordsToKeep=100 maxNumLogsToKeep=10 numVersionBuckets=65536
[junit4] 2> 4281798 INFO (qtp1706487383-124927) [n:127.0.0.1:36309_solr c:testSimple1 s:shard2 r:core_node7 x:testSimple1_shard2_replica_n4 ] o.a.s.u.HdfsUpdateLog Initializing HdfsUpdateLog: tlogDfsReplication=3
[junit4] 2> 4281805 INFO (qtp229807167-124925) [n:127.0.0.1:38044_solr c:testSimple1 s:shard1 r:core_node5 x:testSimple1_shard1_replica_n2 ] o.a.s.u.CommitTracker Hard AutoCommit: disabled
[junit4] 2> 4281805 INFO (qtp229807167-124925) [n:127.0.0.1:38044_solr c:testSimple1 s:shard1 r:core_node5 x:testSimple1_shard1_replica_n2 ] o.a.s.u.CommitTracker Soft AutoCommit: disabled
[junit4] 2> 4281807 INFO (qtp229807167-124930) [n:127.0.0.1:38044_solr c:testSimple1 s:shard2 r:core_node8 x:testSimple1_shard2_replica_n6 ] o.a.s.u.CommitTracker Hard AutoCommit: disabled
[junit4] 2> 4281807 INFO (qtp229807167-124930) [n:127.0.0.1:38044_solr c:testSimple1 s:shard2 r:core_node8 x:testSimple1_shard2_replica_n6 ] o.a.s.u.CommitTracker Soft AutoCommit: disabled
[junit4] 2> 4281809 INFO (qtp1706487383-124927) [n:127.0.0.1:36309_solr c:testSimple1 s:shard2 r:core_node7 x:testSimple1_shard2_replica_n4 ] o.a.s.u.CommitTracker Hard AutoCommit: disabled
[junit4] 2> 4281810 INFO (qtp1706487383-124927) [n:127.0.0.1:36309_solr c:testSimple1 s:shard2 r:core_node7 x:testSimple1_shard2_replica_n4 ] o.a.s.u.CommitTracker Soft AutoCommit: disabled
[junit4] 2> 4281829 INFO (qtp1706487383-124929) [n:127.0.0.1:36309_solr c:testSimple1 s:shard1 r:core_node3 x:testSimple1_shard1_replica_n1 ] o.a.s.u.UpdateHandler Using UpdateLog implementation: org.apache.solr.update.HdfsUpdateLog
[junit4] 2> 4281829 INFO (qtp1706487383-124929) [n:127.0.0.1:36309_solr c:testSimple1 s:shard1 r:core_node3 x:testSimple1_shard1_replica_n1 ] o.a.s.u.UpdateLog Initializing UpdateLog: dataDir=null defaultSyncLevel=FLUSH numRecordsToKeep=100 maxNumLogsToKeep=10 numVersionBuckets=65536
[junit4] 2> 4281829 INFO (qtp1706487383-124929) [n:127.0.0.1:36309_solr c:testSimple1 s:shard1 r:core_node3 x:testSimple1_shard1_replica_n1 ] o.a.s.u.HdfsUpdateLog Initializing HdfsUpdateLog: tlogDfsReplication=3
[junit4] 2> 4281839 INFO (qtp229807167-124925) [n:127.0.0.1:38044_solr c:testSimple1 s:shard1 r:core_node5 x:testSimple1_shard1_replica_n2 ] o.a.s.s.SolrIndexSearcher Opening [Searcher@21feac7c[testSimple1_shard1_replica_n2] main]
[junit4] 2> 4281840 INFO (qtp1706487383-124927) [n:127.0.0.1:36309_solr c:testSimple1 s:shard2 r:core_node7 x:testSimple1_shard2_replica_n4 ] o.a.s.s.SolrIndexSearcher Opening [Searcher@14de6545[testSimple1_shard2_replica_n4] main]
[junit4] 2> 4281841 INFO (qtp229807167-124925) [n:127.0.0.1:38044_solr c:testSimple1 s:shard1 r:core_node5 x:testSimple1_shard1_replica_n2 ] o.a.s.r.ManagedResourceStorage Configured ZooKeeperStorageIO with znodeBase: /configs/conf
[junit4] 2> 4281842 INFO (qtp229807167-124925) [n:127.0.0.1:38044_solr c:testSimple1 s:shard1 r:core_node5 x:testSimple1_shard1_replica_n2 ] o.a.s.r.ManagedResourceStorage Loaded null at path _rest_managed.json using ZooKeeperStorageIO:path=/configs/conf
[junit4] 2> 4281843 INFO (qtp229807167-124925) [n:127.0.0.1:38044_solr c:testSimple1 s:shard1 r:core_node5 x:testSimple1_shard1_replica_n2 ] o.a.s.h.ReplicationHandler Commits will be reserved for 10000ms.
[junit4] 2> 4281843 INFO (qtp229807167-124925) [n:127.0.0.1:38044_solr c:testSimple1 s:shard1 r:core_node5 x:testSimple1_shard1_replica_n2 ] o.a.s.u.UpdateLog Could not find max version in index or recent updates, using new clock 1635659891624378368
[junit4] 2> 4281845 INFO (qtp1706487383-124927) [n:127.0.0.1:36309_solr c:testSimple1 s:shard2 r:core_node7 x:testSimple1_shard2_replica_n4 ] o.a.s.r.ManagedResourceStorage Configured ZooKeeperStorageIO with znodeBase: /configs/conf
[junit4] 2> 4281846 INFO (qtp1706487383-124927) [n:127.0.0.1:36309_solr c:testSimple1 s:shard2 r:core_node7 x:testSimple1_shard2_replica_n4 ] o.a.s.r.ManagedResourceStorage Loaded null at path _rest_managed.json using ZooKeeperStorageIO:path=/configs/conf
[junit4] 2> 4281846 INFO (qtp229807167-124930) [n:127.0.0.1:38044_solr c:testSimple1 s:shard2 r:core_node8 x:testSimple1_shard2_replica_n6 ] o.a.s.s.SolrIndexSearcher Opening [Searcher@4041ceca[testSimple1_shard2_replica_n6] main]
[junit4] 2> 4281847 INFO (qtp1706487383-124927) [n:127.0.0.1:36309_solr c:testSimple1 s:shard2 r:core_node7 x:testSimple1_shard2_replica_n4 ] o.a.s.h.ReplicationHandler Commits will be reserved for 10000ms.
[junit4] 2> 4281848 INFO (qtp1706487383-124927) [n:127.0.0.1:36309_solr c:testSimple1 s:shard2 r:core_node7 x:testSimple1_shard2_replica_n4 ] o.a.s.u.UpdateLog Could not find max version in index or recent updates, using new clock 1635659891629621248
[junit4] 2> 4281848 INFO (searcherExecutor-16465-thread-1-processing-n:127.0.0.1:38044_solr x:testSimple1_shard1_replica_n2 c:testSimple1 s:shard1 r:core_node5) [n:127.0.0.1:38044_solr c:testSimple1 s:shard1 r:core_node5 x:testSimple1_shard1_replica_n2 ] o.a.s.c.SolrCore [testSimple1_shard1_replica_n2] Registered new searcher Searcher@21feac7c[testSimple1_shard1_replica_n2] main{ExitableDirectoryReader(UninvertingDirectoryReader())}
[junit4] 2> 4281854 INFO (qtp229807167-124930) [n:127.0.0.1:38044_solr c:testSimple1 s:shard2 r:core_node8 x:testSimple1_shard2_replica_n6 ] o.a.s.r.ManagedResourceStorage Configured ZooKeeperStorageIO with znodeBase: /configs/conf
[junit4] 2> 4281856 INFO (searcherExecutor-16467-thread-1-processing-n:127.0.0.1:36309_solr x:testSimple1_shard2_replica_n4 c:testSimple1 s:shard2 r:core_node7) [n:127.0.0.1:36309_solr c:testSimple1 s:shard2 r:core_node7 x:testSimple1_shard2_replica_n4 ] o.a.s.c.SolrCore [testSimple1_shard2_replica_n4] Registered new searcher Searcher@14de6545[testSimple1_shard2_replica_n4] main{ExitableDirectoryReader(UninvertingDirectoryReader())}
[junit4] 2> 4281856 INFO (qtp229807167-124930) [n:127.0.0.1:38044_solr c:testSimple1 s:shard2 r:core_node8 x:testSimple1_shard2_replica_n6 ] o.a.s.r.ManagedResourceStorage Loaded null at path _rest_managed.json using ZooKeeperStorageIO:path=/configs/conf
[junit4] 2> 4281857 INFO (qtp229807167-124930) [n:127.0.0.1:38044_solr c:testSimple1 s:shard2 r:core_node8 x:testSimple1_shard2_replica_n6 ] o.a.s.h.ReplicationHandler Commits will be reserved for 10000ms.
[junit4] 2> 4281858 INFO (qtp229807167-124930) [n:127.0.0.1:38044_solr c:testSimple1 s:shard2 r:core_node8 x:testSimple1_shard2_replica_n6 ] o.a.s.u.UpdateLog Could not find max version in index or recent updates, using new clock 1635659891640107008
[junit4] 2> 4281864 INFO (searcherExecutor-16464-thread-1-processing-n:127.0.0.1:38044_solr x:testSimple1_shard2_replica_n6 c:testSimple1 s:shard2 r:core_node8) [n:127.0.0.1:38044_solr c:testSimple1 s:shard2 r:core_node8 x:testSimple1_shard2_replica_n6 ] o.a.s.c.SolrCore [testSimple1_shard2_replica_n6] Registered new searcher Searcher@4041ceca[testSimple1_shard2_replica_n6] main{ExitableDirectoryReader(UninvertingDirectoryReader())}
[junit4] 2> 4281864 INFO (qtp229807167-124925) [n:127.0.0.1:38044_solr c:testSimple1 s:shard1 r:core_node5 x:testSimple1_shard1_replica_n2 ] o.a.s.c.ZkShardTerms Successful update of terms at /collections/testSimple1/terms/shard1 to Terms{values={core_node5=0}, version=0}
[junit4] 2> 4281864 INFO (qtp229807167-124925) [n:127.0.0.1:38044_solr c:testSimple1 s:shard1 r:core_node5 x:testSimple1_shard1_replica_n2 ] o.a.s.c.ShardLeaderElectionContextBase make sure parent is created /collections/testSimple1/leaders/shard1
[junit4] 2> 4281865 INFO (qtp1706487383-124929) [n:127.0.0.1:36309_solr c:testSimple1 s:shard1 r:core_node3 x:testSimple1_shard1_replica_n1 ] o.a.s.u.CommitTracker Hard AutoCommit: disabled
[junit4] 2> 4281865 INFO (qtp1706487383-124929) [n:127.0.0.1:36309_solr c:testSimple1 s:shard1 r:core_node3 x:testSimple1_shard1_replica_n1 ] o.a.s.u.CommitTracker Soft AutoCommit: disabled
[junit4] 2> 4281867 INFO (qtp1706487383-124927) [n:127.0.0.1:36309_solr c:testSimple1 s:shard2 r:core_node7 x:testSimple1_shard2_replica_n4 ] o.a.s.c.ZkShardTerms Successful update of terms at /collections/testSimple1/terms/shard2 to Terms{values={core_node7=0}, version=0}
[junit4] 2> 4281867 INFO (qtp1706487383-124927) [n:127.0.0.1:36309_solr c:testSimple1 s:shard2 r:core_node7 x:testSimple1_shard2_replica_n4 ] o.a.s.c.ShardLeaderElectionContextBase make sure parent is created /collections/testSimple1/leaders/shard2
[junit4] 2> 4281876 INFO (qtp229807167-124925) [n:127.0.0.1:38044_solr c:testSimple1 s:shard1 r:core_node5 x:testSimple1_shard1_replica_n2 ] o.a.s.c.ShardLeaderElectionContext Waiting until we see more replicas up for shard shard1: total=2 found=1 timeoutin=14998ms
[junit4] 2> 4281877 INFO (qtp1706487383-124927) [n:127.0.0.1:36309_solr c:testSimple1 s:shard2 r:core_node7 x:testSimple1_shard2_replica_n4 ] o.a.s.c.ShardLeaderElectionC
[...truncated too long message...]
-ivy-fail-disallowed-ivy-version:
ivy-fail:
ivy-configure:
[ivy:configure] :: loading settings :: file = /x1/jenkins/jenkins-slave/workspace/Lucene-Solr-NightlyTests-8.x/checkout/lucene/top-level-ivy-settings.xml
resolve:
ivy-availability-check:
[loadresource] Do not set property disallowed.ivy.jars.list as its length is 0.
-ivy-fail-disallowed-ivy-version:
ivy-fail:
ivy-fail:
ivy-configure:
[ivy:configure] :: loading settings :: file = /x1/jenkins/jenkins-slave/workspace/Lucene-Solr-NightlyTests-8.x/checkout/lucene/top-level-ivy-settings.xml
resolve:
ivy-availability-check:
[loadresource] Do not set property disallowed.ivy.jars.list as its length is 0.
-ivy-fail-disallowed-ivy-version:
ivy-fail:
ivy-configure:
[ivy:configure] :: loading settings :: file = /x1/jenkins/jenkins-slave/workspace/Lucene-Solr-NightlyTests-8.x/checkout/lucene/top-level-ivy-settings.xml
resolve:
ivy-availability-check:
[loadresource] Do not set property disallowed.ivy.jars.list as its length is 0.
-ivy-fail-disallowed-ivy-version:
ivy-fail:
ivy-fail:
ivy-configure:
[ivy:configure] :: loading settings :: file = /x1/jenkins/jenkins-slave/workspace/Lucene-Solr-NightlyTests-8.x/checkout/lucene/top-level-ivy-settings.xml
resolve:
ivy-availability-check:
[loadresource] Do not set property disallowed.ivy.jars.list as its length is 0.
-ivy-fail-disallowed-ivy-version:
ivy-fail:
ivy-fail:
ivy-configure:
[ivy:configure] :: loading settings :: file = /x1/jenkins/jenkins-slave/workspace/Lucene-Solr-NightlyTests-8.x/checkout/lucene/top-level-ivy-settings.xml
resolve:
ivy-availability-check:
[loadresource] Do not set property disallowed.ivy.jars.list as its length is 0.
-ivy-fail-disallowed-ivy-version:
ivy-fail:
ivy-fail:
ivy-configure:
[ivy:configure] :: loading settings :: file = /x1/jenkins/jenkins-slave/workspace/Lucene-Solr-NightlyTests-8.x/checkout/lucene/top-level-ivy-settings.xml
resolve:
ivy-availability-check:
[loadresource] Do not set property disallowed.ivy.jars.list as its length is 0.
-ivy-fail-disallowed-ivy-version:
ivy-fail:
ivy-fail:
ivy-configure:
[ivy:configure] :: loading settings :: file = /x1/jenkins/jenkins-slave/workspace/Lucene-Solr-NightlyTests-8.x/checkout/lucene/top-level-ivy-settings.xml
resolve:
ivy-availability-check:
[loadresource] Do not set property disallowed.ivy.jars.list as its length is 0.
-ivy-fail-disallowed-ivy-version:
ivy-fail:
ivy-fail:
ivy-configure:
[ivy:configure] :: loading settings :: file = /x1/jenkins/jenkins-slave/workspace/Lucene-Solr-NightlyTests-8.x/checkout/lucene/top-level-ivy-settings.xml
resolve:
ivy-availability-check:
[loadresource] Do not set property disallowed.ivy.jars.list as its length is 0.
-ivy-fail-disallowed-ivy-version:
ivy-fail:
ivy-fail:
ivy-configure:
[ivy:configure] :: loading settings :: file = /x1/jenkins/jenkins-slave/workspace/Lucene-Solr-NightlyTests-8.x/checkout/lucene/top-level-ivy-settings.xml
resolve:
ivy-availability-check:
[loadresource] Do not set property disallowed.ivy.jars.list as its length is 0.
-ivy-fail-disallowed-ivy-version:
ivy-fail:
ivy-fail:
ivy-configure:
[ivy:configure] :: loading settings :: file = /x1/jenkins/jenkins-slave/workspace/Lucene-Solr-NightlyTests-8.x/checkout/lucene/top-level-ivy-settings.xml
resolve:
ivy-availability-check:
[loadresource] Do not set property disallowed.ivy.jars.list as its length is 0.
-ivy-fail-disallowed-ivy-version:
ivy-fail:
ivy-fail:
ivy-configure:
[ivy:configure] :: loading settings :: file = /x1/jenkins/jenkins-slave/workspace/Lucene-Solr-NightlyTests-8.x/checkout/lucene/top-level-ivy-settings.xml
resolve:
ivy-availability-check:
[loadresource] Do not set property disallowed.ivy.jars.list as its length is 0.
-ivy-fail-disallowed-ivy-version:
ivy-fail:
ivy-fail:
ivy-configure:
[ivy:configure] :: loading settings :: file = /x1/jenkins/jenkins-slave/workspace/Lucene-Solr-NightlyTests-8.x/checkout/lucene/top-level-ivy-settings.xml
resolve:
ivy-availability-check:
[loadresource] Do not set property disallowed.ivy.jars.list as its length is 0.
-ivy-fail-disallowed-ivy-version:
ivy-fail:
ivy-fail:
ivy-configure:
[ivy:configure] :: loading settings :: file = /x1/jenkins/jenkins-slave/workspace/Lucene-Solr-NightlyTests-8.x/checkout/lucene/top-level-ivy-settings.xml
resolve:
ivy-availability-check:
[loadresource] Do not set property disallowed.ivy.jars.list as its length is 0.
-ivy-fail-disallowed-ivy-version:
ivy-fail:
ivy-fail:
ivy-configure:
[ivy:configure] :: loading settings :: file = /x1/jenkins/jenkins-slave/workspace/Lucene-Solr-NightlyTests-8.x/checkout/lucene/top-level-ivy-settings.xml
resolve:
jar-checksums:
[mkdir] Created dir: /x1/jenkins/jenkins-slave/workspace/Lucene-Solr-NightlyTests-8.x/checkout/solr/null788221194
[copy] Copying 248 files to /x1/jenkins/jenkins-slave/workspace/Lucene-Solr-NightlyTests-8.x/checkout/solr/null788221194
[delete] Deleting directory /x1/jenkins/jenkins-slave/workspace/Lucene-Solr-NightlyTests-8.x/checkout/solr/null788221194
check-working-copy:
[ivy:cachepath] :: resolving dependencies :: #;working@lucene1-us-west
[ivy:cachepath] confs: [default]
[ivy:cachepath] found org.eclipse.jgit#org.eclipse.jgit;5.3.0.201903130848-r in public
[ivy:cachepath] found com.jcraft#jsch;0.1.54 in public
[ivy:cachepath] found com.jcraft#jzlib;1.1.1 in public
[ivy:cachepath] found com.googlecode.javaewah#JavaEWAH;1.1.6 in public
[ivy:cachepath] found org.slf4j#slf4j-api;1.7.2 in public
[ivy:cachepath] found org.bouncycastle#bcpg-jdk15on;1.60 in public
[ivy:cachepath] found org.bouncycastle#bcprov-jdk15on;1.60 in public
[ivy:cachepath] found org.bouncycastle#bcpkix-jdk15on;1.60 in public
[ivy:cachepath] found org.slf4j#slf4j-nop;1.7.2 in public
[ivy:cachepath] :: resolution report :: resolve 35ms :: artifacts dl 2ms
---------------------------------------------------------------------
| | modules || artifacts |
| conf | number| search|dwnlded|evicted|| number|dwnlded|
---------------------------------------------------------------------
| default | 9 | 0 | 0 | 0 || 9 | 0 |
---------------------------------------------------------------------
[wc-checker] Initializing working copy...
[wc-checker] Checking working copy status...
-jenkins-base:
BUILD SUCCESSFUL
Total time: 332 minutes 57 seconds
Archiving artifacts
java.lang.InterruptedException: no matches found within 10000
at hudson.FilePath$ValidateAntFileMask.hasMatch(FilePath.java:2847)
at hudson.FilePath$ValidateAntFileMask.invoke(FilePath.java:2726)
at hudson.FilePath$ValidateAntFileMask.invoke(FilePath.java:2707)
at hudson.FilePath$FileCallableWrapper.call(FilePath.java:3086)
Also: hudson.remoting.Channel$CallSiteStackTrace: Remote call to lucene
at hudson.remoting.Channel.attachCallSiteStackTrace(Channel.java:1741)
at hudson.remoting.UserRequest$ExceptionResponse.retrieve(UserRequest.java:357)
at hudson.remoting.Channel.call(Channel.java:955)
at hudson.FilePath.act(FilePath.java:1072)
at hudson.FilePath.act(FilePath.java:1061)
at hudson.FilePath.validateAntFileMask(FilePath.java:2705)
at hudson.tasks.ArtifactArchiver.perform(ArtifactArchiver.java:243)
at hudson.tasks.BuildStepCompatibilityLayer.perform(BuildStepCompatibilityLayer.java:81)
at hudson.tasks.BuildStepMonitor$1.perform(BuildStepMonitor.java:20)
at hudson.model.AbstractBuild$AbstractBuildExecution.perform(AbstractBuild.java:744)
at hudson.model.AbstractBuild$AbstractBuildExecution.performAllBuildSteps(AbstractBuild.java:690)
at hudson.model.Build$BuildExecution.post2(Build.java:186)
at hudson.model.AbstractBuild$AbstractBuildExecution.post(AbstractBuild.java:635)
at hudson.model.Run.execute(Run.java:1835)
at hudson.model.FreeStyleBuild.run(FreeStyleBuild.java:43)
at hudson.model.ResourceController.execute(ResourceController.java:97)
at hudson.model.Executor.run(Executor.java:429)
Caused: hudson.FilePath$TunneledInterruptedException
at hudson.FilePath$FileCallableWrapper.call(FilePath.java:3088)
at hudson.remoting.UserRequest.perform(UserRequest.java:212)
at hudson.remoting.UserRequest.perform(UserRequest.java:54)
at hudson.remoting.Request$2.run(Request.java:369)
at hudson.remoting.InterceptingExecutorService$1.call(InterceptingExecutorService.java:72)
at java.util.concurrent.FutureTask.run(FutureTask.java:266)
at java.util.concurrent.ThreadPoolExecutor.runWorker(ThreadPoolExecutor.java:1142)
at java.util.concurrent.ThreadPoolExecutor$Worker.run(ThreadPoolExecutor.java:617)
at java.lang.Thread.run(Thread.java:748)
Caused: java.lang.InterruptedException: java.lang.InterruptedException: no matches found within 10000
at hudson.FilePath.act(FilePath.java:1074)
at hudson.FilePath.act(FilePath.java:1061)
at hudson.FilePath.validateAntFileMask(FilePath.java:2705)
at hudson.tasks.ArtifactArchiver.perform(ArtifactArchiver.java:243)
at hudson.tasks.BuildStepCompatibilityLayer.perform(BuildStepCompatibilityLayer.java:81)
at hudson.tasks.BuildStepMonitor$1.perform(BuildStepMonitor.java:20)
at hudson.model.AbstractBuild$AbstractBuildExecution.perform(AbstractBuild.java:744)
at hudson.model.AbstractBuild$AbstractBuildExecution.performAllBuildSteps(AbstractBuild.java:690)
at hudson.model.Build$BuildExecution.post2(Build.java:186)
at hudson.model.AbstractBuild$AbstractBuildExecution.post(AbstractBuild.java:635)
at hudson.model.Run.execute(Run.java:1835)
at hudson.model.FreeStyleBuild.run(FreeStyleBuild.java:43)
at hudson.model.ResourceController.execute(ResourceController.java:97)
at hudson.model.Executor.run(Executor.java:429)
No artifacts found that match the file pattern "**/*.events,heapdumps/**,**/hs_err_pid*". Configuration error?
Recording test results
Build step 'Publish JUnit test result report' changed build result to UNSTABLE
Email was triggered for: Unstable (Test Failures)
Sending email for trigger: Unstable (Test Failures)