You are viewing a plain text version of this content. The canonical link for it is here.
Posted to notifications@maven.apache.org by Apache Jenkins Server <je...@builds.apache.org> on 2019/03/15 11:05:38 UTC
Build unstable in Jenkins: Maven TLP » maven-remote-resources-plugin » MRRESOURCES-112 #1
See https://builds.apache.org/job/maven-box/job/maven-remote-resources-plugin/job/MRRESOURCES-112/1/
No changes.
2 tests failed.
FAILED: org.apache.maven.plugin.resources.remote.it.IT_SupplementalArtifact.linux-jdk12-m3.5.x_build / Build linux-jdk12-m3.5.x_build / test
Error Message:
Exit code was non-zero: 1; command line and log =
/home/jenkins/tools/maven/apache-maven-3.5.4/bin/mvn -e --batch-mode -Dhttps.protocols=TLSv1.2 -Dmaven.repo.local=/home/jenkins/jenkins-slave/workspace/resources-plugin_MRRESOURCES-112@2/linux-jdk12-m3.5.x_build/target/it-repo org.apache.maven.plugins:maven-clean-plugin:clean deploy
Picked up JAVA_TOOL_OPTIONS: -Dmaven.ext.class.path="/home/jenkins/jenkins-slave/workspace/resources-plugin_MRRESOURCES-112@2@tmp/withMavenb0cd0e7f/pipeline-maven-spy.jar" -Dorg.jenkinsci.plugins.pipeline.maven.reportsFolder="/home/jenkins/jenkins-slave/workspace/resources-plugin_MRRESOURCES-112@2@tmp/withMavenb0cd0e7f"
[INFO] [jenkins-event-spy] Jenkins Maven Event Spy is disabled
[INFO] Error stacktraces are turned on.
[INFO] Scanning for projects...
[INFO] ------------------------------------------------------------------------
[INFO] Reactor Build Order:
[INFO]
[INFO] resources [pom]
[INFO] supplemental-models [jar]
[INFO] deficient-dep [jar]
[INFO]
[INFO] --------< org.apache.maven.plugin.rresource.it.mrr43:resources >--------
[INFO] Building resources 1 [1/3]
[INFO] --------------------------------[ pom ]---------------------------------
[INFO]
[INFO] --- maven-clean-plugin:2.5:clean (default-cli) @ resources ---
[INFO]
[INFO] --- maven-install-plugin:2.4:install (default-install) @ resources ---
[INFO] Installing /home/jenkins/jenkins-slave/workspace/resources-plugin_MRRESOURCES-112@2/linux-jdk12-m3.5.x_build/target/test-classes/supplemental-artifact/resource-projects/pom.xml to /home/jenkins/jenkins-slave/workspace/resources-plugin_MRRESOURCES-112@2/linux-jdk12-m3.5.x_build/target/it-repo/org/apache/maven/plugin/rresource/it/mrr43/resources/1/resources-1.pom
[INFO]
[INFO] --- maven-deploy-plugin:2.7:deploy (default-deploy) @ resources ---
[INFO] Uploading to it-remote: file:/home/jenkins/jenkins-slave/workspace/resources-plugin_MRRESOURCES-112@2/linux-jdk12-m3.5.x_build/target/remote-repo/org/apache/maven/plugin/rresource/it/mrr43/resources/1/resources-1.pom
[INFO] Uploaded to it-remote: file:/home/jenkins/jenkins-slave/workspace/resources-plugin_MRRESOURCES-112@2/linux-jdk12-m3.5.x_build/target/remote-repo/org/apache/maven/plugin/rresource/it/mrr43/resources/1/resources-1.pom (1.9 kB at 127 kB/s)
[INFO] Downloading from it-remote: file:/home/jenkins/jenkins-slave/workspace/resources-plugin_MRRESOURCES-112@2/linux-jdk12-m3.5.x_build/target/remote-repo/org/apache/maven/plugin/rresource/it/mrr43/resources/maven-metadata.xml
[INFO] Uploading to it-remote: file:/home/jenkins/jenkins-slave/workspace/resources-plugin_MRRESOURCES-112@2/linux-jdk12-m3.5.x_build/target/remote-repo/org/apache/maven/plugin/rresource/it/mrr43/resources/maven-metadata.xml
[INFO] Uploaded to it-remote: file:/home/jenkins/jenkins-slave/workspace/resources-plugin_MRRESOURCES-112@2/linux-jdk12-m3.5.x_build/target/remote-repo/org/apache/maven/plugin/rresource/it/mrr43/resources/maven-metadata.xml (323 B at 323 kB/s)
[INFO]
[INFO] ---< org.apache.maven.plugin.rresource.it.mrr43:supplemental-models >---
[INFO] Building supplemental-models 1 [2/3]
[INFO] --------------------------------[ jar ]---------------------------------
[INFO] Downloading from central: https://repo.maven.apache.org/maven2/org/apache/maven/plugins/maven-compiler-plugin/3.8.0/maven-compiler-plugin-3.8.0.pom
[INFO] Downloaded from central: https://repo.maven.apache.org/maven2/org/apache/maven/plugins/maven-compiler-plugin/3.8.0/maven-compiler-plugin-3.8.0.pom (12 kB at 30 kB/s)
[INFO] Downloading from central: https://repo.maven.apache.org/maven2/org/apache/maven/plugins/maven-plugins/32/maven-plugins-32.pom
[INFO] Downloaded from central: https://repo.maven.apache.org/maven2/org/apache/maven/plugins/maven-plugins/32/maven-plugins-32.pom (11 kB at 534 kB/s)
[INFO] Downloading from central: https://repo.maven.apache.org/maven2/org/apache/maven/maven-parent/32/maven-parent-32.pom
[INFO] Downloaded from central: https://repo.maven.apache.org/maven2/org/apache/maven/maven-parent/32/maven-parent-32.pom (43 kB at 1.8 MB/s)
[INFO] Downloading from central: https://repo.maven.apache.org/maven2/org/apache/apache/20/apache-20.pom
[INFO] Downloaded from central: https://repo.maven.apache.org/maven2/org/apache/apache/20/apache-20.pom (16 kB at 991 kB/s)
[INFO] Downloading from central: https://repo.maven.apache.org/maven2/org/apache/maven/plugins/maven-compiler-plugin/3.8.0/maven-compiler-plugin-3.8.0.jar
[INFO] Downloaded from central: https://repo.maven.apache.org/maven2/org/apache/maven/plugins/maven-compiler-plugin/3.8.0/maven-compiler-plugin-3.8.0.jar (62 kB at 3.1 MB/s)
[INFO]
[INFO] --- maven-clean-plugin:2.5:clean (default-cli) @ supplemental-models ---
[INFO]
[INFO] --- maven-resources-plugin:2.6:resources (default-resources) @ supplemental-models ---
[WARNING] Using platform encoding (ISO-8859-1 actually) to copy filtered resources, i.e. build is platform dependent!
[INFO] Copying 1 resource
[INFO]
[INFO] --- maven-compiler-plugin:3.8.0:compile (default-compile) @ supplemental-models ---
[INFO] Downloading from central: https://repo.maven.apache.org/maven2/org/apache/maven/maven-plugin-api/3.0/maven-plugin-api-3.0.pom
[INFO] Downloaded from central: https://repo.maven.apache.org/maven2/org/apache/maven/maven-plugin-api/3.0/maven-plugin-api-3.0.pom (2.3 kB at 153 kB/s)
[INFO] Downloading from central: https://repo.maven.apache.org/maven2/org/apache/maven/maven/3.0/maven-3.0.pom
[INFO] Downloaded from central: https://repo.maven.apache.org/maven2/org/apache/maven/maven/3.0/maven-3.0.pom (22 kB at 608 kB/s)
[INFO] Downloading from central: https://repo.maven.apache.org/maven2/org/apache/maven/maven-parent/15/maven-parent-15.pom
[INFO] Downloaded from central: https://repo.maven.apache.org/maven2/org/apache/maven/maven-parent/15/maven-parent-15.pom (24 kB at 1.4 MB/s)
[INFO] Downloading from central: https://repo.maven.apache.org/maven2/org/apache/maven/maven-model/3.0/maven-model-3.0.pom
[INFO] Downloaded from central: https://repo.maven.apache.org/maven2/org/apache/maven/maven-model/3.0/maven-model-3.0.pom (3.9 kB at 299 kB/s)
[INFO] Downloading from central: https://repo.maven.apache.org/maven2/org/codehaus/plexus/plexus-utils/2.0.4/plexus-utils-2.0.4.pom
[INFO] Downloaded from central: https://repo.maven.apache.org/maven2/org/codehaus/plexus/plexus-utils/2.0.4/plexus-utils-2.0.4.pom (3.3 kB at 208 kB/s)
[INFO] Downloading from central: https://repo.maven.apache.org/maven2/org/apache/maven/maven-artifact/3.0/maven-artifact-3.0.pom
[INFO] Downloaded from central: https://repo.maven.apache.org/maven2/org/apache/maven/maven-artifact/3.0/maven-artifact-3.0.pom (1.9 kB at 148 kB/s)
[INFO] Downloading from central: https://repo.maven.apache.org/maven2/org/sonatype/sisu/sisu-inject-plexus/1.4.2/sisu-inject-plexus-1.4.2.pom
[INFO] Downloaded from central: https://repo.maven.apache.org/maven2/org/sonatype/sisu/sisu-inject-plexus/1.4.2/sisu-inject-plexus-1.4.2.pom (5.4 kB at 358 kB/s)
[INFO] Downloading from central: https://repo.maven.apache.org/maven2/org/sonatype/sisu/inject/guice-plexus/1.4.2/guice-plexus-1.4.2.pom
[INFO] Downloaded from central: https://repo.maven.apache.org/maven2/org/sonatype/sisu/inject/guice-plexus/1.4.2/guice-plexus-1.4.2.pom (3.1 kB at 184 kB/s)
[INFO] Downloading from central: https://repo.maven.apache.org/maven2/org/sonatype/sisu/inject/guice-bean/1.4.2/guice-bean-1.4.2.pom
[INFO] Downloaded from central: https://repo.maven.apache.org/maven2/org/sonatype/sisu/inject/guice-bean/1.4.2/guice-bean-1.4.2.pom (2.6 kB at 200 kB/s)
[INFO] Downloading from central: https://repo.maven.apache.org/maven2/org/sonatype/sisu/sisu-inject/1.4.2/sisu-inject-1.4.2.pom
[INFO] Downloaded from central: https://repo.maven.apache.org/maven2/org/sonatype/sisu/sisu-inject/1.4.2/sisu-inject-1.4.2.pom (1.2 kB at 89 kB/s)
[INFO] Downloading from central: https://repo.maven.apache.org/maven2/org/sonatype/sisu/sisu-parent/1.4.2/sisu-parent-1.4.2.pom
[INFO] Downloaded from central: https://repo.maven.apache.org/maven2/org/sonatype/sisu/sisu-parent/1.4.2/sisu-parent-1.4.2.pom (7.8 kB at 556 kB/s)
[INFO] Downloading from central: https://repo.maven.apache.org/maven2/org/sonatype/forge/forge-parent/6/forge-parent-6.pom
[INFO] Downloaded from central: https://repo.maven.apache.org/maven2/org/sonatype/forge/forge-parent/6/forge-parent-6.pom (11 kB at 717 kB/s)
[INFO] Downloading from central: https://repo.maven.apache.org/maven2/org/codehaus/plexus/plexus-component-annotations/1.7.1/plexus-component-annotations-1.7.1.pom
[INFO] Downloaded from central: https://repo.maven.apache.org/maven2/org/codehaus/plexus/plexus-component-annotations/1.7.1/plexus-component-annotations-1.7.1.pom (770 B at 55 kB/s)
[INFO] Downloading from central: https://repo.maven.apache.org/maven2/org/codehaus/plexus/plexus-containers/1.7.1/plexus-containers-1.7.1.pom
[INFO] Downloaded from central: https://repo.maven.apache.org/maven2/org/codehaus/plexus/plexus-containers/1.7.1/plexus-containers-1.7.1.pom (5.0 kB at 314 kB/s)
[INFO] Downloading from central: https://repo.maven.apache.org/maven2/org/codehaus/plexus/plexus-classworlds/2.2.3/plexus-classworlds-2.2.3.pom
[INFO] Downloaded from central: https://repo.maven.apache.org/maven2/org/codehaus/plexus/plexus-classworlds/2.2.3/plexus-classworlds-2.2.3.pom (4.0 kB at 307 kB/s)
[INFO] Downloading from central: https://repo.maven.apache.org/maven2/org/sonatype/sisu/sisu-inject-bean/1.4.2/sisu-inject-bean-1.4.2.pom
[INFO] Downloaded from central: https://repo.maven.apache.org/maven2/org/sonatype/sisu/sisu-inject-bean/1.4.2/sisu-inject-bean-1.4.2.pom (5.5 kB at 390 kB/s)
[INFO] Downloading from central: https://repo.maven.apache.org/maven2/org/sonatype/sisu/sisu-guice/2.1.7/sisu-guice-2.1.7.pom
[INFO] Downloaded from central: https://repo.maven.apache.org/maven2/org/sonatype/sisu/sisu-guice/2.1.7/sisu-guice-2.1.7.pom (11 kB at 790 kB/s)
[INFO] Downloading from central: https://repo.maven.apache.org/maven2/org/apache/maven/maven-core/3.0/maven-core-3.0.pom
[INFO] Downloaded from central: https://repo.maven.apache.org/maven2/org/apache/maven/maven-core/3.0/maven-core-3.0.pom (6.6 kB at 474 kB/s)
[INFO] Downloading from central: https://repo.maven.apache.org/maven2/org/apache/maven/maven-settings/3.0/maven-settings-3.0.pom
[INFO] Downloaded from central: https://repo.maven.apache.org/maven2/org/apache/maven/maven-settings/3.0/maven-settings-3.0.pom (1.9 kB at 145 kB/s)
[INFO] Downloading from central: https://repo.maven.apache.org/maven2/org/apache/maven/maven-settings-builder/3.0/maven-settings-builder-3.0.pom
[INFO] Downloaded from central: https://repo.maven.apache.org/maven2/org/apache/maven/maven-settings-builder/3.0/maven-settings-builder-3.0.pom (2.2 kB at 159 kB/s)
[INFO] Downloading from central: https://repo.maven.apache.org/maven2/org/codehaus/plexus/plexus-interpolation/1.14/plexus-interpolation-1.14.pom
[INFO] Downloaded from central: https://repo.maven.apache.org/maven2/org/codehaus/plexus/plexus-interpolation/1.14/plexus-interpolation-1.14.pom (910 B at 65 kB/s)
[INFO] Downloading from central: https://repo.maven.apache.org/maven2/org/codehaus/plexus/plexus-components/1.1.18/plexus-components-1.1.18.pom
[INFO] Downloaded from central: https://repo.maven.apache.org/maven2/org/codehaus/plexus/plexus-components/1.1.18/plexus-components-1.1.18.pom (5.4 kB at 382 kB/s)
[INFO] Downloading from central: https://repo.maven.apache.org/maven2/org/apache/maven/maven-repository-metadata/3.0/maven-repository-metadata-3.0.pom
[INFO] Downloaded from central: https://repo.maven.apache.org/maven2/org/apache/maven/maven-repository-metadata/3.0/maven-repository-metadata-3.0.pom (1.9 kB at 148 kB/s)
[INFO] Downloading from central: https://repo.maven.apache.org/maven2/org/apache/maven/maven-model-builder/3.0/maven-model-builder-3.0.pom
[INFO] Downloaded from central: https://repo.maven.apache.org/maven2/org/apache/maven/maven-model-builder/3.0/maven-model-builder-3.0.pom (2.2 kB at 173 kB/s)
[INFO] Downloading from central: https://repo.maven.apache.org/maven2/org/apache/maven/maven-aether-provider/3.0/maven-aether-provider-3.0.pom
[INFO] Downloaded from central: https://repo.maven.apache.org/maven2/org/apache/maven/maven-aether-provider/3.0/maven-aether-provider-3.0.pom (2.5 kB at 190 kB/s)
[INFO] Downloading from central: https://repo.maven.apache.org/maven2/org/sonatype/aether/aether-api/1.7/aether-api-1.7.pom
[INFO] Downloaded from central: https://repo.maven.apache.org/maven2/org/sonatype/aether/aether-api/1.7/aether-api-1.7.pom (1.7 kB at 129 kB/s)
[INFO] Downloading from central: https://repo.maven.apache.org/maven2/org/sonatype/aether/aether-parent/1.7/aether-parent-1.7.pom
[INFO] Downloaded from central: https://repo.maven.apache.org/maven2/org/sonatype/aether/aether-parent/1.7/aether-parent-1.7.pom (7.7 kB at 515 kB/s)
[INFO] Downloading from central: https://repo.maven.apache.org/maven2/org/sonatype/aether/aether-util/1.7/aether-util-1.7.pom
[INFO] Downloaded from central: https://repo.maven.apache.org/maven2/org/sonatype/aether/aether-util/1.7/aether-util-1.7.pom (2.1 kB at 147 kB/s)
[INFO] Downloading from central: https://repo.maven.apache.org/maven2/org/sonatype/aether/aether-impl/1.7/aether-impl-1.7.pom
[INFO] Downloaded from central: https://repo.maven.apache.org/maven2/org/sonatype/aether/aether-impl/1.7/aether-impl-1.7.pom (3.7 kB at 264 kB/s)
[INFO] Downloading from central: https://repo.maven.apache.org/maven2/org/sonatype/aether/aether-spi/1.7/aether-spi-1.7.pom
[INFO] Downloaded from central: https://repo.maven.apache.org/maven2/org/sonatype/aether/aether-spi/1.7/aether-spi-1.7.pom (1.7 kB at 134 kB/s)
[INFO] Downloading from central: https://repo.maven.apache.org/maven2/org/apache/maven/shared/maven-shared-utils/3.2.1/maven-shared-utils-3.2.1.pom
[INFO] Downloaded from central: https://repo.maven.apache.org/maven2/org/apache/maven/shared/maven-shared-utils/3.2.1/maven-shared-utils-3.2.1.pom (5.6 kB at 402 kB/s)
[INFO] Downloading from central: https://repo.maven.apache.org/maven2/org/codehaus/plexus/plexus-java/0.9.10/plexus-java-0.9.10.pom
[INFO] Downloaded from central: https://repo.maven.apache.org/maven2/org/codehaus/plexus/plexus-java/0.9.10/plexus-java-0.9.10.pom (5.1 kB at 365 kB/s)
[INFO] Downloading from central: https://repo.maven.apache.org/maven2/org/codehaus/plexus/plexus-languages/0.9.10/plexus-languages-0.9.10.pom
[INFO] Downloaded from central: https://repo.maven.apache.org/maven2/org/codehaus/plexus/plexus-languages/0.9.10/plexus-languages-0.9.10.pom (4.1 kB at 296 kB/s)
[INFO] Downloading from central: https://repo.maven.apache.org/maven2/org/ow2/asm/asm/6.2/asm-6.2.pom
[INFO] Downloaded from central: https://repo.maven.apache.org/maven2/org/ow2/asm/asm/6.2/asm-6.2.pom (2.9 kB at 210 kB/s)
[INFO] Downloading from central: https://repo.maven.apache.org/maven2/org/ow2/ow2/1.5/ow2-1.5.pom
[INFO] Downloaded from central: https://repo.maven.apache.org/maven2/org/ow2/ow2/1.5/ow2-1.5.pom (11 kB at 702 kB/s)
[INFO] Downloading from central: https://repo.maven.apache.org/maven2/com/thoughtworks/qdox/qdox/2.0-M9/qdox-2.0-M9.pom
[INFO] Downloaded from central: https://repo.maven.apache.org/maven2/com/thoughtworks/qdox/qdox/2.0-M9/qdox-2.0-M9.pom (16 kB at 990 kB/s)
[INFO] Downloading from central: https://repo.maven.apache.org/maven2/org/sonatype/oss/oss-parent/9/oss-parent-9.pom
[INFO] Downloaded from central: https://repo.maven.apache.org/maven2/org/sonatype/oss/oss-parent/9/oss-parent-9.pom (6.6 kB at 505 kB/s)
[INFO] Downloading from central: https://repo.maven.apache.org/maven2/org/codehaus/plexus/plexus-compiler-api/2.8.4/plexus-compiler-api-2.8.4.pom
[INFO] Downloaded from central: https://repo.maven.apache.org/maven2/org/codehaus/plexus/plexus-compiler-api/2.8.4/plexus-compiler-api-2.8.4.pom (867 B at 67 kB/s)
[INFO] Downloading from central: https://repo.maven.apache.org/maven2/org/codehaus/plexus/plexus-compiler/2.8.4/plexus-compiler-2.8.4.pom
[INFO] Downloaded from central: https://repo.maven.apache.org/maven2/org/codehaus/plexus/plexus-compiler/2.8.4/plexus-compiler-2.8.4.pom (6.0 kB at 464 kB/s)
[INFO] Downloading from central: https://repo.maven.apache.org/maven2/org/codehaus/plexus/plexus-components/4.0/plexus-components-4.0.pom
[INFO] Downloaded from central: https://repo.maven.apache.org/maven2/org/codehaus/plexus/plexus-components/4.0/plexus-components-4.0.pom (2.7 kB at 221 kB/s)
[INFO] Downloading from central: https://repo.maven.apache.org/maven2/org/codehaus/plexus/plexus-utils/3.0.22/plexus-utils-3.0.22.pom
[INFO] Downloaded from central: https://repo.maven.apache.org/maven2/org/codehaus/plexus/plexus-utils/3.0.22/plexus-utils-3.0.22.pom (3.8 kB at 295 kB/s)
[INFO] Downloading from central: https://repo.maven.apache.org/maven2/org/codehaus/plexus/plexus-compiler-manager/2.8.4/plexus-compiler-manager-2.8.4.pom
[INFO] Downloaded from central: https://repo.maven.apache.org/maven2/org/codehaus/plexus/plexus-compiler-manager/2.8.4/plexus-compiler-manager-2.8.4.pom (692 B at 53 kB/s)
[INFO] Downloading from central: https://repo.maven.apache.org/maven2/org/codehaus/plexus/plexus-compiler-javac/2.8.4/plexus-compiler-javac-2.8.4.pom
[INFO] Downloaded from central: https://repo.maven.apache.org/maven2/org/codehaus/plexus/plexus-compiler-javac/2.8.4/plexus-compiler-javac-2.8.4.pom (771 B at 59 kB/s)
[INFO] Downloading from central: https://repo.maven.apache.org/maven2/org/codehaus/plexus/plexus-compilers/2.8.4/plexus-compilers-2.8.4.pom
[INFO] Downloaded from central: https://repo.maven.apache.org/maven2/org/codehaus/plexus/plexus-compilers/2.8.4/plexus-compilers-2.8.4.pom (1.3 kB at 103 kB/s)
[INFO] Downloading from central: https://repo.maven.apache.org/maven2/org/apache/maven/maven-plugin-api/3.0/maven-plugin-api-3.0.jar
[INFO] Downloading from central: https://repo.maven.apache.org/maven2/org/apache/maven/maven-model/3.0/maven-model-3.0.jar
[INFO] Downloading from central: https://repo.maven.apache.org/maven2/org/sonatype/sisu/sisu-inject-bean/1.4.2/sisu-inject-bean-1.4.2.jar
[INFO] Downloading from central: https://repo.maven.apache.org/maven2/org/sonatype/sisu/sisu-inject-plexus/1.4.2/sisu-inject-plexus-1.4.2.jar
[INFO] Downloading from central: https://repo.maven.apache.org/maven2/org/sonatype/sisu/sisu-guice/2.1.7/sisu-guice-2.1.7-noaop.jar
[INFO] Downloaded from central: https://repo.maven.apache.org/maven2/org/sonatype/sisu/sisu-inject-bean/1.4.2/sisu-inject-bean-1.4.2.jar (153 kB at 4.8 MB/s)
[INFO] Downloading from central: https://repo.maven.apache.org/maven2/org/apache/maven/maven-artifact/3.0/maven-artifact-3.0.jar
[INFO] Downloaded from central: https://repo.maven.apache.org/maven2/org/apache/maven/maven-plugin-api/3.0/maven-plugin-api-3.0.jar (49 kB at 941 kB/s)
[INFO] Downloading from central: https://repo.maven.apache.org/maven2/org/codehaus/plexus/plexus-utils/2.0.4/plexus-utils-2.0.4.jar
[INFO] Downloaded from central: https://repo.maven.apache.org/maven2/org/apache/maven/maven-artifact/3.0/maven-artifact-3.0.jar (52 kB at 998 kB/s)
[INFO] Downloading from central: https://repo.maven.apache.org/maven2/org/apache/maven/maven-core/3.0/maven-core-3.0.jar
[INFO] Downloaded from central: https://repo.maven.apache.org/maven2/org/apache/maven/maven-model/3.0/maven-model-3.0.jar (165 kB at 2.4 MB/s)
[INFO] Downloading from central: https://repo.maven.apache.org/maven2/org/apache/maven/maven-settings/3.0/maven-settings-3.0.jar
[INFO] Downloaded from central: https://repo.maven.apache.org/maven2/org/sonatype/sisu/sisu-inject-plexus/1.4.2/sisu-inject-plexus-1.4.2.jar (202 kB at 2.8 MB/s)
[INFO] Downloading from central: https://repo.maven.apache.org/maven2/org/apache/maven/maven-settings-builder/3.0/maven-settings-builder-3.0.jar
[INFO] Downloaded from central: https://repo.maven.apache.org/maven2/org/apache/maven/maven-settings/3.0/maven-settings-3.0.jar (47 kB at 507 kB/s)
[INFO] Downloaded from central: https://repo.maven.apache.org/maven2/org/apache/maven/maven-settings-builder/3.0/maven-settings-builder-3.0.jar (38 kB at 411 kB/s)
[INFO] Downloading from central: https://repo.maven.apache.org/maven2/org/apache/maven/maven-repository-metadata/3.0/maven-repository-metadata-3.0.jar
[INFO] Downloading from central: https://repo.maven.apache.org/maven2/org/apache/maven/maven-model-builder/3.0/maven-model-builder-3.0.jar
[INFO] Downloaded from central: https://repo.maven.apache.org/maven2/org/codehaus/plexus/plexus-utils/2.0.4/plexus-utils-2.0.4.jar (222 kB at 2.4 MB/s)
[INFO] Downloading from central: https://repo.maven.apache.org/maven2/org/apache/maven/maven-aether-provider/3.0/maven-aether-provider-3.0.jar
[INFO] Downloaded from central: https://repo.maven.apache.org/maven2/org/sonatype/sisu/sisu-guice/2.1.7/sisu-guice-2.1.7-noaop.jar (472 kB at 4.9 MB/s)
[INFO] Downloading from central: https://repo.maven.apache.org/maven2/org/sonatype/aether/aether-impl/1.7/aether-impl-1.7.jar
[INFO] Downloaded from central: https://repo.maven.apache.org/maven2/org/apache/maven/maven-repository-metadata/3.0/maven-repository-metadata-3.0.jar (30 kB at 284 kB/s)
[INFO] Downloading from central: https://repo.maven.apache.org/maven2/org/sonatype/aether/aether-spi/1.7/aether-spi-1.7.jar
[INFO] Downloaded from central: https://repo.maven.apache.org/maven2/org/apache/maven/maven-aether-provider/3.0/maven-aether-provider-3.0.jar (51 kB at 470 kB/s)
[INFO] Downloading from central: https://repo.maven.apache.org/maven2/org/sonatype/aether/aether-api/1.7/aether-api-1.7.jar
[INFO] Downloaded from central: https://repo.maven.apache.org/maven2/org/apache/maven/maven-core/3.0/maven-core-3.0.jar (527 kB at 4.4 MB/s)
[INFO] Downloaded from central: https://repo.maven.apache.org/maven2/org/sonatype/aether/aether-impl/1.7/aether-impl-1.7.jar (106 kB at 886 kB/s)
[INFO] Downloading from central: https://repo.maven.apache.org/maven2/org/sonatype/aether/aether-util/1.7/aether-util-1.7.jar
[INFO] Downloading from central: https://repo.maven.apache.org/maven2/org/codehaus/plexus/plexus-interpolation/1.14/plexus-interpolation-1.14.jar
[INFO] Downloaded from central: https://repo.maven.apache.org/maven2/org/apache/maven/maven-model-builder/3.0/maven-model-builder-3.0.jar (148 kB at 1.2 MB/s)
[INFO] Downloading from central: https://repo.maven.apache.org/maven2/org/codehaus/plexus/plexus-classworlds/2.2.3/plexus-classworlds-2.2.3.jar
[INFO] Downloaded from central: https://repo.maven.apache.org/maven2/org/sonatype/aether/aether-spi/1.7/aether-spi-1.7.jar (14 kB at 108 kB/s)
[INFO] Downloading from central: https://repo.maven.apache.org/maven2/org/codehaus/plexus/plexus-component-annotations/1.7.1/plexus-component-annotations-1.7.1.jar
[INFO] Downloaded from central: https://repo.maven.apache.org/maven2/org/sonatype/aether/aether-api/1.7/aether-api-1.7.jar (74 kB at 571 kB/s)
[INFO] Downloading from central: https://repo.maven.apache.org/maven2/org/apache/maven/shared/maven-shared-utils/3.2.1/maven-shared-utils-3.2.1.jar
[INFO] Downloaded from central: https://repo.maven.apache.org/maven2/org/codehaus/plexus/plexus-interpolation/1.14/plexus-interpolation-1.14.jar (61 kB at 439 kB/s)
[INFO] Downloaded from central: https://repo.maven.apache.org/maven2/org/codehaus/plexus/plexus-component-annotations/1.7.1/plexus-component-annotations-1.7.1.jar (4.3 kB at 31 kB/s)
[INFO] Downloading from central: https://repo.maven.apache.org/maven2/org/codehaus/plexus/plexus-java/0.9.10/plexus-java-0.9.10.jar
[INFO] Downloaded from central: https://repo.maven.apache.org/maven2/org/sonatype/aether/aether-util/1.7/aether-util-1.7.jar (108 kB at 777 kB/s)
[INFO] Downloaded from central: https://repo.maven.apache.org/maven2/org/codehaus/plexus/plexus-classworlds/2.2.3/plexus-classworlds-2.2.3.jar (46 kB at 329 kB/s)
[INFO] Downloading from central: https://repo.maven.apache.org/maven2/org/ow2/asm/asm/6.2/asm-6.2.jar
[INFO] Downloading from central: https://repo.maven.apache.org/maven2/org/codehaus/plexus/plexus-compiler-api/2.8.4/plexus-compiler-api-2.8.4.jar
[INFO] Downloading from central: https://repo.maven.apache.org/maven2/com/thoughtworks/qdox/qdox/2.0-M9/qdox-2.0-M9.jar
[INFO] Downloaded from central: https://repo.maven.apache.org/maven2/org/codehaus/plexus/plexus-java/0.9.10/plexus-java-0.9.10.jar (39 kB at 254 kB/s)
[INFO] Downloaded from central: https://repo.maven.apache.org/maven2/org/apache/maven/shared/maven-shared-utils/3.2.1/maven-shared-utils-3.2.1.jar (167 kB at 1.1 MB/s)
[INFO] Downloading from central: https://repo.maven.apache.org/maven2/org/codehaus/plexus/plexus-compiler-javac/2.8.4/plexus-compiler-javac-2.8.4.jar
[INFO] Downloaded from central: https://repo.maven.apache.org/maven2/org/codehaus/plexus/plexus-compiler-api/2.8.4/plexus-compiler-api-2.8.4.jar (27 kB at 174 kB/s)
[INFO] Downloading from central: https://repo.maven.apache.org/maven2/org/codehaus/plexus/plexus-compiler-manager/2.8.4/plexus-compiler-manager-2.8.4.jar
[INFO] Downloaded from central: https://repo.maven.apache.org/maven2/org/ow2/asm/asm/6.2/asm-6.2.jar (111 kB at 691 kB/s)
[INFO] Downloaded from central: https://repo.maven.apache.org/maven2/org/codehaus/plexus/plexus-compiler-javac/2.8.4/plexus-compiler-javac-2.8.4.jar (21 kB at 127 kB/s)
[INFO] Downloaded from central: https://repo.maven.apache.org/maven2/org/codehaus/plexus/plexus-compiler-manager/2.8.4/plexus-compiler-manager-2.8.4.jar (4.7 kB at 28 kB/s)
[INFO] Downloaded from central: https://repo.maven.apache.org/maven2/com/thoughtworks/qdox/qdox/2.0-M9/qdox-2.0-M9.jar (317 kB at 1.8 MB/s)
[INFO] No sources to compile
[INFO]
[INFO] --- maven-resources-plugin:2.6:testResources (default-testResources) @ supplemental-models ---
[WARNING] Using platform encoding (ISO-8859-1 actually) to copy filtered resources, i.e. build is platform dependent!
[INFO] skip non existing resourceDirectory /home/jenkins/jenkins-slave/workspace/resources-plugin_MRRESOURCES-112@2/linux-jdk12-m3.5.x_build/target/test-classes/supplemental-artifact/resource-projects/supplemental-models/src/test/resources
[INFO]
[INFO] --- maven-compiler-plugin:3.8.0:testCompile (default-testCompile) @ supplemental-models ---
[INFO] No sources to compile
[INFO]
[INFO] --- maven-surefire-plugin:2.12.4:test (default-test) @ supplemental-models ---
[INFO] No tests to run.
[INFO]
[INFO] --- maven-jar-plugin:2.4:jar (default-jar) @ supplemental-models ---
[INFO] Building jar: /home/jenkins/jenkins-slave/workspace/resources-plugin_MRRESOURCES-112@2/linux-jdk12-m3.5.x_build/target/test-classes/supplemental-artifact/resource-projects/supplemental-models/target/supplemental-models-1.jar
[INFO]
[INFO] --- maven-install-plugin:2.4:install (default-install) @ supplemental-models ---
[INFO] Installing /home/jenkins/jenkins-slave/workspace/resources-plugin_MRRESOURCES-112@2/linux-jdk12-m3.5.x_build/target/test-classes/supplemental-artifact/resource-projects/supplemental-models/target/supplemental-models-1.jar to /home/jenkins/jenkins-slave/workspace/resources-plugin_MRRESOURCES-112@2/linux-jdk12-m3.5.x_build/target/it-repo/org/apache/maven/plugin/rresource/it/mrr43/supplemental-models/1/supplemental-models-1.jar
[INFO] Installing /home/jenkins/jenkins-slave/workspace/resources-plugin_MRRESOURCES-112@2/linux-jdk12-m3.5.x_build/target/test-classes/supplemental-artifact/resource-projects/supplemental-models/pom.xml to /home/jenkins/jenkins-slave/workspace/resources-plugin_MRRESOURCES-112@2/linux-jdk12-m3.5.x_build/target/it-repo/org/apache/maven/plugin/rresource/it/mrr43/supplemental-models/1/supplemental-models-1.pom
[INFO]
[INFO] --- maven-deploy-plugin:2.7:deploy (default-deploy) @ supplemental-models ---
[INFO] Uploading to it-remote: file:/home/jenkins/jenkins-slave/workspace/resources-plugin_MRRESOURCES-112@2/linux-jdk12-m3.5.x_build/target/remote-repo/org/apache/maven/plugin/rresource/it/mrr43/supplemental-models/1/supplemental-models-1.jar
[INFO] Uploaded to it-remote: file:/home/jenkins/jenkins-slave/workspace/resources-plugin_MRRESOURCES-112@2/linux-jdk12-m3.5.x_build/target/remote-repo/org/apache/maven/plugin/rresource/it/mrr43/supplemental-models/1/supplemental-models-1.jar (2.9 kB at 1.5 MB/s)
[INFO] Uploading to it-remote: file:/home/jenkins/jenkins-slave/workspace/resources-plugin_MRRESOURCES-112@2/linux-jdk12-m3.5.x_build/target/remote-repo/org/apache/maven/plugin/rresource/it/mrr43/supplemental-models/1/supplemental-models-1.pom
[INFO] Uploaded to it-remote: file:/home/jenkins/jenkins-slave/workspace/resources-plugin_MRRESOURCES-112@2/linux-jdk12-m3.5.x_build/target/remote-repo/org/apache/maven/plugin/rresource/it/mrr43/supplemental-models/1/supplemental-models-1.pom (1.3 kB at 1.3 MB/s)
[INFO] Downloading from it-remote: file:/home/jenkins/jenkins-slave/workspace/resources-plugin_MRRESOURCES-112@2/linux-jdk12-m3.5.x_build/target/remote-repo/org/apache/maven/plugin/rresource/it/mrr43/supplemental-models/maven-metadata.xml
[INFO] Uploading to it-remote: file:/home/jenkins/jenkins-slave/workspace/resources-plugin_MRRESOURCES-112@2/linux-jdk12-m3.5.x_build/target/remote-repo/org/apache/maven/plugin/rresource/it/mrr43/supplemental-models/maven-metadata.xml
[INFO] Uploaded to it-remote: file:/home/jenkins/jenkins-slave/workspace/resources-plugin_MRRESOURCES-112@2/linux-jdk12-m3.5.x_build/target/remote-repo/org/apache/maven/plugin/rresource/it/mrr43/supplemental-models/maven-metadata.xml (333 B at 333 kB/s)
[INFO]
[INFO] ------< org.apache.maven.plugin.rresource.it.mrr43:deficient-dep >------
[INFO] Building deficient-dep 1 [3/3]
[INFO] --------------------------------[ jar ]---------------------------------
[INFO]
[INFO] --- maven-clean-plugin:2.5:clean (default-cli) @ deficient-dep ---
[INFO]
[INFO] --- maven-resources-plugin:2.6:resources (default-resources) @ deficient-dep ---
[WARNING] Using platform encoding (ISO-8859-1 actually) to copy filtered resources, i.e. build is platform dependent!
[INFO] skip non existing resourceDirectory /home/jenkins/jenkins-slave/workspace/resources-plugin_MRRESOURCES-112@2/linux-jdk12-m3.5.x_build/target/test-classes/supplemental-artifact/resource-projects/deficient-dep/src/main/resources
[INFO]
[INFO] --- maven-compiler-plugin:3.8.0:compile (default-compile) @ deficient-dep ---
[INFO] Changes detected - recompiling the module!
[WARNING] File encoding has not been set, using platform encoding ISO-8859-1, i.e. build is platform dependent!
[INFO] Compiling 1 source file to /home/jenkins/jenkins-slave/workspace/resources-plugin_MRRESOURCES-112@2/linux-jdk12-m3.5.x_build/target/test-classes/supplemental-artifact/resource-projects/deficient-dep/target/classes
[INFO] -------------------------------------------------------------
[ERROR] COMPILATION ERROR :
[INFO] -------------------------------------------------------------
[ERROR] Source option 6 is no longer supported. Use 7 or later.
[ERROR] Target option 6 is no longer supported. Use 7 or later.
[INFO] 2 errors
[INFO] -------------------------------------------------------------
[INFO] ------------------------------------------------------------------------
[INFO] Reactor Summary:
[INFO]
[INFO] resources 1 ........................................ SUCCESS [ 0.423 s]
[INFO] supplemental-models ................................ SUCCESS [ 2.568 s]
[INFO] deficient-dep 1 .................................... FAILURE [ 0.411 s]
[INFO] ------------------------------------------------------------------------
[INFO] BUILD FAILURE
[INFO] ------------------------------------------------------------------------
[INFO] Total time: 3.593 s
[INFO] Finished at: 2019-03-15T10:43:23Z
[INFO] ------------------------------------------------------------------------
[ERROR] Failed to execute goal org.apache.maven.plugins:maven-compiler-plugin:3.8.0:compile (default-compile) on project deficient-dep: Compilation failure: Compilation failure:
[ERROR] Source option 6 is no longer supported. Use 7 or later.
[ERROR] Target option 6 is no longer supported. Use 7 or later.
[ERROR] -> [Help 1]
org.apache.maven.lifecycle.LifecycleExecutionException: Failed to execute goal org.apache.maven.plugins:maven-compiler-plugin:3.8.0:compile (default-compile) on project deficient-dep: Compilation failure
at org.apache.maven.lifecycle.internal.MojoExecutor.execute (MojoExecutor.java:213)
at org.apache.maven.lifecycle.internal.MojoExecutor.execute (MojoExecutor.java:154)
at org.apache.maven.lifecycle.internal.MojoExecutor.execute (MojoExecutor.java:146)
at org.apache.maven.lifecycle.internal.LifecycleModuleBuilder.buildProject (LifecycleModuleBuilder.java:117)
at org.apache.maven.lifecycle.internal.LifecycleModuleBuilder.buildProject (LifecycleModuleBuilder.java:81)
at org.apache.maven.lifecycle.internal.builder.singlethreaded.SingleThreadedBuilder.build (SingleThreadedBuilder.java:56)
at org.apache.maven.lifecycle.internal.LifecycleStarter.execute (LifecycleStarter.java:128)
at org.apache.maven.DefaultMaven.doExecute (DefaultMaven.java:305)
at org.apache.maven.DefaultMaven.doExecute (DefaultMaven.java:192)
at org.apache.maven.DefaultMaven.execute (DefaultMaven.java:105)
at org.apache.maven.cli.MavenCli.execute (MavenCli.java:954)
at org.apache.maven.cli.MavenCli.doMain (MavenCli.java:288)
at org.apache.maven.cli.MavenCli.main (MavenCli.java:192)
at jdk.internal.reflect.NativeMethodAccessorImpl.invoke0 (Native Method)
at jdk.internal.reflect.NativeMethodAccessorImpl.invoke (NativeMethodAccessorImpl.java:62)
at jdk.internal.reflect.DelegatingMethodAccessorImpl.invoke (DelegatingMethodAccessorImpl.java:43)
at java.lang.reflect.Method.invoke (Method.java:567)
at org.codehaus.plexus.classworlds.launcher.Launcher.launchEnhanced (Launcher.java:289)
at org.codehaus.plexus.classworlds.launcher.Launcher.launch (Launcher.java:229)
at org.codehaus.plexus.classworlds.launcher.Launcher.mainWithExitCode (Launcher.java:415)
at org.codehaus.plexus.classworlds.launcher.Launcher.main (Launcher.java:356)
Caused by: org.apache.maven.plugin.compiler.CompilationFailureException: Compilation failure
at org.apache.maven.plugin.compiler.AbstractCompilerMojo.execute (AbstractCompilerMojo.java:1215)
at org.apache.maven.plugin.compiler.CompilerMojo.execute (CompilerMojo.java:188)
at org.apache.maven.plugin.DefaultBuildPluginManager.executeMojo (DefaultBuildPluginManager.java:137)
at org.apache.maven.lifecycle.internal.MojoExecutor.execute (MojoExecutor.java:208)
at org.apache.maven.lifecycle.internal.MojoExecutor.execute (MojoExecutor.java:154)
at org.apache.maven.lifecycle.internal.MojoExecutor.execute (MojoExecutor.java:146)
at org.apache.maven.lifecycle.internal.LifecycleModuleBuilder.buildProject (LifecycleModuleBuilder.java:117)
at org.apache.maven.lifecycle.internal.LifecycleModuleBuilder.buildProject (LifecycleModuleBuilder.java:81)
at org.apache.maven.lifecycle.internal.builder.singlethreaded.SingleThreadedBuilder.build (SingleThreadedBuilder.java:56)
at org.apache.maven.lifecycle.internal.LifecycleStarter.execute (LifecycleStarter.java:128)
at org.apache.maven.DefaultMaven.doExecute (DefaultMaven.java:305)
at org.apache.maven.DefaultMaven.doExecute (DefaultMaven.java:192)
at org.apache.maven.DefaultMaven.execute (DefaultMaven.java:105)
at org.apache.maven.cli.MavenCli.execute (MavenCli.java:954)
at org.apache.maven.cli.MavenCli.doMain (MavenCli.java:288)
at org.apache.maven.cli.MavenCli.main (MavenCli.java:192)
at jdk.internal.reflect.NativeMethodAccessorImpl.invoke0 (Native Method)
at jdk.internal.reflect.NativeMethodAccessorImpl.invoke (NativeMethodAccessorImpl.java:62)
at jdk.internal.reflect.DelegatingMethodAccessorImpl.invoke (DelegatingMethodAccessorImpl.java:43)
at java.lang.reflect.Method.invoke (Method.java:567)
at org.codehaus.plexus.classworlds.launcher.Launcher.launchEnhanced (Launcher.java:289)
at org.codehaus.plexus.classworlds.launcher.Launcher.launch (Launcher.java:229)
at org.codehaus.plexus.classworlds.launcher.Launcher.mainWithExitCode (Launcher.java:415)
at org.codehaus.plexus.classworlds.launcher.Launcher.main (Launcher.java:356)
[ERROR]
[ERROR] Re-run Maven using the -X switch to enable full debug logging.
[ERROR]
[ERROR] For more information about the errors and possible solutions, please read the following articles:
[ERROR] [Help 1] http://cwiki.apache.org/confluence/display/MAVEN/MojoFailureException
[ERROR]
[ERROR] After correcting the problems, you can resume the build with the command
[ERROR] mvn <goals> -rf :deficient-dep
Stack Trace:
org.apache.maven.it.VerificationException:
Exit code was non-zero: 1; command line and log =
/home/jenkins/tools/maven/apache-maven-3.5.4/bin/mvn -e --batch-mode -Dhttps.protocols=TLSv1.2 -Dmaven.repo.local=/home/jenkins/jenkins-slave/workspace/resources-plugin_MRRESOURCES-112@2/linux-jdk12-m3.5.x_build/target/it-repo org.apache.maven.plugins:maven-clean-plugin:clean deploy
Picked up JAVA_TOOL_OPTIONS: -Dmaven.ext.class.path="/home/jenkins/jenkins-slave/workspace/resources-plugin_MRRESOURCES-112@2@tmp/withMavenb0cd0e7f/pipeline-maven-spy.jar" -Dorg.jenkinsci.plugins.pipeline.maven.reportsFolder="/home/jenkins/jenkins-slave/workspace/resources-plugin_MRRESOURCES-112@2@tmp/withMavenb0cd0e7f"
[INFO] [jenkins-event-spy] Jenkins Maven Event Spy is disabled
[INFO] Error stacktraces are turned on.
[INFO] Scanning for projects...
[INFO] ------------------------------------------------------------------------
[INFO] Reactor Build Order:
[INFO]
[INFO] resources [pom]
[INFO] supplemental-models [jar]
[INFO] deficient-dep [jar]
[INFO]
[INFO] --------< org.apache.maven.plugin.rresource.it.mrr43:resources >--------
[INFO] Building resources 1 [1/3]
[INFO] --------------------------------[ pom ]---------------------------------
[INFO]
[INFO] --- maven-clean-plugin:2.5:clean (default-cli) @ resources ---
[INFO]
[INFO] --- maven-install-plugin:2.4:install (default-install) @ resources ---
[INFO] Installing /home/jenkins/jenkins-slave/workspace/resources-plugin_MRRESOURCES-112@2/linux-jdk12-m3.5.x_build/target/test-classes/supplemental-artifact/resource-projects/pom.xml to /home/jenkins/jenkins-slave/workspace/resources-plugin_MRRESOURCES-112@2/linux-jdk12-m3.5.x_build/target/it-repo/org/apache/maven/plugin/rresource/it/mrr43/resources/1/resources-1.pom
[INFO]
[INFO] --- maven-deploy-plugin:2.7:deploy (default-deploy) @ resources ---
[INFO] Uploading to it-remote: file:/home/jenkins/jenkins-slave/workspace/resources-plugin_MRRESOURCES-112@2/linux-jdk12-m3.5.x_build/target/remote-repo/org/apache/maven/plugin/rresource/it/mrr43/resources/1/resources-1.pom
[INFO] Uploaded to it-remote: file:/home/jenkins/jenkins-slave/workspace/resources-plugin_MRRESOURCES-112@2/linux-jdk12-m3.5.x_build/target/remote-repo/org/apache/maven/plugin/rresource/it/mrr43/resources/1/resources-1.pom (1.9 kB at 127 kB/s)
[INFO] Downloading from it-remote: file:/home/jenkins/jenkins-slave/workspace/resources-plugin_MRRESOURCES-112@2/linux-jdk12-m3.5.x_build/target/remote-repo/org/apache/maven/plugin/rresource/it/mrr43/resources/maven-metadata.xml
[INFO] Uploading to it-remote: file:/home/jenkins/jenkins-slave/workspace/resources-plugin_MRRESOURCES-112@2/linux-jdk12-m3.5.x_build/target/remote-repo/org/apache/maven/plugin/rresource/it/mrr43/resources/maven-metadata.xml
[INFO] Uploaded to it-remote: file:/home/jenkins/jenkins-slave/workspace/resources-plugin_MRRESOURCES-112@2/linux-jdk12-m3.5.x_build/target/remote-repo/org/apache/maven/plugin/rresource/it/mrr43/resources/maven-metadata.xml (323 B at 323 kB/s)
[INFO]
[INFO] ---< org.apache.maven.plugin.rresource.it.mrr43:supplemental-models >---
[INFO] Building supplemental-models 1 [2/3]
[INFO] --------------------------------[ jar ]---------------------------------
[INFO] Downloading from central: https://repo.maven.apache.org/maven2/org/apache/maven/plugins/maven-compiler-plugin/3.8.0/maven-compiler-plugin-3.8.0.pom
[INFO] Downloaded from central: https://repo.maven.apache.org/maven2/org/apache/maven/plugins/maven-compiler-plugin/3.8.0/maven-compiler-plugin-3.8.0.pom (12 kB at 30 kB/s)
[INFO] Downloading from central: https://repo.maven.apache.org/maven2/org/apache/maven/plugins/maven-plugins/32/maven-plugins-32.pom
[INFO] Downloaded from central: https://repo.maven.apache.org/maven2/org/apache/maven/plugins/maven-plugins/32/maven-plugins-32.pom (11 kB at 534 kB/s)
[INFO] Downloading from central: https://repo.maven.apache.org/maven2/org/apache/maven/maven-parent/32/maven-parent-32.pom
[INFO] Downloaded from central: https://repo.maven.apache.org/maven2/org/apache/maven/maven-parent/32/maven-parent-32.pom (43 kB at 1.8 MB/s)
[INFO] Downloading from central: https://repo.maven.apache.org/maven2/org/apache/apache/20/apache-20.pom
[INFO] Downloaded from central: https://repo.maven.apache.org/maven2/org/apache/apache/20/apache-20.pom (16 kB at 991 kB/s)
[INFO] Downloading from central: https://repo.maven.apache.org/maven2/org/apache/maven/plugins/maven-compiler-plugin/3.8.0/maven-compiler-plugin-3.8.0.jar
[INFO] Downloaded from central: https://repo.maven.apache.org/maven2/org/apache/maven/plugins/maven-compiler-plugin/3.8.0/maven-compiler-plugin-3.8.0.jar (62 kB at 3.1 MB/s)
[INFO]
[INFO] --- maven-clean-plugin:2.5:clean (default-cli) @ supplemental-models ---
[INFO]
[INFO] --- maven-resources-plugin:2.6:resources (default-resources) @ supplemental-models ---
[WARNING] Using platform encoding (ISO-8859-1 actually) to copy filtered resources, i.e. build is platform dependent!
[INFO] Copying 1 resource
[INFO]
[INFO] --- maven-compiler-plugin:3.8.0:compile (default-compile) @ supplemental-models ---
[INFO] Downloading from central: https://repo.maven.apache.org/maven2/org/apache/maven/maven-plugin-api/3.0/maven-plugin-api-3.0.pom
[INFO] Downloaded from central: https://repo.maven.apache.org/maven2/org/apache/maven/maven-plugin-api/3.0/maven-plugin-api-3.0.pom (2.3 kB at 153 kB/s)
[INFO] Downloading from central: https://repo.maven.apache.org/maven2/org/apache/maven/maven/3.0/maven-3.0.pom
[INFO] Downloaded from central: https://repo.maven.apache.org/maven2/org/apache/maven/maven/3.0/maven-3.0.pom (22 kB at 608 kB/s)
[INFO] Downloading from central: https://repo.maven.apache.org/maven2/org/apache/maven/maven-parent/15/maven-parent-15.pom
[INFO] Downloaded from central: https://repo.maven.apache.org/maven2/org/apache/maven/maven-parent/15/maven-parent-15.pom (24 kB at 1.4 MB/s)
[INFO] Downloading from central: https://repo.maven.apache.org/maven2/org/apache/maven/maven-model/3.0/maven-model-3.0.pom
[INFO] Downloaded from central: https://repo.maven.apache.org/maven2/org/apache/maven/maven-model/3.0/maven-model-3.0.pom (3.9 kB at 299 kB/s)
[INFO] Downloading from central: https://repo.maven.apache.org/maven2/org/codehaus/plexus/plexus-utils/2.0.4/plexus-utils-2.0.4.pom
[INFO] Downloaded from central: https://repo.maven.apache.org/maven2/org/codehaus/plexus/plexus-utils/2.0.4/plexus-utils-2.0.4.pom (3.3 kB at 208 kB/s)
[INFO] Downloading from central: https://repo.maven.apache.org/maven2/org/apache/maven/maven-artifact/3.0/maven-artifact-3.0.pom
[INFO] Downloaded from central: https://repo.maven.apache.org/maven2/org/apache/maven/maven-artifact/3.0/maven-artifact-3.0.pom (1.9 kB at 148 kB/s)
[INFO] Downloading from central: https://repo.maven.apache.org/maven2/org/sonatype/sisu/sisu-inject-plexus/1.4.2/sisu-inject-plexus-1.4.2.pom
[INFO] Downloaded from central: https://repo.maven.apache.org/maven2/org/sonatype/sisu/sisu-inject-plexus/1.4.2/sisu-inject-plexus-1.4.2.pom (5.4 kB at 358 kB/s)
[INFO] Downloading from central: https://repo.maven.apache.org/maven2/org/sonatype/sisu/inject/guice-plexus/1.4.2/guice-plexus-1.4.2.pom
[INFO] Downloaded from central: https://repo.maven.apache.org/maven2/org/sonatype/sisu/inject/guice-plexus/1.4.2/guice-plexus-1.4.2.pom (3.1 kB at 184 kB/s)
[INFO] Downloading from central: https://repo.maven.apache.org/maven2/org/sonatype/sisu/inject/guice-bean/1.4.2/guice-bean-1.4.2.pom
[INFO] Downloaded from central: https://repo.maven.apache.org/maven2/org/sonatype/sisu/inject/guice-bean/1.4.2/guice-bean-1.4.2.pom (2.6 kB at 200 kB/s)
[INFO] Downloading from central: https://repo.maven.apache.org/maven2/org/sonatype/sisu/sisu-inject/1.4.2/sisu-inject-1.4.2.pom
[INFO] Downloaded from central: https://repo.maven.apache.org/maven2/org/sonatype/sisu/sisu-inject/1.4.2/sisu-inject-1.4.2.pom (1.2 kB at 89 kB/s)
[INFO] Downloading from central: https://repo.maven.apache.org/maven2/org/sonatype/sisu/sisu-parent/1.4.2/sisu-parent-1.4.2.pom
[INFO] Downloaded from central: https://repo.maven.apache.org/maven2/org/sonatype/sisu/sisu-parent/1.4.2/sisu-parent-1.4.2.pom (7.8 kB at 556 kB/s)
[INFO] Downloading from central: https://repo.maven.apache.org/maven2/org/sonatype/forge/forge-parent/6/forge-parent-6.pom
[INFO] Downloaded from central: https://repo.maven.apache.org/maven2/org/sonatype/forge/forge-parent/6/forge-parent-6.pom (11 kB at 717 kB/s)
[INFO] Downloading from central: https://repo.maven.apache.org/maven2/org/codehaus/plexus/plexus-component-annotations/1.7.1/plexus-component-annotations-1.7.1.pom
[INFO] Downloaded from central: https://repo.maven.apache.org/maven2/org/codehaus/plexus/plexus-component-annotations/1.7.1/plexus-component-annotations-1.7.1.pom (770 B at 55 kB/s)
[INFO] Downloading from central: https://repo.maven.apache.org/maven2/org/codehaus/plexus/plexus-containers/1.7.1/plexus-containers-1.7.1.pom
[INFO] Downloaded from central: https://repo.maven.apache.org/maven2/org/codehaus/plexus/plexus-containers/1.7.1/plexus-containers-1.7.1.pom (5.0 kB at 314 kB/s)
[INFO] Downloading from central: https://repo.maven.apache.org/maven2/org/codehaus/plexus/plexus-classworlds/2.2.3/plexus-classworlds-2.2.3.pom
[INFO] Downloaded from central: https://repo.maven.apache.org/maven2/org/codehaus/plexus/plexus-classworlds/2.2.3/plexus-classworlds-2.2.3.pom (4.0 kB at 307 kB/s)
[INFO] Downloading from central: https://repo.maven.apache.org/maven2/org/sonatype/sisu/sisu-inject-bean/1.4.2/sisu-inject-bean-1.4.2.pom
[INFO] Downloaded from central: https://repo.maven.apache.org/maven2/org/sonatype/sisu/sisu-inject-bean/1.4.2/sisu-inject-bean-1.4.2.pom (5.5 kB at 390 kB/s)
[INFO] Downloading from central: https://repo.maven.apache.org/maven2/org/sonatype/sisu/sisu-guice/2.1.7/sisu-guice-2.1.7.pom
[INFO] Downloaded from central: https://repo.maven.apache.org/maven2/org/sonatype/sisu/sisu-guice/2.1.7/sisu-guice-2.1.7.pom (11 kB at 790 kB/s)
[INFO] Downloading from central: https://repo.maven.apache.org/maven2/org/apache/maven/maven-core/3.0/maven-core-3.0.pom
[INFO] Downloaded from central: https://repo.maven.apache.org/maven2/org/apache/maven/maven-core/3.0/maven-core-3.0.pom (6.6 kB at 474 kB/s)
[INFO] Downloading from central: https://repo.maven.apache.org/maven2/org/apache/maven/maven-settings/3.0/maven-settings-3.0.pom
[INFO] Downloaded from central: https://repo.maven.apache.org/maven2/org/apache/maven/maven-settings/3.0/maven-settings-3.0.pom (1.9 kB at 145 kB/s)
[INFO] Downloading from central: https://repo.maven.apache.org/maven2/org/apache/maven/maven-settings-builder/3.0/maven-settings-builder-3.0.pom
[INFO] Downloaded from central: https://repo.maven.apache.org/maven2/org/apache/maven/maven-settings-builder/3.0/maven-settings-builder-3.0.pom (2.2 kB at 159 kB/s)
[INFO] Downloading from central: https://repo.maven.apache.org/maven2/org/codehaus/plexus/plexus-interpolation/1.14/plexus-interpolation-1.14.pom
[INFO] Downloaded from central: https://repo.maven.apache.org/maven2/org/codehaus/plexus/plexus-interpolation/1.14/plexus-interpolation-1.14.pom (910 B at 65 kB/s)
[INFO] Downloading from central: https://repo.maven.apache.org/maven2/org/codehaus/plexus/plexus-components/1.1.18/plexus-components-1.1.18.pom
[INFO] Downloaded from central: https://repo.maven.apache.org/maven2/org/codehaus/plexus/plexus-components/1.1.18/plexus-components-1.1.18.pom (5.4 kB at 382 kB/s)
[INFO] Downloading from central: https://repo.maven.apache.org/maven2/org/apache/maven/maven-repository-metadata/3.0/maven-repository-metadata-3.0.pom
[INFO] Downloaded from central: https://repo.maven.apache.org/maven2/org/apache/maven/maven-repository-metadata/3.0/maven-repository-metadata-3.0.pom (1.9 kB at 148 kB/s)
[INFO] Downloading from central: https://repo.maven.apache.org/maven2/org/apache/maven/maven-model-builder/3.0/maven-model-builder-3.0.pom
[INFO] Downloaded from central: https://repo.maven.apache.org/maven2/org/apache/maven/maven-model-builder/3.0/maven-model-builder-3.0.pom (2.2 kB at 173 kB/s)
[INFO] Downloading from central: https://repo.maven.apache.org/maven2/org/apache/maven/maven-aether-provider/3.0/maven-aether-provider-3.0.pom
[INFO] Downloaded from central: https://repo.maven.apache.org/maven2/org/apache/maven/maven-aether-provider/3.0/maven-aether-provider-3.0.pom (2.5 kB at 190 kB/s)
[INFO] Downloading from central: https://repo.maven.apache.org/maven2/org/sonatype/aether/aether-api/1.7/aether-api-1.7.pom
[INFO] Downloaded from central: https://repo.maven.apache.org/maven2/org/sonatype/aether/aether-api/1.7/aether-api-1.7.pom (1.7 kB at 129 kB/s)
[INFO] Downloading from central: https://repo.maven.apache.org/maven2/org/sonatype/aether/aether-parent/1.7/aether-parent-1.7.pom
[INFO] Downloaded from central: https://repo.maven.apache.org/maven2/org/sonatype/aether/aether-parent/1.7/aether-parent-1.7.pom (7.7 kB at 515 kB/s)
[INFO] Downloading from central: https://repo.maven.apache.org/maven2/org/sonatype/aether/aether-util/1.7/aether-util-1.7.pom
[INFO] Downloaded from central: https://repo.maven.apache.org/maven2/org/sonatype/aether/aether-util/1.7/aether-util-1.7.pom (2.1 kB at 147 kB/s)
[INFO] Downloading from central: https://repo.maven.apache.org/maven2/org/sonatype/aether/aether-impl/1.7/aether-impl-1.7.pom
[INFO] Downloaded from central: https://repo.maven.apache.org/maven2/org/sonatype/aether/aether-impl/1.7/aether-impl-1.7.pom (3.7 kB at 264 kB/s)
[INFO] Downloading from central: https://repo.maven.apache.org/maven2/org/sonatype/aether/aether-spi/1.7/aether-spi-1.7.pom
[INFO] Downloaded from central: https://repo.maven.apache.org/maven2/org/sonatype/aether/aether-spi/1.7/aether-spi-1.7.pom (1.7 kB at 134 kB/s)
[INFO] Downloading from central: https://repo.maven.apache.org/maven2/org/apache/maven/shared/maven-shared-utils/3.2.1/maven-shared-utils-3.2.1.pom
[INFO] Downloaded from central: https://repo.maven.apache.org/maven2/org/apache/maven/shared/maven-shared-utils/3.2.1/maven-shared-utils-3.2.1.pom (5.6 kB at 402 kB/s)
[INFO] Downloading from central: https://repo.maven.apache.org/maven2/org/codehaus/plexus/plexus-java/0.9.10/plexus-java-0.9.10.pom
[INFO] Downloaded from central: https://repo.maven.apache.org/maven2/org/codehaus/plexus/plexus-java/0.9.10/plexus-java-0.9.10.pom (5.1 kB at 365 kB/s)
[INFO] Downloading from central: https://repo.maven.apache.org/maven2/org/codehaus/plexus/plexus-languages/0.9.10/plexus-languages-0.9.10.pom
[INFO] Downloaded from central: https://repo.maven.apache.org/maven2/org/codehaus/plexus/plexus-languages/0.9.10/plexus-languages-0.9.10.pom (4.1 kB at 296 kB/s)
[INFO] Downloading from central: https://repo.maven.apache.org/maven2/org/ow2/asm/asm/6.2/asm-6.2.pom
[INFO] Downloaded from central: https://repo.maven.apache.org/maven2/org/ow2/asm/asm/6.2/asm-6.2.pom (2.9 kB at 210 kB/s)
[INFO] Downloading from central: https://repo.maven.apache.org/maven2/org/ow2/ow2/1.5/ow2-1.5.pom
[INFO] Downloaded from central: https://repo.maven.apache.org/maven2/org/ow2/ow2/1.5/ow2-1.5.pom (11 kB at 702 kB/s)
[INFO] Downloading from central: https://repo.maven.apache.org/maven2/com/thoughtworks/qdox/qdox/2.0-M9/qdox-2.0-M9.pom
[INFO] Downloaded from central: https://repo.maven.apache.org/maven2/com/thoughtworks/qdox/qdox/2.0-M9/qdox-2.0-M9.pom (16 kB at 990 kB/s)
[INFO] Downloading from central: https://repo.maven.apache.org/maven2/org/sonatype/oss/oss-parent/9/oss-parent-9.pom
[INFO] Downloaded from central: https://repo.maven.apache.org/maven2/org/sonatype/oss/oss-parent/9/oss-parent-9.pom (6.6 kB at 505 kB/s)
[INFO] Downloading from central: https://repo.maven.apache.org/maven2/org/codehaus/plexus/plexus-compiler-api/2.8.4/plexus-compiler-api-2.8.4.pom
[INFO] Downloaded from central: https://repo.maven.apache.org/maven2/org/codehaus/plexus/plexus-compiler-api/2.8.4/plexus-compiler-api-2.8.4.pom (867 B at 67 kB/s)
[INFO] Downloading from central: https://repo.maven.apache.org/maven2/org/codehaus/plexus/plexus-compiler/2.8.4/plexus-compiler-2.8.4.pom
[INFO] Downloaded from central: https://repo.maven.apache.org/maven2/org/codehaus/plexus/plexus-compiler/2.8.4/plexus-compiler-2.8.4.pom (6.0 kB at 464 kB/s)
[INFO] Downloading from central: https://repo.maven.apache.org/maven2/org/codehaus/plexus/plexus-components/4.0/plexus-components-4.0.pom
[INFO] Downloaded from central: https://repo.maven.apache.org/maven2/org/codehaus/plexus/plexus-components/4.0/plexus-components-4.0.pom (2.7 kB at 221 kB/s)
[INFO] Downloading from central: https://repo.maven.apache.org/maven2/org/codehaus/plexus/plexus-utils/3.0.22/plexus-utils-3.0.22.pom
[INFO] Downloaded from central: https://repo.maven.apache.org/maven2/org/codehaus/plexus/plexus-utils/3.0.22/plexus-utils-3.0.22.pom (3.8 kB at 295 kB/s)
[INFO] Downloading from central: https://repo.maven.apache.org/maven2/org/codehaus/plexus/plexus-compiler-manager/2.8.4/plexus-compiler-manager-2.8.4.pom
[INFO] Downloaded from central: https://repo.maven.apache.org/maven2/org/codehaus/plexus/plexus-compiler-manager/2.8.4/plexus-compiler-manager-2.8.4.pom (692 B at 53 kB/s)
[INFO] Downloading from central: https://repo.maven.apache.org/maven2/org/codehaus/plexus/plexus-compiler-javac/2.8.4/plexus-compiler-javac-2.8.4.pom
[INFO] Downloaded from central: https://repo.maven.apache.org/maven2/org/codehaus/plexus/plexus-compiler-javac/2.8.4/plexus-compiler-javac-2.8.4.pom (771 B at 59 kB/s)
[INFO] Downloading from central: https://repo.maven.apache.org/maven2/org/codehaus/plexus/plexus-compilers/2.8.4/plexus-compilers-2.8.4.pom
[INFO] Downloaded from central: https://repo.maven.apache.org/maven2/org/codehaus/plexus/plexus-compilers/2.8.4/plexus-compilers-2.8.4.pom (1.3 kB at 103 kB/s)
[INFO] Downloading from central: https://repo.maven.apache.org/maven2/org/apache/maven/maven-plugin-api/3.0/maven-plugin-api-3.0.jar
[INFO] Downloading from central: https://repo.maven.apache.org/maven2/org/apache/maven/maven-model/3.0/maven-model-3.0.jar
[INFO] Downloading from central: https://repo.maven.apache.org/maven2/org/sonatype/sisu/sisu-inject-bean/1.4.2/sisu-inject-bean-1.4.2.jar
[INFO] Downloading from central: https://repo.maven.apache.org/maven2/org/sonatype/sisu/sisu-inject-plexus/1.4.2/sisu-inject-plexus-1.4.2.jar
[INFO] Downloading from central: https://repo.maven.apache.org/maven2/org/sonatype/sisu/sisu-guice/2.1.7/sisu-guice-2.1.7-noaop.jar
[INFO] Downloaded from central: https://repo.maven.apache.org/maven2/org/sonatype/sisu/sisu-inject-bean/1.4.2/sisu-inject-bean-1.4.2.jar (153 kB at 4.8 MB/s)
[INFO] Downloading from central: https://repo.maven.apache.org/maven2/org/apache/maven/maven-artifact/3.0/maven-artifact-3.0.jar
[INFO] Downloaded from central: https://repo.maven.apache.org/maven2/org/apache/maven/maven-plugin-api/3.0/maven-plugin-api-3.0.jar (49 kB at 941 kB/s)
[INFO] Downloading from central: https://repo.maven.apache.org/maven2/org/codehaus/plexus/plexus-utils/2.0.4/plexus-utils-2.0.4.jar
[INFO] Downloaded from central: https://repo.maven.apache.org/maven2/org/apache/maven/maven-artifact/3.0/maven-artifact-3.0.jar (52 kB at 998 kB/s)
[INFO] Downloading from central: https://repo.maven.apache.org/maven2/org/apache/maven/maven-core/3.0/maven-core-3.0.jar
[INFO] Downloaded from central: https://repo.maven.apache.org/maven2/org/apache/maven/maven-model/3.0/maven-model-3.0.jar (165 kB at 2.4 MB/s)
[INFO] Downloading from central: https://repo.maven.apache.org/maven2/org/apache/maven/maven-settings/3.0/maven-settings-3.0.jar
[INFO] Downloaded from central: https://repo.maven.apache.org/maven2/org/sonatype/sisu/sisu-inject-plexus/1.4.2/sisu-inject-plexus-1.4.2.jar (202 kB at 2.8 MB/s)
[INFO] Downloading from central: https://repo.maven.apache.org/maven2/org/apache/maven/maven-settings-builder/3.0/maven-settings-builder-3.0.jar
[INFO] Downloaded from central: https://repo.maven.apache.org/maven2/org/apache/maven/maven-settings/3.0/maven-settings-3.0.jar (47 kB at 507 kB/s)
[INFO] Downloaded from central: https://repo.maven.apache.org/maven2/org/apache/maven/maven-settings-builder/3.0/maven-settings-builder-3.0.jar (38 kB at 411 kB/s)
[INFO] Downloading from central: https://repo.maven.apache.org/maven2/org/apache/maven/maven-repository-metadata/3.0/maven-repository-metadata-3.0.jar
[INFO] Downloading from central: https://repo.maven.apache.org/maven2/org/apache/maven/maven-model-builder/3.0/maven-model-builder-3.0.jar
[INFO] Downloaded from central: https://repo.maven.apache.org/maven2/org/codehaus/plexus/plexus-utils/2.0.4/plexus-utils-2.0.4.jar (222 kB at 2.4 MB/s)
[INFO] Downloading from central: https://repo.maven.apache.org/maven2/org/apache/maven/maven-aether-provider/3.0/maven-aether-provider-3.0.jar
[INFO] Downloaded from central: https://repo.maven.apache.org/maven2/org/sonatype/sisu/sisu-guice/2.1.7/sisu-guice-2.1.7-noaop.jar (472 kB at 4.9 MB/s)
[INFO] Downloading from central: https://repo.maven.apache.org/maven2/org/sonatype/aether/aether-impl/1.7/aether-impl-1.7.jar
[INFO] Downloaded from central: https://repo.maven.apache.org/maven2/org/apache/maven/maven-repository-metadata/3.0/maven-repository-metadata-3.0.jar (30 kB at 284 kB/s)
[INFO] Downloading from central: https://repo.maven.apache.org/maven2/org/sonatype/aether/aether-spi/1.7/aether-spi-1.7.jar
[INFO] Downloaded from central: https://repo.maven.apache.org/maven2/org/apache/maven/maven-aether-provider/3.0/maven-aether-provider-3.0.jar (51 kB at 470 kB/s)
[INFO] Downloading from central: https://repo.maven.apache.org/maven2/org/sonatype/aether/aether-api/1.7/aether-api-1.7.jar
[INFO] Downloaded from central: https://repo.maven.apache.org/maven2/org/apache/maven/maven-core/3.0/maven-core-3.0.jar (527 kB at 4.4 MB/s)
[INFO] Downloaded from central: https://repo.maven.apache.org/maven2/org/sonatype/aether/aether-impl/1.7/aether-impl-1.7.jar (106 kB at 886 kB/s)
[INFO] Downloading from central: https://repo.maven.apache.org/maven2/org/sonatype/aether/aether-util/1.7/aether-util-1.7.jar
[INFO] Downloading from central: https://repo.maven.apache.org/maven2/org/codehaus/plexus/plexus-interpolation/1.14/plexus-interpolation-1.14.jar
[INFO] Downloaded from central: https://repo.maven.apache.org/maven2/org/apache/maven/maven-model-builder/3.0/maven-model-builder-3.0.jar (148 kB at 1.2 MB/s)
[INFO] Downloading from central: https://repo.maven.apache.org/maven2/org/codehaus/plexus/plexus-classworlds/2.2.3/plexus-classworlds-2.2.3.jar
[INFO] Downloaded from central: https://repo.maven.apache.org/maven2/org/sonatype/aether/aether-spi/1.7/aether-spi-1.7.jar (14 kB at 108 kB/s)
[INFO] Downloading from central: https://repo.maven.apache.org/maven2/org/codehaus/plexus/plexus-component-annotations/1.7.1/plexus-component-annotations-1.7.1.jar
[INFO] Downloaded from central: https://repo.maven.apache.org/maven2/org/sonatype/aether/aether-api/1.7/aether-api-1.7.jar (74 kB at 571 kB/s)
[INFO] Downloading from central: https://repo.maven.apache.org/maven2/org/apache/maven/shared/maven-shared-utils/3.2.1/maven-shared-utils-3.2.1.jar
[INFO] Downloaded from central: https://repo.maven.apache.org/maven2/org/codehaus/plexus/plexus-interpolation/1.14/plexus-interpolation-1.14.jar (61 kB at 439 kB/s)
[INFO] Downloaded from central: https://repo.maven.apache.org/maven2/org/codehaus/plexus/plexus-component-annotations/1.7.1/plexus-component-annotations-1.7.1.jar (4.3 kB at 31 kB/s)
[INFO] Downloading from central: https://repo.maven.apache.org/maven2/org/codehaus/plexus/plexus-java/0.9.10/plexus-java-0.9.10.jar
[INFO] Downloaded from central: https://repo.maven.apache.org/maven2/org/sonatype/aether/aether-util/1.7/aether-util-1.7.jar (108 kB at 777 kB/s)
[INFO] Downloaded from central: https://repo.maven.apache.org/maven2/org/codehaus/plexus/plexus-classworlds/2.2.3/plexus-classworlds-2.2.3.jar (46 kB at 329 kB/s)
[INFO] Downloading from central: https://repo.maven.apache.org/maven2/org/ow2/asm/asm/6.2/asm-6.2.jar
[INFO] Downloading from central: https://repo.maven.apache.org/maven2/org/codehaus/plexus/plexus-compiler-api/2.8.4/plexus-compiler-api-2.8.4.jar
[INFO] Downloading from central: https://repo.maven.apache.org/maven2/com/thoughtworks/qdox/qdox/2.0-M9/qdox-2.0-M9.jar
[INFO] Downloaded from central: https://repo.maven.apache.org/maven2/org/codehaus/plexus/plexus-java/0.9.10/plexus-java-0.9.10.jar (39 kB at 254 kB/s)
[INFO] Downloaded from central: https://repo.maven.apache.org/maven2/org/apache/maven/shared/maven-shared-utils/3.2.1/maven-shared-utils-3.2.1.jar (167 kB at 1.1 MB/s)
[INFO] Downloading from central: https://repo.maven.apache.org/maven2/org/codehaus/plexus/plexus-compiler-javac/2.8.4/plexus-compiler-javac-2.8.4.jar
[INFO] Downloaded from central: https://repo.maven.apache.org/maven2/org/codehaus/plexus/plexus-compiler-api/2.8.4/plexus-compiler-api-2.8.4.jar (27 kB at 174 kB/s)
[INFO] Downloading from central: https://repo.maven.apache.org/maven2/org/codehaus/plexus/plexus-compiler-manager/2.8.4/plexus-compiler-manager-2.8.4.jar
[INFO] Downloaded from central: https://repo.maven.apache.org/maven2/org/ow2/asm/asm/6.2/asm-6.2.jar (111 kB at 691 kB/s)
[INFO] Downloaded from central: https://repo.maven.apache.org/maven2/org/codehaus/plexus/plexus-compiler-javac/2.8.4/plexus-compiler-javac-2.8.4.jar (21 kB at 127 kB/s)
[INFO] Downloaded from central: https://repo.maven.apache.org/maven2/org/codehaus/plexus/plexus-compiler-manager/2.8.4/plexus-compiler-manager-2.8.4.jar (4.7 kB at 28 kB/s)
[INFO] Downloaded from central: https://repo.maven.apache.org/maven2/com/thoughtworks/qdox/qdox/2.0-M9/qdox-2.0-M9.jar (317 kB at 1.8 MB/s)
[INFO] No sources to compile
[INFO]
[INFO] --- maven-resources-plugin:2.6:testResources (default-testResources) @ supplemental-models ---
[WARNING] Using platform encoding (ISO-8859-1 actually) to copy filtered resources, i.e. build is platform dependent!
[INFO] skip non existing resourceDirectory /home/jenkins/jenkins-slave/workspace/resources-plugin_MRRESOURCES-112@2/linux-jdk12-m3.5.x_build/target/test-classes/supplemental-artifact/resource-projects/supplemental-models/src/test/resources
[INFO]
[INFO] --- maven-compiler-plugin:3.8.0:testCompile (default-testCompile) @ supplemental-models ---
[INFO] No sources to compile
[INFO]
[INFO] --- maven-surefire-plugin:2.12.4:test (default-test) @ supplemental-models ---
[INFO] No tests to run.
[INFO]
[INFO] --- maven-jar-plugin:2.4:jar (default-jar) @ supplemental-models ---
[INFO] Building jar: /home/jenkins/jenkins-slave/workspace/resources-plugin_MRRESOURCES-112@2/linux-jdk12-m3.5.x_build/target/test-classes/supplemental-artifact/resource-projects/supplemental-models/target/supplemental-models-1.jar
[INFO]
[INFO] --- maven-install-plugin:2.4:install (default-install) @ supplemental-models ---
[INFO] Installing /home/jenkins/jenkins-slave/workspace/resources-plugin_MRRESOURCES-112@2/linux-jdk12-m3.5.x_build/target/test-classes/supplemental-artifact/resource-projects/supplemental-models/target/supplemental-models-1.jar to /home/jenkins/jenkins-slave/workspace/resources-plugin_MRRESOURCES-112@2/linux-jdk12-m3.5.x_build/target/it-repo/org/apache/maven/plugin/rresource/it/mrr43/supplemental-models/1/supplemental-models-1.jar
[INFO] Installing /home/jenkins/jenkins-slave/workspace/resources-plugin_MRRESOURCES-112@2/linux-jdk12-m3.5.x_build/target/test-classes/supplemental-artifact/resource-projects/supplemental-models/pom.xml to /home/jenkins/jenkins-slave/workspace/resources-plugin_MRRESOURCES-112@2/linux-jdk12-m3.5.x_build/target/it-repo/org/apache/maven/plugin/rresource/it/mrr43/supplemental-models/1/supplemental-models-1.pom
[INFO]
[INFO] --- maven-deploy-plugin:2.7:deploy (default-deploy) @ supplemental-models ---
[INFO] Uploading to it-remote: file:/home/jenkins/jenkins-slave/workspace/resources-plugin_MRRESOURCES-112@2/linux-jdk12-m3.5.x_build/target/remote-repo/org/apache/maven/plugin/rresource/it/mrr43/supplemental-models/1/supplemental-models-1.jar
[INFO] Uploaded to it-remote: file:/home/jenkins/jenkins-slave/workspace/resources-plugin_MRRESOURCES-112@2/linux-jdk12-m3.5.x_build/target/remote-repo/org/apache/maven/plugin/rresource/it/mrr43/supplemental-models/1/supplemental-models-1.jar (2.9 kB at 1.5 MB/s)
[INFO] Uploading to it-remote: file:/home/jenkins/jenkins-slave/workspace/resources-plugin_MRRESOURCES-112@2/linux-jdk12-m3.5.x_build/target/remote-repo/org/apache/maven/plugin/rresource/it/mrr43/supplemental-models/1/supplemental-models-1.pom
[INFO] Uploaded to it-remote: file:/home/jenkins/jenkins-slave/workspace/resources-plugin_MRRESOURCES-112@2/linux-jdk12-m3.5.x_build/target/remote-repo/org/apache/maven/plugin/rresource/it/mrr43/supplemental-models/1/supplemental-models-1.pom (1.3 kB at 1.3 MB/s)
[INFO] Downloading from it-remote: file:/home/jenkins/jenkins-slave/workspace/resources-plugin_MRRESOURCES-112@2/linux-jdk12-m3.5.x_build/target/remote-repo/org/apache/maven/plugin/rresource/it/mrr43/supplemental-models/maven-metadata.xml
[INFO] Uploading to it-remote: file:/home/jenkins/jenkins-slave/workspace/resources-plugin_MRRESOURCES-112@2/linux-jdk12-m3.5.x_build/target/remote-repo/org/apache/maven/plugin/rresource/it/mrr43/supplemental-models/maven-metadata.xml
[INFO] Uploaded to it-remote: file:/home/jenkins/jenkins-slave/workspace/resources-plugin_MRRESOURCES-112@2/linux-jdk12-m3.5.x_build/target/remote-repo/org/apache/maven/plugin/rresource/it/mrr43/supplemental-models/maven-metadata.xml (333 B at 333 kB/s)
[INFO]
[INFO] ------< org.apache.maven.plugin.rresource.it.mrr43:deficient-dep >------
[INFO] Building deficient-dep 1 [3/3]
[INFO] --------------------------------[ jar ]---------------------------------
[INFO]
[INFO] --- maven-clean-plugin:2.5:clean (default-cli) @ deficient-dep ---
[INFO]
[INFO] --- maven-resources-plugin:2.6:resources (default-resources) @ deficient-dep ---
[WARNING] Using platform encoding (ISO-8859-1 actually) to copy filtered resources, i.e. build is platform dependent!
[INFO] skip non existing resourceDirectory /home/jenkins/jenkins-slave/workspace/resources-plugin_MRRESOURCES-112@2/linux-jdk12-m3.5.x_build/target/test-classes/supplemental-artifact/resource-projects/deficient-dep/src/main/resources
[INFO]
[INFO] --- maven-compiler-plugin:3.8.0:compile (default-compile) @ deficient-dep ---
[INFO] Changes detected - recompiling the module!
[WARNING] File encoding has not been set, using platform encoding ISO-8859-1, i.e. build is platform dependent!
[INFO] Compiling 1 source file to /home/jenkins/jenkins-slave/workspace/resources-plugin_MRRESOURCES-112@2/linux-jdk12-m3.5.x_build/target/test-classes/supplemental-artifact/resource-projects/deficient-dep/target/classes
[INFO] -------------------------------------------------------------
[ERROR] COMPILATION ERROR :
[INFO] -------------------------------------------------------------
[ERROR] Source option 6 is no longer supported. Use 7 or later.
[ERROR] Target option 6 is no longer supported. Use 7 or later.
[INFO] 2 errors
[INFO] -------------------------------------------------------------
[INFO] ------------------------------------------------------------------------
[INFO] Reactor Summary:
[INFO]
[INFO] resources 1 ........................................ SUCCESS [ 0.423 s]
[INFO] supplemental-models ................................ SUCCESS [ 2.568 s]
[INFO] deficient-dep 1 .................................... FAILURE [ 0.411 s]
[INFO] ------------------------------------------------------------------------
[INFO] BUILD FAILURE
[INFO] ------------------------------------------------------------------------
[INFO] Total time: 3.593 s
[INFO] Finished at: 2019-03-15T10:43:23Z
[INFO] ------------------------------------------------------------------------
[ERROR] Failed to execute goal org.apache.maven.plugins:maven-compiler-plugin:3.8.0:compile (default-compile) on project deficient-dep: Compilation failure: Compilation failure:
[ERROR] Source option 6 is no longer supported. Use 7 or later.
[ERROR] Target option 6 is no longer supported. Use 7 or later.
[ERROR] -> [Help 1]
org.apache.maven.lifecycle.LifecycleExecutionException: Failed to execute goal org.apache.maven.plugins:maven-compiler-plugin:3.8.0:compile (default-compile) on project deficient-dep: Compilation failure
at org.apache.maven.lifecycle.internal.MojoExecutor.execute (MojoExecutor.java:213)
at org.apache.maven.lifecycle.internal.MojoExecutor.execute (MojoExecutor.java:154)
at org.apache.maven.lifecycle.internal.MojoExecutor.execute (MojoExecutor.java:146)
at org.apache.maven.lifecycle.internal.LifecycleModuleBuilder.buildProject (LifecycleModuleBuilder.java:117)
at org.apache.maven.lifecycle.internal.LifecycleModuleBuilder.buildProject (LifecycleModuleBuilder.java:81)
at org.apache.maven.lifecycle.internal.builder.singlethreaded.SingleThreadedBuilder.build (SingleThreadedBuilder.java:56)
at org.apache.maven.lifecycle.internal.LifecycleStarter.execute (LifecycleStarter.java:128)
at org.apache.maven.DefaultMaven.doExecute (DefaultMaven.java:305)
at org.apache.maven.DefaultMaven.doExecute (DefaultMaven.java:192)
at org.apache.maven.DefaultMaven.execute (DefaultMaven.java:105)
at org.apache.maven.cli.MavenCli.execute (MavenCli.java:954)
at org.apache.maven.cli.MavenCli.doMain (MavenCli.java:288)
at org.apache.maven.cli.MavenCli.main (MavenCli.java:192)
at jdk.internal.reflect.NativeMethodAccessorImpl.invoke0 (Native Method)
at jdk.internal.reflect.NativeMethodAccessorImpl.invoke (NativeMethodAccessorImpl.java:62)
at jdk.internal.reflect.DelegatingMethodAccessorImpl.invoke (DelegatingMethodAccessorImpl.java:43)
at java.lang.reflect.Method.invoke (Method.java:567)
at org.codehaus.plexus.classworlds.launcher.Launcher.launchEnhanced (Launcher.java:289)
at org.codehaus.plexus.classworlds.launcher.Launcher.launch (Launcher.java:229)
at org.codehaus.plexus.classworlds.launcher.Launcher.mainWithExitCode (Launcher.java:415)
at org.codehaus.plexus.classworlds.launcher.Launcher.main (Launcher.java:356)
Caused by: org.apache.maven.plugin.compiler.CompilationFailureException: Compilation failure
at org.apache.maven.plugin.compiler.AbstractCompilerMojo.execute (AbstractCompilerMojo.java:1215)
at org.apache.maven.plugin.compiler.CompilerMojo.execute (CompilerMojo.java:188)
at org.apache.maven.plugin.DefaultBuildPluginManager.executeMojo (DefaultBuildPluginManager.java:137)
at org.apache.maven.lifecycle.internal.MojoExecutor.execute (MojoExecutor.java:208)
at org.apache.maven.lifecycle.internal.MojoExecutor.execute (MojoExecutor.java:154)
at org.apache.maven.lifecycle.internal.MojoExecutor.execute (MojoExecutor.java:146)
at org.apache.maven.lifecycle.internal.LifecycleModuleBuilder.buildProject (LifecycleModuleBuilder.java:117)
at org.apache.maven.lifecycle.internal.LifecycleModuleBuilder.buildProject (LifecycleModuleBuilder.java:81)
at org.apache.maven.lifecycle.internal.builder.singlethreaded.SingleThreadedBuilder.build (SingleThreadedBuilder.java:56)
at org.apache.maven.lifecycle.internal.LifecycleStarter.execute (LifecycleStarter.java:128)
at org.apache.maven.DefaultMaven.doExecute (DefaultMaven.java:305)
at org.apache.maven.DefaultMaven.doExecute (DefaultMaven.java:192)
at org.apache.maven.DefaultMaven.execute (DefaultMaven.java:105)
at org.apache.maven.cli.MavenCli.execute (MavenCli.java:954)
at org.apache.maven.cli.MavenCli.doMain (MavenCli.java:288)
at org.apache.maven.cli.MavenCli.main (MavenCli.java:192)
at jdk.internal.reflect.NativeMethodAccessorImpl.invoke0 (Native Method)
at jdk.internal.reflect.NativeMethodAccessorImpl.invoke (NativeMethodAccessorImpl.java:62)
at jdk.internal.reflect.DelegatingMethodAccessorImpl.invoke (DelegatingMethodAccessorImpl.java:43)
at java.lang.reflect.Method.invoke (Method.java:567)
at org.codehaus.plexus.classworlds.launcher.Launcher.launchEnhanced (Launcher.java:289)
at org.codehaus.plexus.classworlds.launcher.Launcher.launch (Launcher.java:229)
at org.codehaus.plexus.classworlds.launcher.Launcher.mainWithExitCode (Launcher.java:415)
at org.codehaus.plexus.classworlds.launcher.Launcher.main (Launcher.java:356)
[ERROR]
[ERROR] Re-run Maven using the -X switch to enable full debug logging.
[ERROR]
[ERROR] For more information about the errors and possible solutions, please read the following articles:
[ERROR] [Help 1] http://cwiki.apache.org/confluence/display/MAVEN/MojoFailureException
[ERROR]
[ERROR] After correcting the problems, you can resume the build with the command
[ERROR] mvn <goals> -rf :deficient-dep
at org.apache.maven.plugin.resources.remote.it.IT_SupplementalArtifact.test(IT_SupplementalArtifact.java:53)
FAILED: org.apache.maven.plugin.resources.remote.it.IT_SupplementalArtifact.windows-jdk12-m3.5.x_build / Build windows-jdk12-m3.5.x_build / test
Error Message:
Exit code was non-zero: 1; command line and log =
F:\jenkins\tools\maven\apache-maven-3.5.2\bin\mvn -e --batch-mode -Dhttps.protocols=TLSv1.2 -Dmaven.repo.local=f:\jenkins\jenkins-slave\workspace\resources-plugin_MRRESOURCES-112@2\windows-jdk12-m3.5.x_build\target/it-repo org.apache.maven.plugins:maven-clean-plugin:clean deploy
Picked up JAVA_TOOL_OPTIONS: -Dmaven.ext.class.path="f:\jenkins\jenkins-slave\workspace\resources-plugin_MRRESOURCES-112@2@tmp\withMavendf77c3f5\pipeline-maven-spy.jar" -Dorg.jenkinsci.plugins.pipeline.maven.reportsFolder="f:\jenkins\jenkins-slave\workspace\resources-plugin_MRRESOURCES-112@2@tmp\withMavendf77c3f5"
[INFO] [jenkins-event-spy] Jenkins Maven Event Spy is disabled
[INFO] Error stacktraces are turned on.
[INFO] Scanning for projects...
[INFO] ------------------------------------------------------------------------
[INFO] Reactor Build Order:
[INFO]
[INFO] resources
[INFO] supplemental-models
[INFO] deficient-dep
[INFO]
[INFO] ------------------------------------------------------------------------
[INFO] Building resources 1
[INFO] ------------------------------------------------------------------------
[INFO]
[INFO] --- maven-clean-plugin:2.5:clean (default-cli) @ resources ---
[INFO]
[INFO] --- maven-install-plugin:2.4:install (default-install) @ resources ---
[INFO] Installing f:\jenkins\jenkins-slave\workspace\resources-plugin_MRRESOURCES-112@2\windows-jdk12-m3.5.x_build\target\test-classes\supplemental-artifact\resource-projects\pom.xml to f:\jenkins\jenkins-slave\workspace\resources-plugin_MRRESOURCES-112@2\windows-jdk12-m3.5.x_build\target\it-repo\org\apache\maven\plugin\rresource\it\mrr43\resources\1\resources-1.pom
[INFO]
[INFO] --- maven-deploy-plugin:2.7:deploy (default-deploy) @ resources ---
[INFO] Uploading to it-remote: file:f:\\jenkins\\jenkins-slave\\workspace\\resources-plugin_MRRESOURCES-112@2\\windows-jdk12-m3.5.x_build\\target/remote-repo/org/apache/maven/plugin/rresource/it/mrr43/resources/1/resources-1.pom
[INFO] Uploaded to it-remote: file:f:\\jenkins\\jenkins-slave\\workspace\\resources-plugin_MRRESOURCES-112@2\\windows-jdk12-m3.5.x_build\\target/remote-repo/org/apache/maven/plugin/rresource/it/mrr43/resources/1/resources-1.pom (2.0 kB at 42 kB/s)
[INFO] Downloading from it-remote: file:f:\\jenkins\\jenkins-slave\\workspace\\resources-plugin_MRRESOURCES-112@2\\windows-jdk12-m3.5.x_build\\target/remote-repo/org/apache/maven/plugin/rresource/it/mrr43/resources/maven-metadata.xml
[INFO] Uploading to it-remote: file:f:\\jenkins\\jenkins-slave\\workspace\\resources-plugin_MRRESOURCES-112@2\\windows-jdk12-m3.5.x_build\\target/remote-repo/org/apache/maven/plugin/rresource/it/mrr43/resources/maven-metadata.xml
[INFO] Uploaded to it-remote: file:f:\\jenkins\\jenkins-slave\\workspace\\resources-plugin_MRRESOURCES-112@2\\windows-jdk12-m3.5.x_build\\target/remote-repo/org/apache/maven/plugin/rresource/it/mrr43/resources/maven-metadata.xml (323 B)
[INFO]
[INFO] ------------------------------------------------------------------------
[INFO] Building supplemental-models 1
[INFO] ------------------------------------------------------------------------
[INFO] Downloading from central: https://repo.maven.apache.org/maven2/org/apache/maven/plugins/maven-compiler-plugin/3.8.0/maven-compiler-plugin-3.8.0.pom
[INFO] Downloaded from central: https://repo.maven.apache.org/maven2/org/apache/maven/plugins/maven-compiler-plugin/3.8.0/maven-compiler-plugin-3.8.0.pom (12 kB at 16 kB/s)
[INFO] Downloading from central: https://repo.maven.apache.org/maven2/org/apache/maven/plugins/maven-plugins/32/maven-plugins-32.pom
[INFO] Downloaded from central: https://repo.maven.apache.org/maven2/org/apache/maven/plugins/maven-plugins/32/maven-plugins-32.pom (11 kB at 334 kB/s)
[INFO] Downloading from central: https://repo.maven.apache.org/maven2/org/apache/maven/maven-parent/32/maven-parent-32.pom
[INFO] Downloaded from central: https://repo.maven.apache.org/maven2/org/apache/maven/maven-parent/32/maven-parent-32.pom (43 kB at 903 kB/s)
[INFO] Downloading from central: https://repo.maven.apache.org/maven2/org/apache/apache/20/apache-20.pom
[INFO] Downloaded from central: https://repo.maven.apache.org/maven2/org/apache/apache/20/apache-20.pom (16 kB at 991 kB/s)
[INFO] Downloading from central: https://repo.maven.apache.org/maven2/org/apache/maven/plugins/maven-compiler-plugin/3.8.0/maven-compiler-plugin-3.8.0.jar
[INFO] Downloaded from central: https://repo.maven.apache.org/maven2/org/apache/maven/plugins/maven-compiler-plugin/3.8.0/maven-compiler-plugin-3.8.0.jar (62 kB at 2.4 MB/s)
[INFO]
[INFO] --- maven-clean-plugin:2.5:clean (default-cli) @ supplemental-models ---
[INFO]
[INFO] --- maven-resources-plugin:2.6:resources (default-resources) @ supplemental-models ---
[WARNING] Using platform encoding (Cp1252 actually) to copy filtered resources, i.e. build is platform dependent!
[INFO] Copying 1 resource
[INFO]
[INFO] --- maven-compiler-plugin:3.8.0:compile (default-compile) @ supplemental-models ---
[INFO] Downloading from central: https://repo.maven.apache.org/maven2/org/apache/maven/shared/maven-shared-utils/3.2.1/maven-shared-utils-3.2.1.pom
[INFO] Downloaded from central: https://repo.maven.apache.org/maven2/org/apache/maven/shared/maven-shared-utils/3.2.1/maven-shared-utils-3.2.1.pom (5.6 kB at 376 kB/s)
[INFO] Downloading from central: https://repo.maven.apache.org/maven2/org/codehaus/plexus/plexus-java/0.9.10/plexus-java-0.9.10.pom
[INFO] Downloaded from central: https://repo.maven.apache.org/maven2/org/codehaus/plexus/plexus-java/0.9.10/plexus-java-0.9.10.pom (5.1 kB at 165 kB/s)
[INFO] Downloading from central: https://repo.maven.apache.org/maven2/org/codehaus/plexus/plexus-languages/0.9.10/plexus-languages-0.9.10.pom
[INFO] Downloaded from central: https://repo.maven.apache.org/maven2/org/codehaus/plexus/plexus-languages/0.9.10/plexus-languages-0.9.10.pom (4.1 kB at 109 kB/s)
[INFO] Downloading from central: https://repo.maven.apache.org/maven2/org/ow2/asm/asm/6.2/asm-6.2.pom
[INFO] Downloaded from central: https://repo.maven.apache.org/maven2/org/ow2/asm/asm/6.2/asm-6.2.pom (2.9 kB at 163 kB/s)
[INFO] Downloading from central: https://repo.maven.apache.org/maven2/org/ow2/ow2/1.5/ow2-1.5.pom
[INFO] Downloaded from central: https://repo.maven.apache.org/maven2/org/ow2/ow2/1.5/ow2-1.5.pom (11 kB at 749 kB/s)
[INFO] Downloading from central: https://repo.maven.apache.org/maven2/com/thoughtworks/qdox/qdox/2.0-M9/qdox-2.0-M9.pom
[INFO] Downloaded from central: https://repo.maven.apache.org/maven2/com/thoughtworks/qdox/qdox/2.0-M9/qdox-2.0-M9.pom (16 kB at 480 kB/s)
[INFO] Downloading from central: https://repo.maven.apache.org/maven2/org/sonatype/oss/oss-parent/9/oss-parent-9.pom
[INFO] Downloaded from central: https://repo.maven.apache.org/maven2/org/sonatype/oss/oss-parent/9/oss-parent-9.pom (6.6 kB at 505 kB/s)
[INFO] Downloading from central: https://repo.maven.apache.org/maven2/org/codehaus/plexus/plexus-compiler-api/2.8.4/plexus-compiler-api-2.8.4.pom
[INFO] Downloaded from central: https://repo.maven.apache.org/maven2/org/codehaus/plexus/plexus-compiler-api/2.8.4/plexus-compiler-api-2.8.4.pom (867 B at 62 kB/s)
[INFO] Downloading from central: https://repo.maven.apache.org/maven2/org/codehaus/plexus/plexus-compiler/2.8.4/plexus-compiler-2.8.4.pom
[INFO] Downloaded from central: https://repo.maven.apache.org/maven2/org/codehaus/plexus/plexus-compiler/2.8.4/plexus-compiler-2.8.4.pom (6.0 kB at 402 kB/s)
[INFO] Downloading from central: https://repo.maven.apache.org/maven2/org/codehaus/plexus/plexus-components/4.0/plexus-components-4.0.pom
[INFO] Downloaded from central: https://repo.maven.apache.org/maven2/org/codehaus/plexus/plexus-components/4.0/plexus-components-4.0.pom (2.7 kB at 140 kB/s)
[INFO] Downloading from central: https://repo.maven.apache.org/maven2/org/codehaus/plexus/plexus-utils/3.0.22/plexus-utils-3.0.22.pom
[INFO] Downloaded from central: https://repo.maven.apache.org/maven2/org/codehaus/plexus/plexus-utils/3.0.22/plexus-utils-3.0.22.pom (3.8 kB at 274 kB/s)
[INFO] Downloading from central: https://repo.maven.apache.org/maven2/org/codehaus/plexus/plexus-compiler-manager/2.8.4/plexus-compiler-manager-2.8.4.pom
[INFO] Downloaded from central: https://repo.maven.apache.org/maven2/org/codehaus/plexus/plexus-compiler-manager/2.8.4/plexus-compiler-manager-2.8.4.pom (692 B at 27 kB/s)
[INFO] Downloading from central: https://repo.maven.apache.org/maven2/org/codehaus/plexus/plexus-compiler-javac/2.8.4/plexus-compiler-javac-2.8.4.pom
[INFO] Downloaded from central: https://repo.maven.apache.org/maven2/org/codehaus/plexus/plexus-compiler-javac/2.8.4/plexus-compiler-javac-2.8.4.pom (771 B at 48 kB/s)
[INFO] Downloading from central: https://repo.maven.apache.org/maven2/org/codehaus/plexus/plexus-compilers/2.8.4/plexus-compilers-2.8.4.pom
[INFO] Downloaded from central: https://repo.maven.apache.org/maven2/org/codehaus/plexus/plexus-compilers/2.8.4/plexus-compilers-2.8.4.pom (1.3 kB at 96 kB/s)
[INFO] Downloading from central: https://repo.maven.apache.org/maven2/org/apache/maven/maven-plugin-api/3.0/maven-plugin-api-3.0.jar
[INFO] Downloading from central: https://repo.maven.apache.org/maven2/org/sonatype/sisu/sisu-guice/2.1.7/sisu-guice-2.1.7-noaop.jar
[INFO] Downloading from central: https://repo.maven.apache.org/maven2/org/sonatype/sisu/sisu-inject-plexus/1.4.2/sisu-inject-plexus-1.4.2.jar
[INFO] Downloading from central: https://repo.maven.apache.org/maven2/org/sonatype/sisu/sisu-inject-bean/1.4.2/sisu-inject-bean-1.4.2.jar
[INFO] Downloading from central: https://repo.maven.apache.org/maven2/org/apache/maven/maven-model/3.0/maven-model-3.0.jar
[INFO] Downloaded from central: https://repo.maven.apache.org/maven2/org/apache/maven/maven-plugin-api/3.0/maven-plugin-api-3.0.jar (49 kB at 619 kB/s)
[INFO] Downloading from central: https://repo.maven.apache.org/maven2/org/apache/maven/maven-artifact/3.0/maven-artifact-3.0.jar
[INFO] Downloaded from central: https://repo.maven.apache.org/maven2/org/apache/maven/maven-artifact/3.0/maven-artifact-3.0.jar (52 kB at 195 kB/s)
[INFO] Downloading from central: https://repo.maven.apache.org/maven2/org/codehaus/plexus/plexus-utils/2.0.4/plexus-utils-2.0.4.jar
[INFO] Downloaded from central: https://repo.maven.apache.org/maven2/org/sonatype/sisu/sisu-guice/2.1.7/sisu-guice-2.1.7-noaop.jar (472 kB at 1.8 MB/s)
[INFO] Downloading from central: https://repo.maven.apache.org/maven2/org/apache/maven/maven-core/3.0/maven-core-3.0.jar
[INFO] Downloaded from central: https://repo.maven.apache.org/maven2/org/sonatype/sisu/sisu-inject-plexus/1.4.2/sisu-inject-plexus-1.4.2.jar (202 kB at 538 kB/s)
[INFO] Downloading from central: https://repo.maven.apache.org/maven2/org/apache/maven/maven-settings/3.0/maven-settings-3.0.jar
[INFO] Downloaded from central: https://repo.maven.apache.org/maven2/org/sonatype/sisu/sisu-inject-bean/1.4.2/sisu-inject-bean-1.4.2.jar (153 kB at 408 kB/s)
[INFO] Downloading from central: https://repo.maven.apache.org/maven2/org/apache/maven/maven-settings-builder/3.0/maven-settings-builder-3.0.jar
[INFO] Downloaded from central: https://repo.maven.apache.org/maven2/org/apache/maven/maven-model/3.0/maven-model-3.0.jar (165 kB at 405 kB/s)
[INFO] Downloading from central: https://repo.maven.apache.org/maven2/org/apache/maven/maven-repository-metadata/3.0/maven-repository-metadata-3.0.jar
[INFO] Downloaded from central: https://repo.maven.apache.org/maven2/org/codehaus/plexus/plexus-utils/2.0.4/plexus-utils-2.0.4.jar (222 kB at 546 kB/s)
[INFO] Downloading from central: https://repo.maven.apache.org/maven2/org/apache/maven/maven-model-builder/3.0/maven-model-builder-3.0.jar
[INFO] Downloaded from central: https://repo.maven.apache.org/maven2/org/apache/maven/maven-settings-builder/3.0/maven-settings-builder-3.0.jar (38 kB at 85 kB/s)
[INFO] Downloading from central: https://repo.maven.apache.org/maven2/org/apache/maven/maven-aether-provider/3.0/maven-aether-provider-3.0.jar
[INFO] Downloaded from central: https://repo.maven.apache.org/maven2/org/apache/maven/maven-repository-metadata/3.0/maven-repository-metadata-3.0.jar (30 kB at 64 kB/s)
[INFO] Downloading from central: https://repo.maven.apache.org/maven2/org/sonatype/aether/aether-impl/1.7/aether-impl-1.7.jar
[INFO] Downloaded from central: https://repo.maven.apache.org/maven2/org/apache/maven/maven-settings/3.0/maven-settings-3.0.jar (47 kB at 100 kB/s)
[INFO] Downloading from central: https://repo.maven.apache.org/maven2/org/sonatype/aether/aether-spi/1.7/aether-spi-1.7.jar
[INFO] Downloaded from central: https://repo.maven.apache.org/maven2/org/apache/maven/maven-model-builder/3.0/maven-model-builder-3.0.jar (148 kB at 316 kB/s)
[INFO] Downloading from central: https://repo.maven.apache.org/maven2/org/sonatype/aether/aether-api/1.7/aether-api-1.7.jar
[INFO] Downloaded from central: https://repo.maven.apache.org/maven2/org/apache/maven/maven-aether-provider/3.0/maven-aether-provider-3.0.jar (51 kB at 105 kB/s)
[INFO] Downloading from central: https://repo.maven.apache.org/maven2/org/sonatype/aether/aether-util/1.7/aether-util-1.7.jar
[INFO] Downloaded from central: https://repo.maven.apache.org/maven2/org/sonatype/aether/aether-spi/1.7/aether-spi-1.7.jar (14 kB at 27 kB/s)
[INFO] Downloading from central: https://repo.maven.apache.org/maven2/org/codehaus/plexus/plexus-interpolation/1.14/plexus-interpolation-1.14.jar
[INFO] Downloaded from central: https://repo.maven.apache.org/maven2/org/sonatype/aether/aether-impl/1.7/aether-impl-1.7.jar (106 kB at 209 kB/s)
[INFO] Downloading from central: https://repo.maven.apache.org/maven2/org/codehaus/plexus/plexus-classworlds/2.2.3/plexus-classworlds-2.2.3.jar
[INFO] Downloaded from central: https://repo.maven.apache.org/maven2/org/apache/maven/maven-core/3.0/maven-core-3.0.jar (527 kB at 1.0 MB/s)
[INFO] Downloading from central: https://repo.maven.apache.org/maven2/org/codehaus/plexus/plexus-component-annotations/1.7.1/plexus-component-annotations-1.7.1.jar
[INFO] Downloaded from central: https://repo.maven.apache.org/maven2/org/sonatype/aether/aether-api/1.7/aether-api-1.7.jar (74 kB at 146 kB/s)
[INFO] Downloading from central: https://repo.maven.apache.org/maven2/org/apache/maven/shared/maven-shared-utils/3.2.1/maven-shared-utils-3.2.1.jar
[INFO] Downloaded from central: https://repo.maven.apache.org/maven2/org/codehaus/plexus/plexus-interpolation/1.14/plexus-interpolation-1.14.jar (61 kB at 116 kB/s)
[INFO] Downloading from central: https://repo.maven.apache.org/maven2/org/codehaus/plexus/plexus-java/0.9.10/plexus-java-0.9.10.jar
[INFO] Downloaded from central: https://repo.maven.apache.org/maven2/org/sonatype/aether/aether-util/1.7/aether-util-1.7.jar (108 kB at 206 kB/s)
[INFO] Downloading from central: https://repo.maven.apache.org/maven2/org/ow2/asm/asm/6.2/asm-6.2.jar
[INFO] Downloaded from central: https://repo.maven.apache.org/maven2/org/codehaus/plexus/plexus-component-annotations/1.7.1/plexus-component-annotations-1.7.1.jar (4.3 kB at 8.0 kB/s)
[INFO] Downloading from central: https://repo.maven.apache.org/maven2/com/thoughtworks/qdox/qdox/2.0-M9/qdox-2.0-M9.jar
[INFO] Downloaded from central: https://repo.maven.apache.org/maven2/org/codehaus/plexus/plexus-classworlds/2.2.3/plexus-classworlds-2.2.3.jar (46 kB at 86 kB/s)
[INFO] Downloading from central: https://repo.maven.apache.org/maven2/org/codehaus/plexus/plexus-compiler-api/2.8.4/plexus-compiler-api-2.8.4.jar
[INFO] Downloaded from central: https://repo.maven.apache.org/maven2/org/codehaus/plexus/plexus-java/0.9.10/plexus-java-0.9.10.jar (39 kB at 73 kB/s)
[INFO] Downloading from central: https://repo.maven.apache.org/maven2/org/codehaus/plexus/plexus-compiler-manager/2.8.4/plexus-compiler-manager-2.8.4.jar
[INFO] Downloaded from central: https://repo.maven.apache.org/maven2/org/apache/maven/shared/maven-shared-utils/3.2.1/maven-shared-utils-3.2.1.jar (167 kB at 301 kB/s)
[INFO] Downloading from central: https://repo.maven.apache.org/maven2/org/codehaus/plexus/plexus-compiler-javac/2.8.4/plexus-compiler-javac-2.8.4.jar
[INFO] Downloaded from central: https://repo.maven.apache.org/maven2/org/ow2/asm/asm/6.2/asm-6.2.jar (111 kB at 201 kB/s)
[INFO] Downloaded from central: https://repo.maven.apache.org/maven2/org/codehaus/plexus/plexus-compiler-manager/2.8.4/plexus-compiler-manager-2.8.4.jar (4.7 kB at 8.2 kB/s)
[INFO] Downloaded from central: https://repo.maven.apache.org/maven2/org/codehaus/plexus/plexus-compiler-api/2.8.4/plexus-compiler-api-2.8.4.jar (27 kB at 47 kB/s)
[INFO] Downloaded from central: https://repo.maven.apache.org/maven2/org/codehaus/plexus/plexus-compiler-javac/2.8.4/plexus-compiler-javac-2.8.4.jar (21 kB at 36 kB/s)
[INFO] Downloaded from central: https://repo.maven.apache.org/maven2/com/thoughtworks/qdox/qdox/2.0-M9/qdox-2.0-M9.jar (317 kB at 528 kB/s)
[INFO] No sources to compile
[INFO]
[INFO] --- maven-resources-plugin:2.6:testResources (default-testResources) @ supplemental-models ---
[WARNING] Using platform encoding (Cp1252 actually) to copy filtered resources, i.e. build is platform dependent!
[INFO] skip non existing resourceDirectory F:\jenkins\jenkins-slave\workspace\resources-plugin_MRRESOURCES-112@2\windows-jdk12-m3.5.x_build\target\test-classes\supplemental-artifact\resource-projects\supplemental-models\src\test\resources
[INFO]
[INFO] --- maven-compiler-plugin:3.8.0:testCompile (default-testCompile) @ supplemental-models ---
[INFO] No sources to compile
[INFO]
[INFO] --- maven-surefire-plugin:2.12.4:test (default-test) @ supplemental-models ---
[INFO] No tests to run.
[INFO]
[INFO] --- maven-jar-plugin:2.4:jar (default-jar) @ supplemental-models ---
[INFO] Building jar: F:\jenkins\jenkins-slave\workspace\resources-plugin_MRRESOURCES-112@2\windows-jdk12-m3.5.x_build\target\test-classes\supplemental-artifact\resource-projects\supplemental-models\target\supplemental-models-1.jar
[INFO]
[INFO] --- maven-install-plugin:2.4:install (default-install) @ supplemental-models ---
[INFO] Installing F:\jenkins\jenkins-slave\workspace\resources-plugin_MRRESOURCES-112@2\windows-jdk12-m3.5.x_build\target\test-classes\supplemental-artifact\resource-projects\supplemental-models\target\supplemental-models-1.jar to f:\jenkins\jenkins-slave\workspace\resources-plugin_MRRESOURCES-112@2\windows-jdk12-m3.5.x_build\target\it-repo\org\apache\maven\plugin\rresource\it\mrr43\supplemental-models\1\supplemental-models-1.jar
[INFO] Installing F:\jenkins\jenkins-slave\workspace\resources-plugin_MRRESOURCES-112@2\windows-jdk12-m3.5.x_build\target\test-classes\supplemental-artifact\resource-projects\supplemental-models\pom.xml to f:\jenkins\jenkins-slave\workspace\resources-plugin_MRRESOURCES-112@2\windows-jdk12-m3.5.x_build\target\it-repo\org\apache\maven\plugin\rresource\it\mrr43\supplemental-models\1\supplemental-models-1.pom
[INFO]
[INFO] --- maven-deploy-plugin:2.7:deploy (default-deploy) @ supplemental-models ---
[INFO] Uploading to it-remote: file:f:\\jenkins\\jenkins-slave\\workspace\\resources-plugin_MRRESOURCES-112@2\\windows-jdk12-m3.5.x_build\\target/remote-repo/org/apache/maven/plugin/rresource/it/mrr43/supplemental-models/1/supplemental-models-1.jar
[INFO] Uploaded to it-remote: file:f:\\jenkins\\jenkins-slave\\workspace\\resources-plugin_MRRESOURCES-112@2\\windows-jdk12-m3.5.x_build\\target/remote-repo/org/apache/maven/plugin/rresource/it/mrr43/supplemental-models/1/supplemental-models-1.jar (3.0 kB at 994 kB/s)
[INFO] Uploading to it-remote: file:f:\\jenkins\\jenkins-slave\\workspace\\resources-plugin_MRRESOURCES-112@2\\windows-jdk12-m3.5.x_build\\target/remote-repo/org/apache/maven/plugin/rresource/it/mrr43/supplemental-models/1/supplemental-models-1.pom
[INFO] Uploaded to it-remote: file:f:\\jenkins\\jenkins-slave\\workspace\\resources-plugin_MRRESOURCES-112@2\\windows-jdk12-m3.5.x_build\\target/remote-repo/org/apache/maven/plugin/rresource/it/mrr43/supplemental-models/1/supplemental-models-1.pom (1.3 kB at 162 kB/s)
[INFO] Downloading from it-remote: file:f:\\jenkins\\jenkins-slave\\workspace\\resources-plugin_MRRESOURCES-112@2\\windows-jdk12-m3.5.x_build\\target/remote-repo/org/apache/maven/plugin/rresource/it/mrr43/supplemental-models/maven-metadata.xml
[INFO] Uploading to it-remote: file:f:\\jenkins\\jenkins-slave\\workspace\\resources-plugin_MRRESOURCES-112@2\\windows-jdk12-m3.5.x_build\\target/remote-repo/org/apache/maven/plugin/rresource/it/mrr43/supplemental-models/maven-metadata.xml
[INFO] Uploaded to it-remote: file:f:\\jenkins\\jenkins-slave\\workspace\\resources-plugin_MRRESOURCES-112@2\\windows-jdk12-m3.5.x_build\\target/remote-repo/org/apache/maven/plugin/rresource/it/mrr43/supplemental-models/maven-metadata.xml (333 B)
[INFO]
[INFO] ------------------------------------------------------------------------
[INFO] Building deficient-dep 1
[INFO] ------------------------------------------------------------------------
[INFO]
[INFO] --- maven-clean-plugin:2.5:clean (default-cli) @ deficient-dep ---
[INFO]
[INFO] --- maven-resources-plugin:2.6:resources (default-resources) @ deficient-dep ---
[WARNING] Using platform encoding (Cp1252 actually) to copy filtered resources, i.e. build is platform dependent!
[INFO] skip non existing resourceDirectory F:\jenkins\jenkins-slave\workspace\resources-plugin_MRRESOURCES-112@2\windows-jdk12-m3.5.x_build\target\test-classes\supplemental-artifact\resource-projects\deficient-dep\src\main\resources
[INFO]
[INFO] --- maven-compiler-plugin:3.8.0:compile (default-compile) @ deficient-dep ---
[INFO] Changes detected - recompiling the module!
[WARNING] File encoding has not been set, using platform encoding Cp1252, i.e. build is platform dependent!
[INFO] Compiling 1 source file to F:\jenkins\jenkins-slave\workspace\resources-plugin_MRRESOURCES-112@2\windows-jdk12-m3.5.x_build\target\test-classes\supplemental-artifact\resource-projects\deficient-dep\target\classes
[INFO] -------------------------------------------------------------
[ERROR] COMPILATION ERROR :
[INFO] -------------------------------------------------------------
[ERROR] Source option 6 is no longer supported. Use 7 or later.
[ERROR] Target option 6 is no longer supported. Use 7 or later.
[INFO] 2 errors
[INFO] -------------------------------------------------------------
[INFO] ------------------------------------------------------------------------
[INFO] Reactor Summary:
[INFO]
[INFO] resources .......................................... SUCCESS [ 1.092 s]
[INFO] supplemental-models ................................ SUCCESS [ 5.077 s]
[INFO] deficient-dep ...................................... FAILURE [ 1.097 s]
[INFO] ------------------------------------------------------------------------
[INFO] BUILD FAILURE
[INFO] ------------------------------------------------------------------------
[INFO] Total time: 7.796 s
[INFO] Finished at: 2019-03-15T10:45:14Z
[INFO] Final Memory: 15M/44M
[INFO] ------------------------------------------------------------------------
[ERROR] Failed to execute goal org.apache.maven.plugins:maven-compiler-plugin:3.8.0:compile (default-compile) on project deficient-dep: Compilation failure: Compilation failure:
[ERROR] Source option 6 is no longer supported. Use 7 or later.
[ERROR] Target option 6 is no longer supported. Use 7 or later.
[ERROR] -> [Help 1]
org.apache.maven.lifecycle.LifecycleExecutionException: Failed to execute goal org.apache.maven.plugins:maven-compiler-plugin:3.8.0:compile (default-compile) on project deficient-dep: Compilation failure
at org.apache.maven.lifecycle.internal.MojoExecutor.execute (MojoExecutor.java:213)
at org.apache.maven.lifecycle.internal.MojoExecutor.execute (MojoExecutor.java:154)
at org.apache.maven.lifecycle.internal.MojoExecutor.execute (MojoExecutor.java:146)
at org.apache.maven.lifecycle.internal.LifecycleModuleBuilder.buildProject (LifecycleModuleBuilder.java:117)
at org.apache.maven.lifecycle.internal.LifecycleModuleBuilder.buildProject (LifecycleModuleBuilder.java:81)
at org.apache.maven.lifecycle.internal.builder.singlethreaded.SingleThreadedBuilder.build (SingleThreadedBuilder.java:51)
at org.apache.maven.lifecycle.internal.LifecycleStarter.execute (LifecycleStarter.java:128)
at org.apache.maven.DefaultMaven.doExecute (DefaultMaven.java:309)
at org.apache.maven.DefaultMaven.doExecute (DefaultMaven.java:194)
at org.apache.maven.DefaultMaven.execute (DefaultMaven.java:107)
at org.apache.maven.cli.MavenCli.execute (MavenCli.java:955)
at org.apache.maven.cli.MavenCli.doMain (MavenCli.java:290)
at org.apache.maven.cli.MavenCli.main (MavenCli.java:194)
at jdk.internal.reflect.NativeMethodAccessorImpl.invoke0 (Native Method)
at jdk.internal.reflect.NativeMethodAccessorImpl.invoke (NativeMethodAccessorImpl.java:62)
at jdk.internal.reflect.DelegatingMethodAccessorImpl.invoke (DelegatingMethodAccessorImpl.java:43)
at java.lang.reflect.Method.invoke (Method.java:567)
at org.codehaus.plexus.classworlds.launcher.Launcher.launchEnhanced (Launcher.java:289)
at org.codehaus.plexus.classworlds.launcher.Launcher.launch (Launcher.java:229)
at org.codehaus.plexus.classworlds.launcher.Launcher.mainWithExitCode (Launcher.java:415)
at org.codehaus.plexus.classworlds.launcher.Launcher.main (Launcher.java:356)
Caused by: org.apache.maven.plugin.compiler.CompilationFailureException: Compilation failure
at org.apache.maven.plugin.compiler.AbstractCompilerMojo.execute (AbstractCompilerMojo.java:1215)
at org.apache.maven.plugin.compiler.CompilerMojo.execute (CompilerMojo.java:188)
at org.apache.maven.plugin.DefaultBuildPluginManager.executeMojo (DefaultBuildPluginManager.java:134)
at org.apache.maven.lifecycle.internal.MojoExecutor.execute (MojoExecutor.java:208)
at org.apache.maven.lifecycle.internal.MojoExecutor.execute (MojoExecutor.java:154)
at org.apache.maven.lifecycle.internal.MojoExecutor.execute (MojoExecutor.java:146)
at org.apache.maven.lifecycle.internal.LifecycleModuleBuilder.buildProject (LifecycleModuleBuilder.java:117)
at org.apache.maven.lifecycle.internal.LifecycleModuleBuilder.buildProject (LifecycleModuleBuilder.java:81)
at org.apache.maven.lifecycle.internal.builder.singlethreaded.SingleThreadedBuilder.build (SingleThreadedBuilder.java:51)
at org.apache.maven.lifecycle.internal.LifecycleStarter.execute (LifecycleStarter.java:128)
at org.apache.maven.DefaultMaven.doExecute (DefaultMaven.java:309)
at org.apache.maven.DefaultMaven.doExecute (DefaultMaven.java:194)
at org.apache.maven.DefaultMaven.execute (DefaultMaven.java:107)
at org.apache.maven.cli.MavenCli.execute (MavenCli.java:955)
at org.apache.maven.cli.MavenCli.doMain (MavenCli.java:290)
at org.apache.maven.cli.MavenCli.main (MavenCli.java:194)
at jdk.internal.reflect.NativeMethodAccessorImpl.invoke0 (Native Method)
at jdk.internal.reflect.NativeMethodAccessorImpl.invoke (NativeMethodAccessorImpl.java:62)
at jdk.internal.reflect.DelegatingMethodAccessorImpl.invoke (DelegatingMethodAccessorImpl.java:43)
at java.lang.reflect.Method.invoke (Method.java:567)
at org.codehaus.plexus.classworlds.launcher.Launcher.launchEnhanced (Launcher.java:289)
at org.codehaus.plexus.classworlds.launcher.Launcher.launch (Launcher.java:229)
at org.codehaus.plexus.classworlds.launcher.Launcher.mainWithExitCode (Launcher.java:415)
at org.codehaus.plexus.classworlds.launcher.Launcher.main (Launcher.java:356)
[ERROR]
[ERROR] Re-run Maven using the -X switch to enable full debug logging.
[ERROR]
[ERROR] For more information about the errors and possible solutions, please read the following articles:
[ERROR] [Help 1] http://cwiki.apache.org/confluence/display/MAVEN/MojoFailureException
[ERROR]
[ERROR] After correcting the problems, you can resume the build with the command
[ERROR] mvn <goals> -rf :deficient-dep
Stack Trace:
org.apache.maven.it.VerificationException:
Exit code was non-zero: 1; command line and log =
F:\jenkins\tools\maven\apache-maven-3.5.2\bin\mvn -e --batch-mode -Dhttps.protocols=TLSv1.2 -Dmaven.repo.local=f:\jenkins\jenkins-slave\workspace\resources-plugin_MRRESOURCES-112@2\windows-jdk12-m3.5.x_build\target/it-repo org.apache.maven.plugins:maven-clean-plugin:clean deploy
Picked up JAVA_TOOL_OPTIONS: -Dmaven.ext.class.path="f:\jenkins\jenkins-slave\workspace\resources-plugin_MRRESOURCES-112@2@tmp\withMavendf77c3f5\pipeline-maven-spy.jar" -Dorg.jenkinsci.plugins.pipeline.maven.reportsFolder="f:\jenkins\jenkins-slave\workspace\resources-plugin_MRRESOURCES-112@2@tmp\withMavendf77c3f5"
[INFO] [jenkins-event-spy] Jenkins Maven Event Spy is disabled
[INFO] Error stacktraces are turned on.
[INFO] Scanning for projects...
[INFO] ------------------------------------------------------------------------
[INFO] Reactor Build Order:
[INFO]
[INFO] resources
[INFO] supplemental-models
[INFO] deficient-dep
[INFO]
[INFO] ------------------------------------------------------------------------
[INFO] Building resources 1
[INFO] ------------------------------------------------------------------------
[INFO]
[INFO] --- maven-clean-plugin:2.5:clean (default-cli) @ resources ---
[INFO]
[INFO] --- maven-install-plugin:2.4:install (default-install) @ resources ---
[INFO] Installing f:\jenkins\jenkins-slave\workspace\resources-plugin_MRRESOURCES-112@2\windows-jdk12-m3.5.x_build\target\test-classes\supplemental-artifact\resource-projects\pom.xml to f:\jenkins\jenkins-slave\workspace\resources-plugin_MRRESOURCES-112@2\windows-jdk12-m3.5.x_build\target\it-repo\org\apache\maven\plugin\rresource\it\mrr43\resources\1\resources-1.pom
[INFO]
[INFO] --- maven-deploy-plugin:2.7:deploy (default-deploy) @ resources ---
[INFO] Uploading to it-remote: file:f:\\jenkins\\jenkins-slave\\workspace\\resources-plugin_MRRESOURCES-112@2\\windows-jdk12-m3.5.x_build\\target/remote-repo/org/apache/maven/plugin/rresource/it/mrr43/resources/1/resources-1.pom
[INFO] Uploaded to it-remote: file:f:\\jenkins\\jenkins-slave\\workspace\\resources-plugin_MRRESOURCES-112@2\\windows-jdk12-m3.5.x_build\\target/remote-repo/org/apache/maven/plugin/rresource/it/mrr43/resources/1/resources-1.pom (2.0 kB at 42 kB/s)
[INFO] Downloading from it-remote: file:f:\\jenkins\\jenkins-slave\\workspace\\resources-plugin_MRRESOURCES-112@2\\windows-jdk12-m3.5.x_build\\target/remote-repo/org/apache/maven/plugin/rresource/it/mrr43/resources/maven-metadata.xml
[INFO] Uploading to it-remote: file:f:\\jenkins\\jenkins-slave\\workspace\\resources-plugin_MRRESOURCES-112@2\\windows-jdk12-m3.5.x_build\\target/remote-repo/org/apache/maven/plugin/rresource/it/mrr43/resources/maven-metadata.xml
[INFO] Uploaded to it-remote: file:f:\\jenkins\\jenkins-slave\\workspace\\resources-plugin_MRRESOURCES-112@2\\windows-jdk12-m3.5.x_build\\target/remote-repo/org/apache/maven/plugin/rresource/it/mrr43/resources/maven-metadata.xml (323 B)
[INFO]
[INFO] ------------------------------------------------------------------------
[INFO] Building supplemental-models 1
[INFO] ------------------------------------------------------------------------
[INFO] Downloading from central: https://repo.maven.apache.org/maven2/org/apache/maven/plugins/maven-compiler-plugin/3.8.0/maven-compiler-plugin-3.8.0.pom
[INFO] Downloaded from central: https://repo.maven.apache.org/maven2/org/apache/maven/plugins/maven-compiler-plugin/3.8.0/maven-compiler-plugin-3.8.0.pom (12 kB at 16 kB/s)
[INFO] Downloading from central: https://repo.maven.apache.org/maven2/org/apache/maven/plugins/maven-plugins/32/maven-plugins-32.pom
[INFO] Downloaded from central: https://repo.maven.apache.org/maven2/org/apache/maven/plugins/maven-plugins/32/maven-plugins-32.pom (11 kB at 334 kB/s)
[INFO] Downloading from central: https://repo.maven.apache.org/maven2/org/apache/maven/maven-parent/32/maven-parent-32.pom
[INFO] Downloaded from central: https://repo.maven.apache.org/maven2/org/apache/maven/maven-parent/32/maven-parent-32.pom (43 kB at 903 kB/s)
[INFO] Downloading from central: https://repo.maven.apache.org/maven2/org/apache/apache/20/apache-20.pom
[INFO] Downloaded from central: https://repo.maven.apache.org/maven2/org/apache/apache/20/apache-20.pom (16 kB at 991 kB/s)
[INFO] Downloading from central: https://repo.maven.apache.org/maven2/org/apache/maven/plugins/maven-compiler-plugin/3.8.0/maven-compiler-plugin-3.8.0.jar
[INFO] Downloaded from central: https://repo.maven.apache.org/maven2/org/apache/maven/plugins/maven-compiler-plugin/3.8.0/maven-compiler-plugin-3.8.0.jar (62 kB at 2.4 MB/s)
[INFO]
[INFO] --- maven-clean-plugin:2.5:clean (default-cli) @ supplemental-models ---
[INFO]
[INFO] --- maven-resources-plugin:2.6:resources (default-resources) @ supplemental-models ---
[WARNING] Using platform encoding (Cp1252 actually) to copy filtered resources, i.e. build is platform dependent!
[INFO] Copying 1 resource
[INFO]
[INFO] --- maven-compiler-plugin:3.8.0:compile (default-compile) @ supplemental-models ---
[INFO] Downloading from central: https://repo.maven.apache.org/maven2/org/apache/maven/shared/maven-shared-utils/3.2.1/maven-shared-utils-3.2.1.pom
[INFO] Downloaded from central: https://repo.maven.apache.org/maven2/org/apache/maven/shared/maven-shared-utils/3.2.1/maven-shared-utils-3.2.1.pom (5.6 kB at 376 kB/s)
[INFO] Downloading from central: https://repo.maven.apache.org/maven2/org/codehaus/plexus/plexus-java/0.9.10/plexus-java-0.9.10.pom
[INFO] Downloaded from central: https://repo.maven.apache.org/maven2/org/codehaus/plexus/plexus-java/0.9.10/plexus-java-0.9.10.pom (5.1 kB at 165 kB/s)
[INFO] Downloading from central: https://repo.maven.apache.org/maven2/org/codehaus/plexus/plexus-languages/0.9.10/plexus-languages-0.9.10.pom
[INFO] Downloaded from central: https://repo.maven.apache.org/maven2/org/codehaus/plexus/plexus-languages/0.9.10/plexus-languages-0.9.10.pom (4.1 kB at 109 kB/s)
[INFO] Downloading from central: https://repo.maven.apache.org/maven2/org/ow2/asm/asm/6.2/asm-6.2.pom
[INFO] Downloaded from central: https://repo.maven.apache.org/maven2/org/ow2/asm/asm/6.2/asm-6.2.pom (2.9 kB at 163 kB/s)
[INFO] Downloading from central: https://repo.maven.apache.org/maven2/org/ow2/ow2/1.5/ow2-1.5.pom
[INFO] Downloaded from central: https://repo.maven.apache.org/maven2/org/ow2/ow2/1.5/ow2-1.5.pom (11 kB at 749 kB/s)
[INFO] Downloading from central: https://repo.maven.apache.org/maven2/com/thoughtworks/qdox/qdox/2.0-M9/qdox-2.0-M9.pom
[INFO] Downloaded from central: https://repo.maven.apache.org/maven2/com/thoughtworks/qdox/qdox/2.0-M9/qdox-2.0-M9.pom (16 kB at 480 kB/s)
[INFO] Downloading from central: https://repo.maven.apache.org/maven2/org/sonatype/oss/oss-parent/9/oss-parent-9.pom
[INFO] Downloaded from central: https://repo.maven.apache.org/maven2/org/sonatype/oss/oss-parent/9/oss-parent-9.pom (6.6 kB at 505 kB/s)
[INFO] Downloading from central: https://repo.maven.apache.org/maven2/org/codehaus/plexus/plexus-compiler-api/2.8.4/plexus-compiler-api-2.8.4.pom
[INFO] Downloaded from central: https://repo.maven.apache.org/maven2/org/codehaus/plexus/plexus-compiler-api/2.8.4/plexus-compiler-api-2.8.4.pom (867 B at 62 kB/s)
[INFO] Downloading from central: https://repo.maven.apache.org/maven2/org/codehaus/plexus/plexus-compiler/2.8.4/plexus-compiler-2.8.4.pom
[INFO] Downloaded from central: https://repo.maven.apache.org/maven2/org/codehaus/plexus/plexus-compiler/2.8.4/plexus-compiler-2.8.4.pom (6.0 kB at 402 kB/s)
[INFO] Downloading from central: https://repo.maven.apache.org/maven2/org/codehaus/plexus/plexus-components/4.0/plexus-components-4.0.pom
[INFO] Downloaded from central: https://repo.maven.apache.org/maven2/org/codehaus/plexus/plexus-components/4.0/plexus-components-4.0.pom (2.7 kB at 140 kB/s)
[INFO] Downloading from central: https://repo.maven.apache.org/maven2/org/codehaus/plexus/plexus-utils/3.0.22/plexus-utils-3.0.22.pom
[INFO] Downloaded from central: https://repo.maven.apache.org/maven2/org/codehaus/plexus/plexus-utils/3.0.22/plexus-utils-3.0.22.pom (3.8 kB at 274 kB/s)
[INFO] Downloading from central: https://repo.maven.apache.org/maven2/org/codehaus/plexus/plexus-compiler-manager/2.8.4/plexus-compiler-manager-2.8.4.pom
[INFO] Downloaded from central: https://repo.maven.apache.org/maven2/org/codehaus/plexus/plexus-compiler-manager/2.8.4/plexus-compiler-manager-2.8.4.pom (692 B at 27 kB/s)
[INFO] Downloading from central: https://repo.maven.apache.org/maven2/org/codehaus/plexus/plexus-compiler-javac/2.8.4/plexus-compiler-javac-2.8.4.pom
[INFO] Downloaded from central: https://repo.maven.apache.org/maven2/org/codehaus/plexus/plexus-compiler-javac/2.8.4/plexus-compiler-javac-2.8.4.pom (771 B at 48 kB/s)
[INFO] Downloading from central: https://repo.maven.apache.org/maven2/org/codehaus/plexus/plexus-compilers/2.8.4/plexus-compilers-2.8.4.pom
[INFO] Downloaded from central: https://repo.maven.apache.org/maven2/org/codehaus/plexus/plexus-compilers/2.8.4/plexus-compilers-2.8.4.pom (1.3 kB at 96 kB/s)
[INFO] Downloading from central: https://repo.maven.apache.org/maven2/org/apache/maven/maven-plugin-api/3.0/maven-plugin-api-3.0.jar
[INFO] Downloading from central: https://repo.maven.apache.org/maven2/org/sonatype/sisu/sisu-guice/2.1.7/sisu-guice-2.1.7-noaop.jar
[INFO] Downloading from central: https://repo.maven.apache.org/maven2/org/sonatype/sisu/sisu-inject-plexus/1.4.2/sisu-inject-plexus-1.4.2.jar
[INFO] Downloading from central: https://repo.maven.apache.org/maven2/org/sonatype/sisu/sisu-inject-bean/1.4.2/sisu-inject-bean-1.4.2.jar
[INFO] Downloading from central: https://repo.maven.apache.org/maven2/org/apache/maven/maven-model/3.0/maven-model-3.0.jar
[INFO] Downloaded from central: https://repo.maven.apache.org/maven2/org/apache/maven/maven-plugin-api/3.0/maven-plugin-api-3.0.jar (49 kB at 619 kB/s)
[INFO] Downloading from central: https://repo.maven.apache.org/maven2/org/apache/maven/maven-artifact/3.0/maven-artifact-3.0.jar
[INFO] Downloaded from central: https://repo.maven.apache.org/maven2/org/apache/maven/maven-artifact/3.0/maven-artifact-3.0.jar (52 kB at 195 kB/s)
[INFO] Downloading from central: https://repo.maven.apache.org/maven2/org/codehaus/plexus/plexus-utils/2.0.4/plexus-utils-2.0.4.jar
[INFO] Downloaded from central: https://repo.maven.apache.org/maven2/org/sonatype/sisu/sisu-guice/2.1.7/sisu-guice-2.1.7-noaop.jar (472 kB at 1.8 MB/s)
[INFO] Downloading from central: https://repo.maven.apache.org/maven2/org/apache/maven/maven-core/3.0/maven-core-3.0.jar
[INFO] Downloaded from central: https://repo.maven.apache.org/maven2/org/sonatype/sisu/sisu-inject-plexus/1.4.2/sisu-inject-plexus-1.4.2.jar (202 kB at 538 kB/s)
[INFO] Downloading from central: https://repo.maven.apache.org/maven2/org/apache/maven/maven-settings/3.0/maven-settings-3.0.jar
[INFO] Downloaded from central: https://repo.maven.apache.org/maven2/org/sonatype/sisu/sisu-inject-bean/1.4.2/sisu-inject-bean-1.4.2.jar (153 kB at 408 kB/s)
[INFO] Downloading from central: https://repo.maven.apache.org/maven2/org/apache/maven/maven-settings-builder/3.0/maven-settings-builder-3.0.jar
[INFO] Downloaded from central: https://repo.maven.apache.org/maven2/org/apache/maven/maven-model/3.0/maven-model-3.0.jar (165 kB at 405 kB/s)
[INFO] Downloading from central: https://repo.maven.apache.org/maven2/org/apache/maven/maven-repository-metadata/3.0/maven-repository-metadata-3.0.jar
[INFO] Downloaded from central: https://repo.maven.apache.org/maven2/org/codehaus/plexus/plexus-utils/2.0.4/plexus-utils-2.0.4.jar (222 kB at 546 kB/s)
[INFO] Downloading from central: https://repo.maven.apache.org/maven2/org/apache/maven/maven-model-builder/3.0/maven-model-builder-3.0.jar
[INFO] Downloaded from central: https://repo.maven.apache.org/maven2/org/apache/maven/maven-settings-builder/3.0/maven-settings-builder-3.0.jar (38 kB at 85 kB/s)
[INFO] Downloading from central: https://repo.maven.apache.org/maven2/org/apache/maven/maven-aether-provider/3.0/maven-aether-provider-3.0.jar
[INFO] Downloaded from central: https://repo.maven.apache.org/maven2/org/apache/maven/maven-repository-metadata/3.0/maven-repository-metadata-3.0.jar (30 kB at 64 kB/s)
[INFO] Downloading from central: https://repo.maven.apache.org/maven2/org/sonatype/aether/aether-impl/1.7/aether-impl-1.7.jar
[INFO] Downloaded from central: https://repo.maven.apache.org/maven2/org/apache/maven/maven-settings/3.0/maven-settings-3.0.jar (47 kB at 100 kB/s)
[INFO] Downloading from central: https://repo.maven.apache.org/maven2/org/sonatype/aether/aether-spi/1.7/aether-spi-1.7.jar
[INFO] Downloaded from central: https://repo.maven.apache.org/maven2/org/apache/maven/maven-model-builder/3.0/maven-model-builder-3.0.jar (148 kB at 316 kB/s)
[INFO] Downloading from central: https://repo.maven.apache.org/maven2/org/sonatype/aether/aether-api/1.7/aether-api-1.7.jar
[INFO] Downloaded from central: https://repo.maven.apache.org/maven2/org/apache/maven/maven-aether-provider/3.0/maven-aether-provider-3.0.jar (51 kB at 105 kB/s)
[INFO] Downloading from central: https://repo.maven.apache.org/maven2/org/sonatype/aether/aether-util/1.7/aether-util-1.7.jar
[INFO] Downloaded from central: https://repo.maven.apache.org/maven2/org/sonatype/aether/aether-spi/1.7/aether-spi-1.7.jar (14 kB at 27 kB/s)
[INFO] Downloading from central: https://repo.maven.apache.org/maven2/org/codehaus/plexus/plexus-interpolation/1.14/plexus-interpolation-1.14.jar
[INFO] Downloaded from central: https://repo.maven.apache.org/maven2/org/sonatype/aether/aether-impl/1.7/aether-impl-1.7.jar (106 kB at 209 kB/s)
[INFO] Downloading from central: https://repo.maven.apache.org/maven2/org/codehaus/plexus/plexus-classworlds/2.2.3/plexus-classworlds-2.2.3.jar
[INFO] Downloaded from central: https://repo.maven.apache.org/maven2/org/apache/maven/maven-core/3.0/maven-core-3.0.jar (527 kB at 1.0 MB/s)
[INFO] Downloading from central: https://repo.maven.apache.org/maven2/org/codehaus/plexus/plexus-component-annotations/1.7.1/plexus-component-annotations-1.7.1.jar
[INFO] Downloaded from central: https://repo.maven.apache.org/maven2/org/sonatype/aether/aether-api/1.7/aether-api-1.7.jar (74 kB at 146 kB/s)
[INFO] Downloading from central: https://repo.maven.apache.org/maven2/org/apache/maven/shared/maven-shared-utils/3.2.1/maven-shared-utils-3.2.1.jar
[INFO] Downloaded from central: https://repo.maven.apache.org/maven2/org/codehaus/plexus/plexus-interpolation/1.14/plexus-interpolation-1.14.jar (61 kB at 116 kB/s)
[INFO] Downloading from central: https://repo.maven.apache.org/maven2/org/codehaus/plexus/plexus-java/0.9.10/plexus-java-0.9.10.jar
[INFO] Downloaded from central: https://repo.maven.apache.org/maven2/org/sonatype/aether/aether-util/1.7/aether-util-1.7.jar (108 kB at 206 kB/s)
[INFO] Downloading from central: https://repo.maven.apache.org/maven2/org/ow2/asm/asm/6.2/asm-6.2.jar
[INFO] Downloaded from central: https://repo.maven.apache.org/maven2/org/codehaus/plexus/plexus-component-annotations/1.7.1/plexus-component-annotations-1.7.1.jar (4.3 kB at 8.0 kB/s)
[INFO] Downloading from central: https://repo.maven.apache.org/maven2/com/thoughtworks/qdox/qdox/2.0-M9/qdox-2.0-M9.jar
[INFO] Downloaded from central: https://repo.maven.apache.org/maven2/org/codehaus/plexus/plexus-classworlds/2.2.3/plexus-classworlds-2.2.3.jar (46 kB at 86 kB/s)
[INFO] Downloading from central: https://repo.maven.apache.org/maven2/org/codehaus/plexus/plexus-compiler-api/2.8.4/plexus-compiler-api-2.8.4.jar
[INFO] Downloaded from central: https://repo.maven.apache.org/maven2/org/codehaus/plexus/plexus-java/0.9.10/plexus-java-0.9.10.jar (39 kB at 73 kB/s)
[INFO] Downloading from central: https://repo.maven.apache.org/maven2/org/codehaus/plexus/plexus-compiler-manager/2.8.4/plexus-compiler-manager-2.8.4.jar
[INFO] Downloaded from central: https://repo.maven.apache.org/maven2/org/apache/maven/shared/maven-shared-utils/3.2.1/maven-shared-utils-3.2.1.jar (167 kB at 301 kB/s)
[INFO] Downloading from central: https://repo.maven.apache.org/maven2/org/codehaus/plexus/plexus-compiler-javac/2.8.4/plexus-compiler-javac-2.8.4.jar
[INFO] Downloaded from central: https://repo.maven.apache.org/maven2/org/ow2/asm/asm/6.2/asm-6.2.jar (111 kB at 201 kB/s)
[INFO] Downloaded from central: https://repo.maven.apache.org/maven2/org/codehaus/plexus/plexus-compiler-manager/2.8.4/plexus-compiler-manager-2.8.4.jar (4.7 kB at 8.2 kB/s)
[INFO] Downloaded from central: https://repo.maven.apache.org/maven2/org/codehaus/plexus/plexus-compiler-api/2.8.4/plexus-compiler-api-2.8.4.jar (27 kB at 47 kB/s)
[INFO] Downloaded from central: https://repo.maven.apache.org/maven2/org/codehaus/plexus/plexus-compiler-javac/2.8.4/plexus-compiler-javac-2.8.4.jar (21 kB at 36 kB/s)
[INFO] Downloaded from central: https://repo.maven.apache.org/maven2/com/thoughtworks/qdox/qdox/2.0-M9/qdox-2.0-M9.jar (317 kB at 528 kB/s)
[INFO] No sources to compile
[INFO]
[INFO] --- maven-resources-plugin:2.6:testResources (default-testResources) @ supplemental-models ---
[WARNING] Using platform encoding (Cp1252 actually) to copy filtered resources, i.e. build is platform dependent!
[INFO] skip non existing resourceDirectory F:\jenkins\jenkins-slave\workspace\resources-plugin_MRRESOURCES-112@2\windows-jdk12-m3.5.x_build\target\test-classes\supplemental-artifact\resource-projects\supplemental-models\src\test\resources
[INFO]
[INFO] --- maven-compiler-plugin:3.8.0:testCompile (default-testCompile) @ supplemental-models ---
[INFO] No sources to compile
[INFO]
[INFO] --- maven-surefire-plugin:2.12.4:test (default-test) @ supplemental-models ---
[INFO] No tests to run.
[INFO]
[INFO] --- maven-jar-plugin:2.4:jar (default-jar) @ supplemental-models ---
[INFO] Building jar: F:\jenkins\jenkins-slave\workspace\resources-plugin_MRRESOURCES-112@2\windows-jdk12-m3.5.x_build\target\test-classes\supplemental-artifact\resource-projects\supplemental-models\target\supplemental-models-1.jar
[INFO]
[INFO] --- maven-install-plugin:2.4:install (default-install) @ supplemental-models ---
[INFO] Installing F:\jenkins\jenkins-slave\workspace\resources-plugin_MRRESOURCES-112@2\windows-jdk12-m3.5.x_build\target\test-classes\supplemental-artifact\resource-projects\supplemental-models\target\supplemental-models-1.jar to f:\jenkins\jenkins-slave\workspace\resources-plugin_MRRESOURCES-112@2\windows-jdk12-m3.5.x_build\target\it-repo\org\apache\maven\plugin\rresource\it\mrr43\supplemental-models\1\supplemental-models-1.jar
[INFO] Installing F:\jenkins\jenkins-slave\workspace\resources-plugin_MRRESOURCES-112@2\windows-jdk12-m3.5.x_build\target\test-classes\supplemental-artifact\resource-projects\supplemental-models\pom.xml to f:\jenkins\jenkins-slave\workspace\resources-plugin_MRRESOURCES-112@2\windows-jdk12-m3.5.x_build\target\it-repo\org\apache\maven\plugin\rresource\it\mrr43\supplemental-models\1\supplemental-models-1.pom
[INFO]
[INFO] --- maven-deploy-plugin:2.7:deploy (default-deploy) @ supplemental-models ---
[INFO] Uploading to it-remote: file:f:\\jenkins\\jenkins-slave\\workspace\\resources-plugin_MRRESOURCES-112@2\\windows-jdk12-m3.5.x_build\\target/remote-repo/org/apache/maven/plugin/rresource/it/mrr43/supplemental-models/1/supplemental-models-1.jar
[INFO] Uploaded to it-remote: file:f:\\jenkins\\jenkins-slave\\workspace\\resources-plugin_MRRESOURCES-112@2\\windows-jdk12-m3.5.x_build\\target/remote-repo/org/apache/maven/plugin/rresource/it/mrr43/supplemental-models/1/supplemental-models-1.jar (3.0 kB at 994 kB/s)
[INFO] Uploading to it-remote: file:f:\\jenkins\\jenkins-slave\\workspace\\resources-plugin_MRRESOURCES-112@2\\windows-jdk12-m3.5.x_build\\target/remote-repo/org/apache/maven/plugin/rresource/it/mrr43/supplemental-models/1/supplemental-models-1.pom
[INFO] Uploaded to it-remote: file:f:\\jenkins\\jenkins-slave\\workspace\\resources-plugin_MRRESOURCES-112@2\\windows-jdk12-m3.5.x_build\\target/remote-repo/org/apache/maven/plugin/rresource/it/mrr43/supplemental-models/1/supplemental-models-1.pom (1.3 kB at 162 kB/s)
[INFO] Downloading from it-remote: file:f:\\jenkins\\jenkins-slave\\workspace\\resources-plugin_MRRESOURCES-112@2\\windows-jdk12-m3.5.x_build\\target/remote-repo/org/apache/maven/plugin/rresource/it/mrr43/supplemental-models/maven-metadata.xml
[INFO] Uploading to it-remote: file:f:\\jenkins\\jenkins-slave\\workspace\\resources-plugin_MRRESOURCES-112@2\\windows-jdk12-m3.5.x_build\\target/remote-repo/org/apache/maven/plugin/rresource/it/mrr43/supplemental-models/maven-metadata.xml
[INFO] Uploaded to it-remote: file:f:\\jenkins\\jenkins-slave\\workspace\\resources-plugin_MRRESOURCES-112@2\\windows-jdk12-m3.5.x_build\\target/remote-repo/org/apache/maven/plugin/rresource/it/mrr43/supplemental-models/maven-metadata.xml (333 B)
[INFO]
[INFO] ------------------------------------------------------------------------
[INFO] Building deficient-dep 1
[INFO] ------------------------------------------------------------------------
[INFO]
[INFO] --- maven-clean-plugin:2.5:clean (default-cli) @ deficient-dep ---
[INFO]
[INFO] --- maven-resources-plugin:2.6:resources (default-resources) @ deficient-dep ---
[WARNING] Using platform encoding (Cp1252 actually) to copy filtered resources, i.e. build is platform dependent!
[INFO] skip non existing resourceDirectory F:\jenkins\jenkins-slave\workspace\resources-plugin_MRRESOURCES-112@2\windows-jdk12-m3.5.x_build\target\test-classes\supplemental-artifact\resource-projects\deficient-dep\src\main\resources
[INFO]
[INFO] --- maven-compiler-plugin:3.8.0:compile (default-compile) @ deficient-dep ---
[INFO] Changes detected - recompiling the module!
[WARNING] File encoding has not been set, using platform encoding Cp1252, i.e. build is platform dependent!
[INFO] Compiling 1 source file to F:\jenkins\jenkins-slave\workspace\resources-plugin_MRRESOURCES-112@2\windows-jdk12-m3.5.x_build\target\test-classes\supplemental-artifact\resource-projects\deficient-dep\target\classes
[INFO] -------------------------------------------------------------
[ERROR] COMPILATION ERROR :
[INFO] -------------------------------------------------------------
[ERROR] Source option 6 is no longer supported. Use 7 or later.
[ERROR] Target option 6 is no longer supported. Use 7 or later.
[INFO] 2 errors
[INFO] -------------------------------------------------------------
[INFO] ------------------------------------------------------------------------
[INFO] Reactor Summary:
[INFO]
[INFO] resources .......................................... SUCCESS [ 1.092 s]
[INFO] supplemental-models ................................ SUCCESS [ 5.077 s]
[INFO] deficient-dep ...................................... FAILURE [ 1.097 s]
[INFO] ------------------------------------------------------------------------
[INFO] BUILD FAILURE
[INFO] ------------------------------------------------------------------------
[INFO] Total time: 7.796 s
[INFO] Finished at: 2019-03-15T10:45:14Z
[INFO] Final Memory: 15M/44M
[INFO] ------------------------------------------------------------------------
[ERROR] Failed to execute goal org.apache.maven.plugins:maven-compiler-plugin:3.8.0:compile (default-compile) on project deficient-dep: Compilation failure: Compilation failure:
[ERROR] Source option 6 is no longer supported. Use 7 or later.
[ERROR] Target option 6 is no longer supported. Use 7 or later.
[ERROR] -> [Help 1]
org.apache.maven.lifecycle.LifecycleExecutionException: Failed to execute goal org.apache.maven.plugins:maven-compiler-plugin:3.8.0:compile (default-compile) on project deficient-dep: Compilation failure
at org.apache.maven.lifecycle.internal.MojoExecutor.execute (MojoExecutor.java:213)
at org.apache.maven.lifecycle.internal.MojoExecutor.execute (MojoExecutor.java:154)
at org.apache.maven.lifecycle.internal.MojoExecutor.execute (MojoExecutor.java:146)
at org.apache.maven.lifecycle.internal.LifecycleModuleBuilder.buildProject (LifecycleModuleBuilder.java:117)
at org.apache.maven.lifecycle.internal.LifecycleModuleBuilder.buildProject (LifecycleModuleBuilder.java:81)
at org.apache.maven.lifecycle.internal.builder.singlethreaded.SingleThreadedBuilder.build (SingleThreadedBuilder.java:51)
at org.apache.maven.lifecycle.internal.LifecycleStarter.execute (LifecycleStarter.java:128)
at org.apache.maven.DefaultMaven.doExecute (DefaultMaven.java:309)
at org.apache.maven.DefaultMaven.doExecute (DefaultMaven.java:194)
at org.apache.maven.DefaultMaven.execute (DefaultMaven.java:107)
at org.apache.maven.cli.MavenCli.execute (MavenCli.java:955)
at org.apache.maven.cli.MavenCli.doMain (MavenCli.java:290)
at org.apache.maven.cli.MavenCli.main (MavenCli.java:194)
at jdk.internal.reflect.NativeMethodAccessorImpl.invoke0 (Native Method)
at jdk.internal.reflect.NativeMethodAccessorImpl.invoke (NativeMethodAccessorImpl.java:62)
at jdk.internal.reflect.DelegatingMethodAccessorImpl.invoke (DelegatingMethodAccessorImpl.java:43)
at java.lang.reflect.Method.invoke (Method.java:567)
at org.codehaus.plexus.classworlds.launcher.Launcher.launchEnhanced (Launcher.java:289)
at org.codehaus.plexus.classworlds.launcher.Launcher.launch (Launcher.java:229)
at org.codehaus.plexus.classworlds.launcher.Launcher.mainWithExitCode (Launcher.java:415)
at org.codehaus.plexus.classworlds.launcher.Launcher.main (Launcher.java:356)
Caused by: org.apache.maven.plugin.compiler.CompilationFailureException: Compilation failure
at org.apache.maven.plugin.compiler.AbstractCompilerMojo.execute (AbstractCompilerMojo.java:1215)
at org.apache.maven.plugin.compiler.CompilerMojo.execute (CompilerMojo.java:188)
at org.apache.maven.plugin.DefaultBuildPluginManager.executeMojo (DefaultBuildPluginManager.java:134)
at org.apache.maven.lifecycle.internal.MojoExecutor.execute (MojoExecutor.java:208)
at org.apache.maven.lifecycle.internal.MojoExecutor.execute (MojoExecutor.java:154)
at org.apache.maven.lifecycle.internal.MojoExecutor.execute (MojoExecutor.java:146)
at org.apache.maven.lifecycle.internal.LifecycleModuleBuilder.buildProject (LifecycleModuleBuilder.java:117)
at org.apache.maven.lifecycle.internal.LifecycleModuleBuilder.buildProject (LifecycleModuleBuilder.java:81)
at org.apache.maven.lifecycle.internal.builder.singlethreaded.SingleThreadedBuilder.build (SingleThreadedBuilder.java:51)
at org.apache.maven.lifecycle.internal.LifecycleStarter.execute (LifecycleStarter.java:128)
at org.apache.maven.DefaultMaven.doExecute (DefaultMaven.java:309)
at org.apache.maven.DefaultMaven.doExecute (DefaultMaven.java:194)
at org.apache.maven.DefaultMaven.execute (DefaultMaven.java:107)
at org.apache.maven.cli.MavenCli.execute (MavenCli.java:955)
at org.apache.maven.cli.MavenCli.doMain (MavenCli.java:290)
at org.apache.maven.cli.MavenCli.main (MavenCli.java:194)
at jdk.internal.reflect.NativeMethodAccessorImpl.invoke0 (Native Method)
at jdk.internal.reflect.NativeMethodAccessorImpl.invoke (NativeMethodAccessorImpl.java:62)
at jdk.internal.reflect.DelegatingMethodAccessorImpl.invoke (DelegatingMethodAccessorImpl.java:43)
at java.lang.reflect.Method.invoke (Method.java:567)
at org.codehaus.plexus.classworlds.launcher.Launcher.launchEnhanced (Launcher.java:289)
at org.codehaus.plexus.classworlds.launcher.Launcher.launch (Launcher.java:229)
at org.codehaus.plexus.classworlds.launcher.Launcher.mainWithExitCode (Launcher.java:415)
at org.codehaus.plexus.classworlds.launcher.Launcher.main (Launcher.java:356)
[ERROR]
[ERROR] Re-run Maven using the -X switch to enable full debug logging.
[ERROR]
[ERROR] For more information about the errors and possible solutions, please read the following articles:
[ERROR] [Help 1] http://cwiki.apache.org/confluence/display/MAVEN/MojoFailureException
[ERROR]
[ERROR] After correcting the problems, you can resume the build with the command
[ERROR] mvn <goals> -rf :deficient-dep
at org.apache.maven.plugin.resources.remote.it.IT_SupplementalArtifact.test(IT_SupplementalArtifact.java:53)
Build log:
[...truncated 4251 lines...]
[INFO] Results:
[INFO]
[INFO] Tests run: 10, Failures: 0, Errors: 0, Skipped: 0
[INFO]
[INFO]
[INFO] --- maven-jar-plugin:3.1.0:jar (default-jar) @ maven-remote-resources-plugin ---
[INFO] Preparing remote bundle test:test:1.0:war
[INFO] Copying 1 resource from 1 bundle.
[INFO] Building jar: f:\jenkins\jenkins-slave\workspace\resources-plugin_MRRESOURCES-112@2\windows-jdk8-m3.5.x_build\target\maven-remote-resources-plugin-1.6.1-SNAPSHOT.jar
[WARNING] sourceEncoding has not been set, using platform encoding Cp1252, i.e. build is platform dependent!
[INFO] Writing META-INF/maven/remote-resources.xml descriptor with 1 entry
[INFO] Preparing remote bundle test:test:1.0
[INFO] Copying 1 resource from 1 bundle.
[INFO] Writing META-INF/maven/remote-resources.xml descriptor with 1 entry
[INFO] Preparing remote bundle test:test:1.3
[INFO] Copying 1 resource from 1 bundle.
[WARNING] sourceEncoding has not been set, using platform encoding Cp1252, i.e. build is platform dependent!
[INFO] Writing META-INF/maven/remote-resources.xml descriptor with 1 entry
[INFO] Preparing remote bundle test:test:1.0:jar:test
[INFO] Copying 1 resource from 1 bundle.
[INFO] Copying 0 resource from 0 bundle.
[WARNING] sourceEncoding has not been set, using platform encoding Cp1252, i.e. build is platform dependent!
[INFO] Writing META-INF/maven/remote-resources.xml descriptor with 1 entry
[INFO] Tests run: 10, Failures: 0, Errors: 0, Skipped: 0, Time elapsed: 19.857 s - in org.apache.maven.plugin.resources.remote.RemoteResourcesMojoTest
[INFO]
[INFO] --- maven-plugin-plugin:3.5.2:addPluginArtifactMetadata (default-addPluginArtifactMetadata) @ maven-remote-resources-plugin ---
[INFO]
[INFO] --- maven-site-plugin:3.7.1:attach-descriptor (attach-descriptor) @ maven-remote-resources-plugin ---
[INFO]
[INFO] Results:
[INFO]
[INFO] Tests run: 10, Failures: 0, Errors: 0, Skipped: 0
[INFO]
[INFO]
[INFO] --- maven-jar-plugin:3.1.0:jar (default-jar) @ maven-remote-resources-plugin ---
[INFO] Building jar: f:\jenkins\jenkins-slave\workspace\resources-plugin_MRRESOURCES-112@3@2\windows-jdk11-m3.5.x_build\target\maven-remote-resources-plugin-1.6.1-SNAPSHOT.jar
[INFO] Skipping because packaging 'maven-plugin' is not pom.
[INFO]
[INFO] --- maven-invoker-plugin:3.1.0:install (integration-test) @ maven-remote-resources-plugin ---
[INFO]
[INFO] --- maven-plugin-plugin:3.5.2:addPluginArtifactMetadata (default-addPluginArtifactMetadata) @ maven-remote-resources-plugin ---
[INFO]
[INFO] --- maven-site-plugin:3.7.1:attach-descriptor (attach-descriptor) @ maven-remote-resources-plugin ---
[INFO] Skipping because packaging 'maven-plugin' is not pom.
[INFO]
[INFO] --- maven-invoker-plugin:3.1.0:install (integration-test) @ maven-remote-resources-plugin ---
[INFO] Installing f:\jenkins\jenkins-slave\workspace\resources-plugin_MRRESOURCES-112@2\windows-jdk8-m3.5.x_build\pom.xml to f:\jenkins\jenkins-slave\workspace\resources-plugin_MRRESOURCES-112@2\windows-jdk8-m3.5.x_build\target\local-repo\org\apache\maven\plugins\maven-remote-resources-plugin\1.6.1-SNAPSHOT\maven-remote-resources-plugin-1.6.1-SNAPSHOT.pom
[INFO] Installing f:\jenkins\jenkins-slave\workspace\resources-plugin_MRRESOURCES-112@2\windows-jdk8-m3.5.x_build\target\maven-remote-resources-plugin-1.6.1-SNAPSHOT.jar to f:\jenkins\jenkins-slave\workspace\resources-plugin_MRRESOURCES-112@2\windows-jdk8-m3.5.x_build\target\local-repo\org\apache\maven\plugins\maven-remote-resources-plugin\1.6.1-SNAPSHOT\maven-remote-resources-plugin-1.6.1-SNAPSHOT.jar
[INFO]
[INFO] --- maven-invoker-plugin:3.1.0:install (install-descriptor) @ maven-remote-resources-plugin ---
[INFO] Installing f:\jenkins\jenkins-slave\workspace\resources-plugin_MRRESOURCES-112@3@2\windows-jdk11-m3.5.x_build\pom.xml to f:\jenkins\jenkins-slave\workspace\resources-plugin_MRRESOURCES-112@3@2\windows-jdk11-m3.5.x_build\target\local-repo\org\apache\maven\plugins\maven-remote-resources-plugin\1.6.1-SNAPSHOT\maven-remote-resources-plugin-1.6.1-SNAPSHOT.pom
[INFO] Installing f:\jenkins\jenkins-slave\workspace\resources-plugin_MRRESOURCES-112@3@2\windows-jdk11-m3.5.x_build\target\maven-remote-resources-plugin-1.6.1-SNAPSHOT.jar to f:\jenkins\jenkins-slave\workspace\resources-plugin_MRRESOURCES-112@3@2\windows-jdk11-m3.5.x_build\target\local-repo\org\apache\maven\plugins\maven-remote-resources-plugin\1.6.1-SNAPSHOT\maven-remote-resources-plugin-1.6.1-SNAPSHOT.jar
[INFO]
[INFO] --- maven-invoker-plugin:3.1.0:install (install-descriptor) @ maven-remote-resources-plugin ---
[INFO] Installing f:\jenkins\jenkins-slave\workspace\resources-plugin_MRRESOURCES-112@2\windows-jdk8-m3.5.x_build\pom.xml to f:\jenkins\jenkins-slave\workspace\resources-plugin_MRRESOURCES-112@2\windows-jdk8-m3.5.x_build\target\it-repo\org\apache\maven\plugins\maven-remote-resources-plugin\1.6.1-SNAPSHOT\maven-remote-resources-plugin-1.6.1-SNAPSHOT.pom
[INFO] Installing f:\jenkins\jenkins-slave\workspace\resources-plugin_MRRESOURCES-112@2\windows-jdk8-m3.5.x_build\target\maven-remote-resources-plugin-1.6.1-SNAPSHOT.jar to f:\jenkins\jenkins-slave\workspace\resources-plugin_MRRESOURCES-112@2\windows-jdk8-m3.5.x_build\target\it-repo\org\apache\maven\plugins\maven-remote-resources-plugin\1.6.1-SNAPSHOT\maven-remote-resources-plugin-1.6.1-SNAPSHOT.jar
[INFO]
[INFO] --- maven-failsafe-plugin:2.22.0:integration-test (integration-tests) @ maven-remote-resources-plugin ---
[INFO] Failsafe report directory: f:\jenkins\jenkins-slave\workspace\resources-plugin_MRRESOURCES-112@2\windows-jdk8-m3.5.x_build\target\failsafe-reports
[INFO]
[INFO] -------------------------------------------------------
[INFO] T E S T S
[INFO] -------------------------------------------------------
[INFO] Installing f:\jenkins\jenkins-slave\workspace\resources-plugin_MRRESOURCES-112@3@2\windows-jdk11-m3.5.x_build\pom.xml to f:\jenkins\jenkins-slave\workspace\resources-plugin_MRRESOURCES-112@3@2\windows-jdk11-m3.5.x_build\target\it-repo\org\apache\maven\plugins\maven-remote-resources-plugin\1.6.1-SNAPSHOT\maven-remote-resources-plugin-1.6.1-SNAPSHOT.pom
[INFO] Installing f:\jenkins\jenkins-slave\workspace\resources-plugin_MRRESOURCES-112@3@2\windows-jdk11-m3.5.x_build\target\maven-remote-resources-plugin-1.6.1-SNAPSHOT.jar to f:\jenkins\jenkins-slave\workspace\resources-plugin_MRRESOURCES-112@3@2\windows-jdk11-m3.5.x_build\target\it-repo\org\apache\maven\plugins\maven-remote-resources-plugin\1.6.1-SNAPSHOT\maven-remote-resources-plugin-1.6.1-SNAPSHOT.jar
[INFO]
[INFO] --- maven-failsafe-plugin:2.22.0:integration-test (integration-tests) @ maven-remote-resources-plugin ---
[INFO] Failsafe report directory: f:\jenkins\jenkins-slave\workspace\resources-plugin_MRRESOURCES-112@3@2\windows-jdk11-m3.5.x_build\target\failsafe-reports
[INFO]
[INFO] -------------------------------------------------------
[INFO] T E S T S
[INFO] -------------------------------------------------------
[INFO] Running org.apache.maven.plugin.resources.remote.it.IT_BadDependencyPoms
[INFO] Running org.apache.maven.plugin.resources.remote.it.IT_BadDependencyPoms
[INFO] Tests run: 1, Failures: 0, Errors: 0, Skipped: 0, Time elapsed: 288.736 s - in org.apache.maven.plugin.resources.remote.it.IT_BadDependencyPoms
[INFO] Running org.apache.maven.plugin.resources.remote.it.IT_CustomFilterDelimiter
[INFO] Tests run: 1, Failures: 0, Errors: 0, Skipped: 0, Time elapsed: 47.166 s - in org.apache.maven.plugin.resources.remote.it.IT_CustomFilterDelimiter
[INFO] Running org.apache.maven.plugin.resources.remote.it.IT_FilterLocalOverride
[INFO] Tests run: 1, Failures: 0, Errors: 0, Skipped: 0, Time elapsed: 332.814 s - in org.apache.maven.plugin.resources.remote.it.IT_BadDependencyPoms
[INFO] Running org.apache.maven.plugin.resources.remote.it.IT_CustomFilterDelimiter
[INFO] Tests run: 1, Failures: 0, Errors: 0, Skipped: 0, Time elapsed: 37.021 s - in org.apache.maven.plugin.resources.remote.it.IT_FilterLocalOverride
[INFO] Running org.apache.maven.plugin.resources.remote.it.IT_GenerateFromBundle
[INFO] Tests run: 1, Failures: 0, Errors: 0, Skipped: 0, Time elapsed: 36.687 s - in org.apache.maven.plugin.resources.remote.it.IT_GenerateFromBundle
[INFO] Running org.apache.maven.plugin.resources.remote.it.IT_GenerateFromBundleWithTypeAndClassifier
[INFO] Tests run: 1, Failures: 0, Errors: 0, Skipped: 0, Time elapsed: 66.297 s - in org.apache.maven.plugin.resources.remote.it.IT_CustomFilterDelimiter
[INFO] Running org.apache.maven.plugin.resources.remote.it.IT_FilterLocalOverride
[INFO] Tests run: 1, Failures: 0, Errors: 0, Skipped: 0, Time elapsed: 10.176 s - in org.apache.maven.plugin.resources.remote.it.IT_GenerateFromBundleWithTypeAndClassifier
[INFO] Running org.apache.maven.plugin.resources.remote.it.IT_GenerateFromOverride
[INFO] Tests run: 1, Failures: 0, Errors: 0, Skipped: 0, Time elapsed: 9.298 s - in org.apache.maven.plugin.resources.remote.it.IT_FilterLocalOverride
[INFO] Running org.apache.maven.plugin.resources.remote.it.IT_GenerateFromBundle
[INFO] Tests run: 1, Failures: 0, Errors: 0, Skipped: 0, Time elapsed: 9.2 s - in org.apache.maven.plugin.resources.remote.it.IT_GenerateFromOverride
[INFO] Running org.apache.maven.plugin.resources.remote.it.IT_GetDependencyProjects
[INFO] Tests run: 1, Failures: 0, Errors: 0, Skipped: 0, Time elapsed: 9.763 s - in org.apache.maven.plugin.resources.remote.it.IT_GenerateFromBundle
[INFO] Running org.apache.maven.plugin.resources.remote.it.IT_GenerateFromBundleWithTypeAndClassifier
[INFO] Tests run: 1, Failures: 0, Errors: 0, Skipped: 0, Time elapsed: 10.599 s - in org.apache.maven.plugin.resources.remote.it.IT_GenerateFromBundleWithTypeAndClassifier
[INFO] Running org.apache.maven.plugin.resources.remote.it.IT_GenerateFromOverride
[INFO] Tests run: 1, Failures: 0, Errors: 0, Skipped: 0, Time elapsed: 9.454 s - in org.apache.maven.plugin.resources.remote.it.IT_GenerateFromOverride
[INFO] Running org.apache.maven.plugin.resources.remote.it.IT_GetDependencyProjects
[INFO] Tests run: 1, Failures: 0, Errors: 0, Skipped: 0, Time elapsed: 26.348 s - in org.apache.maven.plugin.resources.remote.it.IT_GetDependencyProjects
[INFO] Running org.apache.maven.plugin.resources.remote.it.IT_RunOnlyAtExecutionRoot
[WARNING] Tests run: 1, Failures: 0, Errors: 0, Skipped: 1, Time elapsed: 0 s - in org.apache.maven.plugin.resources.remote.it.IT_RunOnlyAtExecutionRoot
[INFO] Running org.apache.maven.plugin.resources.remote.it.IT_SupplementalArtifact
[INFO] Tests run: 1, Failures: 0, Errors: 0, Skipped: 0, Time elapsed: 137.726 s - in org.apache.maven.plugin.resources.remote.it.IT_GetDependencyProjects
[INFO] Running org.apache.maven.plugin.resources.remote.it.IT_RunOnlyAtExecutionRoot
[WARNING] Tests run: 1, Failures: 0, Errors: 0, Skipped: 1, Time elapsed: 0 s - in org.apache.maven.plugin.resources.remote.it.IT_RunOnlyAtExecutionRoot
[INFO] Running org.apache.maven.plugin.resources.remote.it.IT_SupplementalArtifact
[INFO] Tests run: 1, Failures: 0, Errors: 0, Skipped: 0, Time elapsed: 165.17 s - in org.apache.maven.plugin.resources.remote.it.IT_SupplementalArtifact
[INFO]
[INFO] Results:
[INFO]
[WARNING] Tests run: 9, Failures: 0, Errors: 0, Skipped: 1
[INFO]
[INFO]
[INFO] --- maven-invoker-plugin:3.1.0:integration-test (integration-test) @ maven-remote-resources-plugin ---
[INFO] Running 1 setup job:
[INFO] Building: setup-bundle\pom.xml
[INFO] Tests run: 1, Failures: 0, Errors: 0, Skipped: 0, Time elapsed: 126.974 s - in org.apache.maven.plugin.resources.remote.it.IT_SupplementalArtifact
[INFO]
[INFO] Results:
[INFO]
[WARNING] Tests run: 9, Failures: 0, Errors: 0, Skipped: 1
[INFO]
[INFO]
[INFO] --- maven-invoker-plugin:3.1.0:integration-test (integration-test) @ maven-remote-resources-plugin ---
[INFO] Running 1 setup job:
[INFO] Building: setup-bundle\pom.xml
[INFO] setup-bundle\pom.xml ............................. SUCCESS (145.8 s)
[INFO] Setup done.
[INFO] Building: maven-remote-resources-test\pom.xml
[INFO] maven-remote-resources-test\pom.xml .............. SUCCESS (66.3 s)
[INFO] Building: process\pom.xml
[INFO] run post-build script verify.groovy
[INFO] process\pom.xml .................................. SUCCESS (51.7 s)
[INFO]
[INFO] --- maven-checkstyle-plugin:3.0.0:check (checkstyle-check) @ maven-remote-resources-plugin ---
[INFO]
[INFO] --- maven-failsafe-plugin:2.22.0:verify (integration-tests) @ maven-remote-resources-plugin ---
[INFO] Failsafe report directory: f:\jenkins\jenkins-slave\workspace\resources-plugin_MRRESOURCES-112@2\windows-jdk8-m3.5.x_build\target\failsafe-reports
[INFO]
[INFO] --- maven-invoker-plugin:3.1.0:verify (integration-test) @ maven-remote-resources-plugin ---
[INFO] -------------------------------------------------
[INFO] Build Summary:
[INFO] Passed: 3, Failed: 0, Errors: 0, Skipped: 0
[INFO] -------------------------------------------------
[INFO] ------------------------------------------------------------------------
[INFO] BUILD SUCCESS
[INFO] ------------------------------------------------------------------------
[INFO] Total time: 19:12 min
[INFO] Finished at: 2019-03-15T11:03:37Z
[INFO] Final Memory: 63M/1377M
[INFO] ------------------------------------------------------------------------
[INFO] [jenkins-event-spy] Generated F:\jenkins\jenkins-slave\workspace\resources-plugin_MRRESOURCES-112@2@tmp\withMaven9a097ecb\maven-spy-20190315-104421-8012262637115897878019.log
Picked up JAVA_TOOL_OPTIONS: -Dmaven.ext.class.path="f:\jenkins\jenkins-slave\workspace\resources-plugin_MRRESOURCES-112@2@tmp\withMaven9a097ecb\pipeline-maven-spy.jar" -Dorg.jenkinsci.plugins.pipeline.maven.reportsFolder="f:\jenkins\jenkins-slave\workspace\resources-plugin_MRRESOURCES-112@2@tmp\withMaven9a097ecb"
[Pipeline] }
[Pipeline] // dir
[Pipeline] }
[withMaven] artifactsPublisher - Archive artifact windows-jdk8-m3.5.x_build\pom.xml under org\apache\maven\plugins\maven-remote-resources-plugin\1.6.1-SNAPSHOT\maven-remote-resources-plugin-1.6.1-SNAPSHOT.pom
[withMaven] artifactsPublisher - Archive artifact windows-jdk8-m3.5.x_build\target\maven-remote-resources-plugin-1.6.1-SNAPSHOT.jar under org\apache\maven\plugins\maven-remote-resources-plugin\1.6.1-SNAPSHOT\maven-remote-resources-plugin-1.6.1-SNAPSHOT.jar
[Fast Archiver] No prior successful build to compare, so performing full copy of artifacts
[withMaven] junitPublisher - Archive test results for Maven artifact org.apache.maven.plugins:maven-remote-resources-plugin:maven-plugin:1.6.1-SNAPSHOT generated by maven-surefire-plugin:test (default-test): windows-jdk8-m3.5.x_build\target\surefire-reports\*.xml
Recording test results
[withMaven] junitPublisher - Archive test results for Maven artifact org.apache.maven.plugins:maven-remote-resources-plugin:maven-plugin:1.6.1-SNAPSHOT generated by maven-failsafe-plugin:integration-test (integration-tests): windows-jdk8-m3.5.x_build\target\failsafe-reports\*.xml
Recording test results
[withMaven] openTasksPublisher - Scan Tasks for Maven artifact org.apache.maven.plugins:maven-remote-resources-plugin:maven-plugin:1.6.1-SNAPSHOT in source directory windows-jdk8-m3.5.x_build\src\main\java
[TASKS] Scanning folder 'f:\jenkins\jenkins-slave\workspace\resources-plugin_MRRESOURCES-112@2' for files matching the pattern 'windows-jdk8-m3.5.x_build\src\main\java\**\*' - excludes: null
[TASKS] Found 3 files to scan for tasks
[TASKS] Found 2 open tasks.
Skipping warnings blame since pipelines do not have an SCM link.%n
[withMaven] invokerPublisher - Archive invoker results for Maven artifact MavenArtifact{org.apache.maven.plugins:maven-remote-resources-plugin:maven-plugin:1.6.1-SNAPSHOT(version: 1.6.1-SNAPSHOT, snapshot:false) } generated by PluginInvocation{org.apache.maven.plugins:maven-invoker-plugin:3.1.0@integration-test integration-test}: windows-jdk8-m3.5.x_build\target\invoker-reports\*.xml
[INFO] setup-bundle\pom.xml ............................. SUCCESS (221.7 s)
[INFO] Setup done.
[INFO] Building: maven-remote-resources-test\pom.xml
[withMaven] Publishers: Generated Artifacts Publisher: 899 ms, Junit Publisher: 5862 ms, Open Task Scanner Publisher: 541 ms, Invoker Publisher: 31867 ms, Pipeline Graph Publisher: 20 ms
[Pipeline] // withMaven
[Pipeline] cleanWs
[WS-CLEANUP] Deleting project workspace...
[WS-CLEANUP] Deferred wipeout is used...
[WS-CLEANUP] done
[Pipeline] }
[Pipeline] // stage
[Pipeline] }
[Pipeline] // ws
[Pipeline] }
[Pipeline] // node
[Pipeline] }
[INFO] maven-remote-resources-test\pom.xml .............. SUCCESS (71.3 s)
[INFO] Building: process\pom.xml
[INFO] run post-build script verify.groovy
WARNING: An illegal reflective access operation has occurred
WARNING: Illegal reflective access by org.codehaus.groovy.reflection.CachedClass (file:/f:/jenkins/jenkins-slave/workspace/.maven_repositories/null/org/codehaus/groovy/groovy-all/2.4.8/groovy-all-2.4.8.jar) to method java.lang.Object.finalize()
WARNING: Please consider reporting this to the maintainers of org.codehaus.groovy.reflection.CachedClass
WARNING: Use --illegal-access=warn to enable warnings of further illegal reflective access operations
WARNING: All illegal access operations will be denied in a future release
[INFO] process\pom.xml .................................. SUCCESS (9.3 s)
[INFO]
[INFO] --- maven-checkstyle-plugin:3.0.0:check (checkstyle-check) @ maven-remote-resources-plugin ---
[INFO]
[INFO] --- maven-failsafe-plugin:2.22.0:verify (integration-tests) @ maven-remote-resources-plugin ---
[INFO] Failsafe report directory: f:\jenkins\jenkins-slave\workspace\resources-plugin_MRRESOURCES-112@3@2\windows-jdk11-m3.5.x_build\target\failsafe-reports
[INFO]
[INFO] --- maven-invoker-plugin:3.1.0:verify (integration-test) @ maven-remote-resources-plugin ---
[INFO] -------------------------------------------------
[INFO] Build Summary:
[INFO] Passed: 3, Failed: 0, Errors: 0, Skipped: 0
[INFO] -------------------------------------------------
[INFO] ------------------------------------------------------------------------
[INFO] BUILD SUCCESS
[INFO] ------------------------------------------------------------------------
[INFO] Total time: 21:01 min
[INFO] Finished at: 2019-03-15T11:05:25Z
[INFO] Final Memory: 43M/150M
[INFO] ------------------------------------------------------------------------
[INFO] [jenkins-event-spy] Generated F:\jenkins\jenkins-slave\workspace\resources-plugin_MRRESOURCES-112@3@2@tmp\withMaven685f445a\maven-spy-20190315-104421-1952466471615380156117.log
[Pipeline] }
[Pipeline] // dir
[Pipeline] }
[withMaven] artifactsPublisher - Archive artifact windows-jdk11-m3.5.x_build\pom.xml under org\apache\maven\plugins\maven-remote-resources-plugin\1.6.1-SNAPSHOT\maven-remote-resources-plugin-1.6.1-SNAPSHOT.pom
[withMaven] artifactsPublisher - Archive artifact windows-jdk11-m3.5.x_build\target\maven-remote-resources-plugin-1.6.1-SNAPSHOT.jar under org\apache\maven\plugins\maven-remote-resources-plugin\1.6.1-SNAPSHOT\maven-remote-resources-plugin-1.6.1-SNAPSHOT.jar
[Fast Archiver] No prior successful build to compare, so performing full copy of artifacts
[withMaven] junitPublisher - Archive test results for Maven artifact org.apache.maven.plugins:maven-remote-resources-plugin:maven-plugin:1.6.1-SNAPSHOT generated by maven-surefire-plugin:test (default-test): windows-jdk11-m3.5.x_build\target\surefire-reports\*.xml
Recording test results
[withMaven] junitPublisher - Archive test results for Maven artifact org.apache.maven.plugins:maven-remote-resources-plugin:maven-plugin:1.6.1-SNAPSHOT generated by maven-failsafe-plugin:integration-test (integration-tests): windows-jdk11-m3.5.x_build\target\failsafe-reports\*.xml
Recording test results
[withMaven] openTasksPublisher - Scan Tasks for Maven artifact org.apache.maven.plugins:maven-remote-resources-plugin:maven-plugin:1.6.1-SNAPSHOT in source directory windows-jdk11-m3.5.x_build\src\main\java
[TASKS] Scanning folder 'f:\jenkins\jenkins-slave\workspace\resources-plugin_MRRESOURCES-112@3@2' for files matching the pattern 'windows-jdk11-m3.5.x_build\src\main\java\**\*' - excludes: null
[TASKS] Found 3 files to scan for tasks
[TASKS] Found 2 open tasks.
Skipping warnings blame since pipelines do not have an SCM link.%n
[withMaven] invokerPublisher - Archive invoker results for Maven artifact MavenArtifact{org.apache.maven.plugins:maven-remote-resources-plugin:maven-plugin:1.6.1-SNAPSHOT(version: 1.6.1-SNAPSHOT, snapshot:false) } generated by PluginInvocation{org.apache.maven.plugins:maven-invoker-plugin:3.1.0@integration-test integration-test}: windows-jdk11-m3.5.x_build\target\invoker-reports\*.xml
[withMaven] Publishers: Generated Artifacts Publisher: 721 ms, Junit Publisher: 4351 ms, Open Task Scanner Publisher: 431 ms, Invoker Publisher: 3173 ms, Pipeline Graph Publisher: 1 ms
[Pipeline] // withMaven
[Pipeline] cleanWs
[WS-CLEANUP] Deleting project workspace...
[WS-CLEANUP] Deferred wipeout is used...
[WS-CLEANUP] done
[Pipeline] }
[Pipeline] // stage
[Pipeline] }
[Pipeline] // ws
[Pipeline] }
[Pipeline] // node
[Pipeline] }
[Pipeline] // parallel
[Pipeline] stage
[Pipeline] { (Notifications)
[Pipeline] echo
Build result: UNSTABLE
[Pipeline] jiraIssueSelector
[Pipeline] emailext
Build succeeded in Jenkins: Maven TLP » maven-remote-resources-plugin » MRRESOURCES-112 #3
Posted by Apache Jenkins Server <je...@builds.apache.org>.
See https://builds.apache.org/job/maven-box/job/maven-remote-resources-plugin/job/MRRESOURCES-112/3/
Changes:
* Keep tests compatible for Java 7
* Keep tests compatible for Java 7
* Keep tests compatible for Java 7
* Keep tests compatible for Java 7
* Keep tests compatible for Java 7
* Keep tests compatible for Java 7
* Keep tests compatible for Java 7
* Keep tests compatible for Java 7
* Keep tests compatible for Java 7
* Keep tests compatible for Java 7
* Keep tests compatible for Java 7
* Keep tests compatible for Java 7
All tests passed
Build unstable in Jenkins: Maven TLP » maven-remote-resources-plugin » MRRESOURCES-112 #2
Posted by Apache Jenkins Server <je...@builds.apache.org>.
See https://builds.apache.org/job/maven-box/job/maven-remote-resources-plugin/job/MRRESOURCES-112/2/
Changes:
* Testable with JDK 12
* Testable with JDK 12
* Testable with JDK 12
* Testable with JDK 12
* Testable with JDK 12
* Testable with JDK 12
* Testable with JDK 12
* Testable with JDK 12
* Testable with JDK 12
* Testable with JDK 12
* Testable with JDK 12
* Testable with JDK 12
72 tests failed.
FAILED: org.apache.maven.plugin.resources.remote.it.IT_BadDependencyPoms.linux-jdk8-m3.5.x_build / Build linux-jdk8-m3.5.x_build / test
Error Message:
null
Stack Trace:
java.lang.NullPointerException
FAILED: org.apache.maven.plugin.resources.remote.it.IT_BadDependencyPoms.linux-jdk7-m3.2.x_build / Build linux-jdk7-m3.2.x_build / test
Error Message:
null
Stack Trace:
java.lang.NullPointerException
FAILED: org.apache.maven.plugin.resources.remote.it.IT_BadDependencyPoms.linux-jdk7-m3.5.x_build / Build linux-jdk7-m3.5.x_build / test
Error Message:
null
Stack Trace:
java.lang.NullPointerException
FAILED: org.apache.maven.plugin.resources.remote.it.IT_BadDependencyPoms.windows-jdk7-m3.3.x_build / Build windows-jdk7-m3.3.x_build / test
Error Message:
null
Stack Trace:
java.lang.NullPointerException
FAILED: org.apache.maven.plugin.resources.remote.it.IT_BadDependencyPoms.windows-jdk7-m3.2.x_build / Build windows-jdk7-m3.2.x_build / test
Error Message:
null
Stack Trace:
java.lang.NullPointerException
FAILED: org.apache.maven.plugin.resources.remote.it.IT_BadDependencyPoms.linux-jdk7-m3.3.x_build / Build linux-jdk7-m3.3.x_build / test
Error Message:
null
Stack Trace:
java.lang.NullPointerException
FAILED: org.apache.maven.plugin.resources.remote.it.IT_BadDependencyPoms.windows-jdk7-m3.5.x_build / Build windows-jdk7-m3.5.x_build / test
Error Message:
null
Stack Trace:
java.lang.NullPointerException
FAILED: org.apache.maven.plugin.resources.remote.it.IT_BadDependencyPoms.windows-jdk8-m3.5.x_build / Build windows-jdk8-m3.5.x_build / test
Error Message:
null
Stack Trace:
java.lang.NullPointerException
FAILED: org.apache.maven.plugin.resources.remote.it.IT_CustomFilterDelimiter.linux-jdk8-m3.5.x_build / Build linux-jdk8-m3.5.x_build / test
Error Message:
null
Stack Trace:
java.lang.NullPointerException
FAILED: org.apache.maven.plugin.resources.remote.it.IT_CustomFilterDelimiter.linux-jdk7-m3.2.x_build / Build linux-jdk7-m3.2.x_build / test
Error Message:
null
Stack Trace:
java.lang.NullPointerException
FAILED: org.apache.maven.plugin.resources.remote.it.IT_CustomFilterDelimiter.linux-jdk7-m3.5.x_build / Build linux-jdk7-m3.5.x_build / test
Error Message:
null
Stack Trace:
java.lang.NullPointerException
FAILED: org.apache.maven.plugin.resources.remote.it.IT_CustomFilterDelimiter.windows-jdk7-m3.3.x_build / Build windows-jdk7-m3.3.x_build / test
Error Message:
null
Stack Trace:
java.lang.NullPointerException
FAILED: org.apache.maven.plugin.resources.remote.it.IT_CustomFilterDelimiter.windows-jdk7-m3.2.x_build / Build windows-jdk7-m3.2.x_build / test
Error Message:
null
Stack Trace:
java.lang.NullPointerException
FAILED: org.apache.maven.plugin.resources.remote.it.IT_CustomFilterDelimiter.linux-jdk7-m3.3.x_build / Build linux-jdk7-m3.3.x_build / test
Error Message:
null
Stack Trace:
java.lang.NullPointerException
FAILED: org.apache.maven.plugin.resources.remote.it.IT_CustomFilterDelimiter.windows-jdk7-m3.5.x_build / Build windows-jdk7-m3.5.x_build / test
Error Message:
null
Stack Trace:
java.lang.NullPointerException
FAILED: org.apache.maven.plugin.resources.remote.it.IT_CustomFilterDelimiter.windows-jdk8-m3.5.x_build / Build windows-jdk8-m3.5.x_build / test
Error Message:
null
Stack Trace:
java.lang.NullPointerException
FAILED: org.apache.maven.plugin.resources.remote.it.IT_FilterLocalOverride.linux-jdk8-m3.5.x_build / Build linux-jdk8-m3.5.x_build / test
Error Message:
null
Stack Trace:
java.lang.NullPointerException
FAILED: org.apache.maven.plugin.resources.remote.it.IT_FilterLocalOverride.linux-jdk7-m3.2.x_build / Build linux-jdk7-m3.2.x_build / test
Error Message:
null
Stack Trace:
java.lang.NullPointerException
FAILED: org.apache.maven.plugin.resources.remote.it.IT_FilterLocalOverride.linux-jdk7-m3.5.x_build / Build linux-jdk7-m3.5.x_build / test
Error Message:
null
Stack Trace:
java.lang.NullPointerException
FAILED: org.apache.maven.plugin.resources.remote.it.IT_FilterLocalOverride.windows-jdk7-m3.3.x_build / Build windows-jdk7-m3.3.x_build / test
Error Message:
null
Stack Trace:
java.lang.NullPointerException
FAILED: org.apache.maven.plugin.resources.remote.it.IT_FilterLocalOverride.windows-jdk7-m3.2.x_build / Build windows-jdk7-m3.2.x_build / test
Error Message:
null
Stack Trace:
java.lang.NullPointerException
FAILED: org.apache.maven.plugin.resources.remote.it.IT_FilterLocalOverride.linux-jdk7-m3.3.x_build / Build linux-jdk7-m3.3.x_build / test
Error Message:
null
Stack Trace:
java.lang.NullPointerException
FAILED: org.apache.maven.plugin.resources.remote.it.IT_FilterLocalOverride.windows-jdk7-m3.5.x_build / Build windows-jdk7-m3.5.x_build / test
Error Message:
null
Stack Trace:
java.lang.NullPointerException
FAILED: org.apache.maven.plugin.resources.remote.it.IT_FilterLocalOverride.windows-jdk8-m3.5.x_build / Build windows-jdk8-m3.5.x_build / test
Error Message:
null
Stack Trace:
java.lang.NullPointerException
FAILED: org.apache.maven.plugin.resources.remote.it.IT_GenerateFromBundle.linux-jdk8-m3.5.x_build / Build linux-jdk8-m3.5.x_build / test
Error Message:
null
Stack Trace:
java.lang.NullPointerException
FAILED: org.apache.maven.plugin.resources.remote.it.IT_GenerateFromBundle.linux-jdk7-m3.2.x_build / Build linux-jdk7-m3.2.x_build / test
Error Message:
null
Stack Trace:
java.lang.NullPointerException
FAILED: org.apache.maven.plugin.resources.remote.it.IT_GenerateFromBundle.linux-jdk7-m3.5.x_build / Build linux-jdk7-m3.5.x_build / test
Error Message:
null
Stack Trace:
java.lang.NullPointerException
FAILED: org.apache.maven.plugin.resources.remote.it.IT_GenerateFromBundle.windows-jdk7-m3.3.x_build / Build windows-jdk7-m3.3.x_build / test
Error Message:
null
Stack Trace:
java.lang.NullPointerException
FAILED: org.apache.maven.plugin.resources.remote.it.IT_GenerateFromBundle.windows-jdk7-m3.2.x_build / Build windows-jdk7-m3.2.x_build / test
Error Message:
null
Stack Trace:
java.lang.NullPointerException
FAILED: org.apache.maven.plugin.resources.remote.it.IT_GenerateFromBundle.linux-jdk7-m3.3.x_build / Build linux-jdk7-m3.3.x_build / test
Error Message:
null
Stack Trace:
java.lang.NullPointerException
FAILED: org.apache.maven.plugin.resources.remote.it.IT_GenerateFromBundle.windows-jdk7-m3.5.x_build / Build windows-jdk7-m3.5.x_build / test
Error Message:
null
Stack Trace:
java.lang.NullPointerException
FAILED: org.apache.maven.plugin.resources.remote.it.IT_GenerateFromBundle.windows-jdk8-m3.5.x_build / Build windows-jdk8-m3.5.x_build / test
Error Message:
null
Stack Trace:
java.lang.NullPointerException
FAILED: org.apache.maven.plugin.resources.remote.it.IT_GenerateFromBundleWithTypeAndClassifier.linux-jdk8-m3.5.x_build / Build linux-jdk8-m3.5.x_build / test
Error Message:
null
Stack Trace:
java.lang.NullPointerException
FAILED: org.apache.maven.plugin.resources.remote.it.IT_GenerateFromBundleWithTypeAndClassifier.linux-jdk7-m3.2.x_build / Build linux-jdk7-m3.2.x_build / test
Error Message:
null
Stack Trace:
java.lang.NullPointerException
FAILED: org.apache.maven.plugin.resources.remote.it.IT_GenerateFromBundleWithTypeAndClassifier.linux-jdk7-m3.5.x_build / Build linux-jdk7-m3.5.x_build / test
Error Message:
null
Stack Trace:
java.lang.NullPointerException
FAILED: org.apache.maven.plugin.resources.remote.it.IT_GenerateFromBundleWithTypeAndClassifier.windows-jdk7-m3.3.x_build / Build windows-jdk7-m3.3.x_build / test
Error Message:
null
Stack Trace:
java.lang.NullPointerException
FAILED: org.apache.maven.plugin.resources.remote.it.IT_GenerateFromBundleWithTypeAndClassifier.windows-jdk7-m3.2.x_build / Build windows-jdk7-m3.2.x_build / test
Error Message:
null
Stack Trace:
java.lang.NullPointerException
FAILED: org.apache.maven.plugin.resources.remote.it.IT_GenerateFromBundleWithTypeAndClassifier.linux-jdk7-m3.3.x_build / Build linux-jdk7-m3.3.x_build / test
Error Message:
null
Stack Trace:
java.lang.NullPointerException
FAILED: org.apache.maven.plugin.resources.remote.it.IT_GenerateFromBundleWithTypeAndClassifier.windows-jdk7-m3.5.x_build / Build windows-jdk7-m3.5.x_build / test
Error Message:
null
Stack Trace:
java.lang.NullPointerException
FAILED: org.apache.maven.plugin.resources.remote.it.IT_GenerateFromBundleWithTypeAndClassifier.windows-jdk8-m3.5.x_build / Build windows-jdk8-m3.5.x_build / test
Error Message:
null
Stack Trace:
java.lang.NullPointerException
FAILED: org.apache.maven.plugin.resources.remote.it.IT_GenerateFromOverride.linux-jdk8-m3.5.x_build / Build linux-jdk8-m3.5.x_build / test
Error Message:
null
Stack Trace:
java.lang.NullPointerException
FAILED: org.apache.maven.plugin.resources.remote.it.IT_GenerateFromOverride.linux-jdk7-m3.2.x_build / Build linux-jdk7-m3.2.x_build / test
Error Message:
null
Stack Trace:
java.lang.NullPointerException
FAILED: org.apache.maven.plugin.resources.remote.it.IT_GenerateFromOverride.linux-jdk7-m3.5.x_build / Build linux-jdk7-m3.5.x_build / test
Error Message:
null
Stack Trace:
java.lang.NullPointerException
FAILED: org.apache.maven.plugin.resources.remote.it.IT_GenerateFromOverride.windows-jdk7-m3.3.x_build / Build windows-jdk7-m3.3.x_build / test
Error Message:
null
Stack Trace:
java.lang.NullPointerException
FAILED: org.apache.maven.plugin.resources.remote.it.IT_GenerateFromOverride.windows-jdk7-m3.2.x_build / Build windows-jdk7-m3.2.x_build / test
Error Message:
null
Stack Trace:
java.lang.NullPointerException
FAILED: org.apache.maven.plugin.resources.remote.it.IT_GenerateFromOverride.linux-jdk7-m3.3.x_build / Build linux-jdk7-m3.3.x_build / test
Error Message:
null
Stack Trace:
java.lang.NullPointerException
FAILED: org.apache.maven.plugin.resources.remote.it.IT_GenerateFromOverride.windows-jdk7-m3.5.x_build / Build windows-jdk7-m3.5.x_build / test
Error Message:
null
Stack Trace:
java.lang.NullPointerException
FAILED: org.apache.maven.plugin.resources.remote.it.IT_GenerateFromOverride.windows-jdk8-m3.5.x_build / Build windows-jdk8-m3.5.x_build / test
Error Message:
null
Stack Trace:
java.lang.NullPointerException
FAILED: org.apache.maven.plugin.resources.remote.it.IT_GetDependencyProjects.linux-jdk8-m3.5.x_build / Build linux-jdk8-m3.5.x_build / test
Error Message:
null
Stack Trace:
java.lang.NullPointerException
FAILED: org.apache.maven.plugin.resources.remote.it.IT_GetDependencyProjects.linux-jdk7-m3.2.x_build / Build linux-jdk7-m3.2.x_build / test
Error Message:
null
Stack Trace:
java.lang.NullPointerException
FAILED: org.apache.maven.plugin.resources.remote.it.IT_GetDependencyProjects.linux-jdk7-m3.5.x_build / Build linux-jdk7-m3.5.x_build / test
Error Message:
null
Stack Trace:
java.lang.NullPointerException
FAILED: org.apache.maven.plugin.resources.remote.it.IT_GetDependencyProjects.windows-jdk7-m3.3.x_build / Build windows-jdk7-m3.3.x_build / test
Error Message:
null
Stack Trace:
java.lang.NullPointerException
FAILED: org.apache.maven.plugin.resources.remote.it.IT_GetDependencyProjects.windows-jdk7-m3.2.x_build / Build windows-jdk7-m3.2.x_build / test
Error Message:
null
Stack Trace:
java.lang.NullPointerException
FAILED: org.apache.maven.plugin.resources.remote.it.IT_GetDependencyProjects.linux-jdk7-m3.3.x_build / Build linux-jdk7-m3.3.x_build / test
Error Message:
null
Stack Trace:
java.lang.NullPointerException
FAILED: org.apache.maven.plugin.resources.remote.it.IT_GetDependencyProjects.windows-jdk7-m3.5.x_build / Build windows-jdk7-m3.5.x_build / test
Error Message:
null
Stack Trace:
java.lang.NullPointerException
FAILED: org.apache.maven.plugin.resources.remote.it.IT_GetDependencyProjects.windows-jdk8-m3.5.x_build / Build windows-jdk8-m3.5.x_build / test
Error Message:
null
Stack Trace:
java.lang.NullPointerException
FAILED: org.apache.maven.plugin.resources.remote.it.IT_SupplementalArtifact.linux-jdk8-m3.5.x_build / Build linux-jdk8-m3.5.x_build / test
Error Message:
null
Stack Trace:
java.lang.NullPointerException
FAILED: org.apache.maven.plugin.resources.remote.it.IT_SupplementalArtifact.linux-jdk7-m3.2.x_build / Build linux-jdk7-m3.2.x_build / test
Error Message:
null
Stack Trace:
java.lang.NullPointerException
FAILED: org.apache.maven.plugin.resources.remote.it.IT_SupplementalArtifact.linux-jdk7-m3.5.x_build / Build linux-jdk7-m3.5.x_build / test
Error Message:
null
Stack Trace:
java.lang.NullPointerException
FAILED: org.apache.maven.plugin.resources.remote.it.IT_SupplementalArtifact.windows-jdk7-m3.3.x_build / Build windows-jdk7-m3.3.x_build / test
Error Message:
null
Stack Trace:
java.lang.NullPointerException
FAILED: org.apache.maven.plugin.resources.remote.it.IT_SupplementalArtifact.windows-jdk7-m3.2.x_build / Build windows-jdk7-m3.2.x_build / test
Error Message:
null
Stack Trace:
java.lang.NullPointerException
FAILED: org.apache.maven.plugin.resources.remote.it.IT_SupplementalArtifact.linux-jdk7-m3.3.x_build / Build linux-jdk7-m3.3.x_build / test
Error Message:
null
Stack Trace:
java.lang.NullPointerException
FAILED: org.apache.maven.plugin.resources.remote.it.IT_SupplementalArtifact.windows-jdk7-m3.5.x_build / Build windows-jdk7-m3.5.x_build / test
Error Message:
null
Stack Trace:
java.lang.NullPointerException
FAILED: org.apache.maven.plugin.resources.remote.it.IT_SupplementalArtifact.windows-jdk8-m3.5.x_build / Build windows-jdk8-m3.5.x_build / test
Error Message:
null
Stack Trace:
java.lang.NullPointerException
FAILED: org.apache.maven.plugin.resources.remote.it.IT_RunOnlyAtExecutionRoot.linux-jdk8-m3.5.x_build / Build linux-jdk8-m3.5.x_build / test
Error Message:
null
Stack Trace:
java.lang.NullPointerException
FAILED: org.apache.maven.plugin.resources.remote.it.IT_RunOnlyAtExecutionRoot.linux-jdk7-m3.2.x_build / Build linux-jdk7-m3.2.x_build / test
Error Message:
null
Stack Trace:
java.lang.NullPointerException
FAILED: org.apache.maven.plugin.resources.remote.it.IT_RunOnlyAtExecutionRoot.linux-jdk7-m3.5.x_build / Build linux-jdk7-m3.5.x_build / test
Error Message:
null
Stack Trace:
java.lang.NullPointerException
FAILED: org.apache.maven.plugin.resources.remote.it.IT_RunOnlyAtExecutionRoot.windows-jdk7-m3.3.x_build / Build windows-jdk7-m3.3.x_build / test
Error Message:
null
Stack Trace:
java.lang.NullPointerException
FAILED: org.apache.maven.plugin.resources.remote.it.IT_RunOnlyAtExecutionRoot.windows-jdk7-m3.2.x_build / Build windows-jdk7-m3.2.x_build / test
Error Message:
null
Stack Trace:
java.lang.NullPointerException
FAILED: org.apache.maven.plugin.resources.remote.it.IT_RunOnlyAtExecutionRoot.linux-jdk7-m3.3.x_build / Build linux-jdk7-m3.3.x_build / test
Error Message:
null
Stack Trace:
java.lang.NullPointerException
FAILED: org.apache.maven.plugin.resources.remote.it.IT_RunOnlyAtExecutionRoot.windows-jdk7-m3.5.x_build / Build windows-jdk7-m3.5.x_build / test
Error Message:
null
Stack Trace:
java.lang.NullPointerException
FAILED: org.apache.maven.plugin.resources.remote.it.IT_RunOnlyAtExecutionRoot.windows-jdk8-m3.5.x_build / Build windows-jdk8-m3.5.x_build / test
Error Message:
null
Stack Trace:
java.lang.NullPointerException
Build log:
[...truncated 3981 lines...]
[INFO] -------------------------------------------------
[INFO] Build Summary:
[INFO] Passed: 3, Failed: 0, Errors: 0, Skipped: 0
[INFO] -------------------------------------------------
[INFO] ------------------------------------------------------------------------
[INFO] BUILD SUCCESS
[INFO] ------------------------------------------------------------------------
[INFO] Total time: 01:36 min
[INFO] Finished at: 2019-03-15T15:39:50Z
[INFO] ------------------------------------------------------------------------
[INFO] [jenkins-event-spy] Generated /home/jenkins/jenkins-slave/workspace/resources-plugin_MRRESOURCES-112@3@2@tmp/withMavenc5bfd5c3/maven-spy-20190315-153813-6687884263110035090443.log
[Pipeline] // dir
[Pipeline] }
[withMaven] artifactsPublisher - Archive artifact windows-jdk8-m3.5.x_build\pom.xml under org\apache\maven\plugins\maven-remote-resources-plugin\1.6.1-SNAPSHOT\maven-remote-resources-plugin-1.6.1-SNAPSHOT.pom
[withMaven] artifactsPublisher - Archive artifact windows-jdk8-m3.5.x_build\target\maven-remote-resources-plugin-1.6.1-SNAPSHOT.jar under org\apache\maven\plugins\maven-remote-resources-plugin\1.6.1-SNAPSHOT\maven-remote-resources-plugin-1.6.1-SNAPSHOT.jar
[Pipeline] }
[Pipeline] // dir
[withMaven] junitPublisher - Archive test results for Maven artifact org.apache.maven.plugins:maven-remote-resources-plugin:maven-plugin:1.6.1-SNAPSHOT generated by maven-surefire-plugin:test (default-test): windows-jdk8-m3.5.x_build\target\surefire-reports\*.xml
Recording test results
[Pipeline] }
[withMaven] junitPublisher - Archive test results for Maven artifact org.apache.maven.plugins:maven-remote-resources-plugin:maven-plugin:1.6.1-SNAPSHOT generated by maven-failsafe-plugin:integration-test (integration-tests): windows-jdk8-m3.5.x_build\target\failsafe-reports\*.xml
Recording test results
[withMaven] openTasksPublisher - Scan Tasks for Maven artifact org.apache.maven.plugins:maven-remote-resources-plugin:maven-plugin:1.6.1-SNAPSHOT in source directory linux-jdk12-m3.5.x_build/src/main/java
[TASKS] Scanning folder '/home/jenkins/jenkins-slave/workspace/resources-plugin_MRRESOURCES-112@2' for files matching the pattern 'linux-jdk12-m3.5.x_build/src/main/java/**/*' - excludes: null
[TASKS] Found 3 files to scan for tasks
[TASKS] Found 2 open tasks.
Skipping warnings blame since pipelines do not have an SCM link.%n
[TASKS] Computing warning deltas based on reference build #1
[INFO] Tests run: 1, Failures: 0, Errors: 0, Skipped: 0, Time elapsed: 11.213 s - in org.apache.maven.plugin.resources.remote.it.IT_GetDependencyProjects
[INFO] Running org.apache.maven.plugin.resources.remote.it.IT_RunOnlyAtExecutionRoot
[WARNING] Tests run: 1, Failures: 0, Errors: 0, Skipped: 1, Time elapsed: 0.001 s - in org.apache.maven.plugin.resources.remote.it.IT_RunOnlyAtExecutionRoot
[INFO] Running org.apache.maven.plugin.resources.remote.it.IT_SupplementalArtifact
[withMaven] openTasksPublisher - Scan Tasks for Maven artifact org.apache.maven.plugins:maven-remote-resources-plugin:maven-plugin:1.6.1-SNAPSHOT in source directory windows-jdk8-m3.5.x_build\src\main\java
[TASKS] Scanning folder 'f:\jenkins\jenkins-slave\workspace\resources-plugin_MRRESOURCES-112@3' for files matching the pattern 'windows-jdk8-m3.5.x_build\src\main\java\**\*' - excludes: null
[TASKS] Found 3 files to scan for tasks
[TASKS] Found 2 open tasks.
Skipping warnings blame since pipelines do not have an SCM link.%n
[TASKS] Computing warning deltas based on reference build #1
[withMaven] invokerPublisher - Archive invoker results for Maven artifact MavenArtifact{org.apache.maven.plugins:maven-remote-resources-plugin:maven-plugin:1.6.1-SNAPSHOT(version: 1.6.1-SNAPSHOT, snapshot:false) } generated by PluginInvocation{org.apache.maven.plugins:maven-invoker-plugin:3.1.0@integration-test integration-test}: linux-jdk12-m3.5.x_build/target/invoker-reports/*.xml
[withMaven] invokerPublisher - Archive invoker results for Maven artifact MavenArtifact{org.apache.maven.plugins:maven-remote-resources-plugin:maven-plugin:1.6.1-SNAPSHOT(version: 1.6.1-SNAPSHOT, snapshot:false) } generated by PluginInvocation{org.apache.maven.plugins:maven-invoker-plugin:3.1.0@integration-test integration-test}: windows-jdk8-m3.5.x_build\target\invoker-reports\*.xml
[withMaven] artifactsPublisher - Archive artifact linux-jdk11-m3.5.x_build/pom.xml under org/apache/maven/plugins/maven-remote-resources-plugin/1.6.1-SNAPSHOT/maven-remote-resources-plugin-1.6.1-SNAPSHOT.pom
[withMaven] artifactsPublisher - Archive artifact linux-jdk11-m3.5.x_build/target/maven-remote-resources-plugin-1.6.1-SNAPSHOT.jar under org/apache/maven/plugins/maven-remote-resources-plugin/1.6.1-SNAPSHOT/maven-remote-resources-plugin-1.6.1-SNAPSHOT.jar
[withMaven] Publishers: Generated Artifacts Publisher: 142 ms, Junit Publisher: 631 ms, Open Task Scanner Publisher: 107 ms, Invoker Publisher: 1130 ms, Pipeline Graph Publisher: 1 ms
[Pipeline] // withMaven
[Pipeline] cleanWs
[WS-CLEANUP] Deleting project workspace...
[WS-CLEANUP] Deferred wipeout is used...
[withMaven] junitPublisher - Archive test results for Maven artifact org.apache.maven.plugins:maven-remote-resources-plugin:maven-plugin:1.6.1-SNAPSHOT generated by maven-surefire-plugin:test (default-test): linux-jdk11-m3.5.x_build/target/surefire-reports/*.xml
Recording test results
[WS-CLEANUP] done
[Pipeline] }
[Pipeline] // stage
[Pipeline] }
[Pipeline] // ws
[Pipeline] }
[withMaven] junitPublisher - Archive test results for Maven artifact org.apache.maven.plugins:maven-remote-resources-plugin:maven-plugin:1.6.1-SNAPSHOT generated by maven-failsafe-plugin:integration-test (integration-tests): linux-jdk11-m3.5.x_build/target/failsafe-reports/*.xml
Recording test results
[Pipeline] // node
[Pipeline] }
[INFO] Tests run: 1, Failures: 0, Errors: 0, Skipped: 0, Time elapsed: 7.134 s - in org.apache.maven.plugin.resources.remote.it.IT_GenerateFromBundle
[INFO] Running org.apache.maven.plugin.resources.remote.it.IT_GenerateFromBundleWithTypeAndClassifier
[withMaven] Publishers: Generated Artifacts Publisher: 1141 ms, Junit Publisher: 5089 ms, Open Task Scanner Publisher: 520 ms, Invoker Publisher: 6531 ms, Pipeline Graph Publisher: 1 ms
[withMaven] openTasksPublisher - Scan Tasks for Maven artifact org.apache.maven.plugins:maven-remote-resources-plugin:maven-plugin:1.6.1-SNAPSHOT in source directory linux-jdk11-m3.5.x_build/src/main/java
[Pipeline] // withMaven
[TASKS] Scanning folder '/home/jenkins/jenkins-slave/workspace/resources-plugin_MRRESOURCES-112@3@2' for files matching the pattern 'linux-jdk11-m3.5.x_build/src/main/java/**/*' - excludes: null
[TASKS] Found 3 files to scan for tasks
[TASKS] Found 2 open tasks.
Skipping warnings blame since pipelines do not have an SCM link.%n
[Pipeline] cleanWs
[TASKS] Computing warning deltas based on reference build #1
[WS-CLEANUP] Deleting project workspace...
[WS-CLEANUP] Deferred wipeout is used...
[withMaven] invokerPublisher - Archive invoker results for Maven artifact MavenArtifact{org.apache.maven.plugins:maven-remote-resources-plugin:maven-plugin:1.6.1-SNAPSHOT(version: 1.6.1-SNAPSHOT, snapshot:false) } generated by PluginInvocation{org.apache.maven.plugins:maven-invoker-plugin:3.1.0@integration-test integration-test}: linux-jdk11-m3.5.x_build/target/invoker-reports/*.xml
[WS-CLEANUP] done
[Pipeline] }
[Pipeline] // stage
[Pipeline] }
[Pipeline] // ws
[Pipeline] }
[Pipeline] // node
[Pipeline] }
[INFO] Tests run: 1, Failures: 0, Errors: 0, Skipped: 0, Time elapsed: 5.921 s - in org.apache.maven.plugin.resources.remote.it.IT_GenerateFromBundleWithTypeAndClassifier
[INFO] Running org.apache.maven.plugin.resources.remote.it.IT_GenerateFromOverride
[withMaven] Publishers: Generated Artifacts Publisher: 1124 ms, Junit Publisher: 5105 ms, Open Task Scanner Publisher: 510 ms, Invoker Publisher: 3044 ms, Pipeline Graph Publisher: 2 ms
[Pipeline] // withMaven
[Pipeline] cleanWs
[WS-CLEANUP] Deleting project workspace...
[WS-CLEANUP] Deferred wipeout is used...
[WS-CLEANUP] done
[Pipeline] }
[Pipeline] // stage
[Pipeline] }
[Pipeline] // ws
[Pipeline] }
[Pipeline] // node
[Pipeline] }
[INFO] Tests run: 1, Failures: 0, Errors: 0, Skipped: 0, Time elapsed: 14.203 s - in org.apache.maven.plugin.resources.remote.it.IT_SupplementalArtifact
[INFO]
[INFO] Results:
[INFO]
[WARNING] Tests run: 9, Failures: 0, Errors: 0, Skipped: 1
[INFO]
[INFO]
[INFO] --- maven-invoker-plugin:3.1.0:integration-test (integration-test) @ maven-remote-resources-plugin ---
[INFO] Running 1 setup job:
[INFO] Building: setup-bundle\pom.xml
[INFO] Tests run: 1, Failures: 0, Errors: 0, Skipped: 0, Time elapsed: 6.293 s - in org.apache.maven.plugin.resources.remote.it.IT_GenerateFromOverride
[INFO] Running org.apache.maven.plugin.resources.remote.it.IT_GetDependencyProjects
[INFO] Tests run: 1, Failures: 0, Errors: 0, Skipped: 0, Time elapsed: 14.506 s - in org.apache.maven.plugin.resources.remote.it.IT_GetDependencyProjects
[INFO] Running org.apache.maven.plugin.resources.remote.it.IT_RunOnlyAtExecutionRoot
[WARNING] Tests run: 1, Failures: 0, Errors: 0, Skipped: 1, Time elapsed: 0.014 s - in org.apache.maven.plugin.resources.remote.it.IT_RunOnlyAtExecutionRoot
[INFO] Running org.apache.maven.plugin.resources.remote.it.IT_SupplementalArtifact
[INFO] setup-bundle\pom.xml ............................. SUCCESS (22.1 s)
[INFO] Setup done.
[INFO] Building: maven-remote-resources-test\pom.xml
[INFO] maven-remote-resources-test\pom.xml .............. SUCCESS (6.6 s)
[INFO] Building: process\pom.xml
[INFO] Tests run: 1, Failures: 0, Errors: 0, Skipped: 0, Time elapsed: 16.849 s - in org.apache.maven.plugin.resources.remote.it.IT_SupplementalArtifact
[INFO]
[INFO] Results:
[INFO]
[WARNING] Tests run: 9, Failures: 0, Errors: 0, Skipped: 1
[INFO]
[INFO]
[INFO] --- maven-invoker-plugin:3.1.0:integration-test (integration-test) @ maven-remote-resources-plugin ---
[INFO] Running 1 setup job:
[INFO] Building: setup-bundle\pom.xml
[INFO] run post-build script verify.groovy
WARNING: An illegal reflective access operation has occurred
WARNING: Illegal reflective access by org.codehaus.groovy.reflection.CachedClass (file:/f:/jenkins/jenkins-slave/workspace/.maven_repositories/null/org/codehaus/groovy/groovy-all/2.4.8/groovy-all-2.4.8.jar) to method java.lang.Object.finalize()
WARNING: Please consider reporting this to the maintainers of org.codehaus.groovy.reflection.CachedClass
WARNING: Use --illegal-access=warn to enable warnings of further illegal reflective access operations
WARNING: All illegal access operations will be denied in a future release
[INFO] process\pom.xml .................................. SUCCESS (5.6 s)
[INFO]
[INFO] --- maven-checkstyle-plugin:3.0.0:check (checkstyle-check) @ maven-remote-resources-plugin ---
[INFO]
[INFO] --- maven-failsafe-plugin:2.22.0:verify (integration-tests) @ maven-remote-resources-plugin ---
[INFO] Failsafe report directory: f:\jenkins\jenkins-slave\workspace\resources-plugin_MRRESOURCES-112@2\windows-jdk12-m3.5.x_build\target\failsafe-reports
[INFO]
[INFO] --- maven-invoker-plugin:3.1.0:verify (integration-test) @ maven-remote-resources-plugin ---
[INFO] -------------------------------------------------
[INFO] Build Summary:
[INFO] Passed: 3, Failed: 0, Errors: 0, Skipped: 0
[INFO] -------------------------------------------------
[INFO] ------------------------------------------------------------------------
[INFO] BUILD SUCCESS
[INFO] ------------------------------------------------------------------------
[INFO] Total time: 02:35 min
[INFO] Finished at: 2019-03-15T08:40:43-07:00
[INFO] Final Memory: 45M/154M
[INFO] ------------------------------------------------------------------------
[INFO] [jenkins-event-spy] Generated F:\jenkins\jenkins-slave\workspace\resources-plugin_MRRESOURCES-112@2@tmp\withMavenb3572fd5\maven-spy-20190315-083807-48014651642413050435983.log
[Pipeline] }
[Pipeline] // dir
[Pipeline] }
[withMaven] artifactsPublisher - Archive artifact windows-jdk12-m3.5.x_build\pom.xml under org\apache\maven\plugins\maven-remote-resources-plugin\1.6.1-SNAPSHOT\maven-remote-resources-plugin-1.6.1-SNAPSHOT.pom
[withMaven] artifactsPublisher - Archive artifact windows-jdk12-m3.5.x_build\target\maven-remote-resources-plugin-1.6.1-SNAPSHOT.jar under org\apache\maven\plugins\maven-remote-resources-plugin\1.6.1-SNAPSHOT\maven-remote-resources-plugin-1.6.1-SNAPSHOT.jar
[withMaven] junitPublisher - Archive test results for Maven artifact org.apache.maven.plugins:maven-remote-resources-plugin:maven-plugin:1.6.1-SNAPSHOT generated by maven-surefire-plugin:test (default-test): windows-jdk12-m3.5.x_build\target\surefire-reports\*.xml
Recording test results
[withMaven] junitPublisher - Archive test results for Maven artifact org.apache.maven.plugins:maven-remote-resources-plugin:maven-plugin:1.6.1-SNAPSHOT generated by maven-failsafe-plugin:integration-test (integration-tests): windows-jdk12-m3.5.x_build\target\failsafe-reports\*.xml
Recording test results
[withMaven] openTasksPublisher - Scan Tasks for Maven artifact org.apache.maven.plugins:maven-remote-resources-plugin:maven-plugin:1.6.1-SNAPSHOT in source directory windows-jdk12-m3.5.x_build\src\main\java
[TASKS] Scanning folder 'f:\jenkins\jenkins-slave\workspace\resources-plugin_MRRESOURCES-112@2' for files matching the pattern 'windows-jdk12-m3.5.x_build\src\main\java\**\*' - excludes: null
[TASKS] Found 3 files to scan for tasks
[TASKS] Found 2 open tasks.
Skipping warnings blame since pipelines do not have an SCM link.%n
[TASKS] Computing warning deltas based on reference build #1
[withMaven] invokerPublisher - Archive invoker results for Maven artifact MavenArtifact{org.apache.maven.plugins:maven-remote-resources-plugin:maven-plugin:1.6.1-SNAPSHOT(version: 1.6.1-SNAPSHOT, snapshot:false) } generated by PluginInvocation{org.apache.maven.plugins:maven-invoker-plugin:3.1.0@integration-test integration-test}: windows-jdk12-m3.5.x_build\target\invoker-reports\*.xml
[withMaven] Publishers: Generated Artifacts Publisher: 143 ms, Junit Publisher: 615 ms, Open Task Scanner Publisher: 100 ms, Invoker Publisher: 1214 ms, Pipeline Graph Publisher: 1 ms
[Pipeline] // withMaven
[Pipeline] cleanWs
[WS-CLEANUP] Deleting project workspace...
[WS-CLEANUP] Deferred wipeout is used...
[WS-CLEANUP] done
[Pipeline] }
[Pipeline] // stage
[Pipeline] }
[Pipeline] // ws
[Pipeline] }
[Pipeline] // node
[Pipeline] }
[INFO] setup-bundle\pom.xml ............................. SUCCESS (9.7 s)
[INFO] Setup done.
[INFO] Building: maven-remote-resources-test\pom.xml
[INFO] maven-remote-resources-test\pom.xml .............. SUCCESS (8.7 s)
[INFO] Building: process\pom.xml
[INFO] run post-build script verify.groovy
WARNING: An illegal reflective access operation has occurred
WARNING: Illegal reflective access by org.codehaus.groovy.reflection.CachedClass (file:/f:/jenkins/jenkins-slave/workspace/.maven_repositories/null/org/codehaus/groovy/groovy-all/2.4.8/groovy-all-2.4.8.jar) to method java.lang.Object.finalize()
WARNING: Please consider reporting this to the maintainers of org.codehaus.groovy.reflection.CachedClass
WARNING: Use --illegal-access=warn to enable warnings of further illegal reflective access operations
WARNING: All illegal access operations will be denied in a future release
[INFO] process\pom.xml .................................. SUCCESS (7.3 s)
[INFO]
[INFO] --- maven-checkstyle-plugin:3.0.0:check (checkstyle-check) @ maven-remote-resources-plugin ---
[INFO]
[INFO] --- maven-failsafe-plugin:2.22.0:verify (integration-tests) @ maven-remote-resources-plugin ---
[INFO] Failsafe report directory: f:\jenkins\jenkins-slave\workspace\resources-plugin_MRRESOURCES-112@2@2\windows-jdk11-m3.5.x_build\target\failsafe-reports
[INFO]
[INFO] --- maven-invoker-plugin:3.1.0:verify (integration-test) @ maven-remote-resources-plugin ---
[INFO] -------------------------------------------------
[INFO] Build Summary:
[INFO] Passed: 3, Failed: 0, Errors: 0, Skipped: 0
[INFO] -------------------------------------------------
[INFO] ------------------------------------------------------------------------
[INFO] BUILD SUCCESS
[INFO] ------------------------------------------------------------------------
[INFO] Total time: 03:00 min
[INFO] Finished at: 2019-03-15T15:41:08Z
[INFO] Final Memory: 43M/147M
[INFO] ------------------------------------------------------------------------
[INFO] [jenkins-event-spy] Generated F:\jenkins\jenkins-slave\workspace\resources-plugin_MRRESOURCES-112@2@2@tmp\withMaven92333fda\maven-spy-20190315-153808-533062860407147042425.log
[Pipeline] }
[Pipeline] // dir
[Pipeline] }
[withMaven] artifactsPublisher - Archive artifact windows-jdk11-m3.5.x_build\pom.xml under org\apache\maven\plugins\maven-remote-resources-plugin\1.6.1-SNAPSHOT\maven-remote-resources-plugin-1.6.1-SNAPSHOT.pom
[withMaven] artifactsPublisher - Archive artifact windows-jdk11-m3.5.x_build\target\maven-remote-resources-plugin-1.6.1-SNAPSHOT.jar under org\apache\maven\plugins\maven-remote-resources-plugin\1.6.1-SNAPSHOT\maven-remote-resources-plugin-1.6.1-SNAPSHOT.jar
[withMaven] junitPublisher - Archive test results for Maven artifact org.apache.maven.plugins:maven-remote-resources-plugin:maven-plugin:1.6.1-SNAPSHOT generated by maven-surefire-plugin:test (default-test): windows-jdk11-m3.5.x_build\target\surefire-reports\*.xml
Recording test results
[withMaven] junitPublisher - Archive test results for Maven artifact org.apache.maven.plugins:maven-remote-resources-plugin:maven-plugin:1.6.1-SNAPSHOT generated by maven-failsafe-plugin:integration-test (integration-tests): windows-jdk11-m3.5.x_build\target\failsafe-reports\*.xml
Recording test results
[withMaven] openTasksPublisher - Scan Tasks for Maven artifact org.apache.maven.plugins:maven-remote-resources-plugin:maven-plugin:1.6.1-SNAPSHOT in source directory windows-jdk11-m3.5.x_build\src\main\java
[TASKS] Scanning folder 'f:\jenkins\jenkins-slave\workspace\resources-plugin_MRRESOURCES-112@2@2' for files matching the pattern 'windows-jdk11-m3.5.x_build\src\main\java\**\*' - excludes: null
[TASKS] Found 3 files to scan for tasks
[TASKS] Found 2 open tasks.
Skipping warnings blame since pipelines do not have an SCM link.%n
[TASKS] Computing warning deltas based on reference build #1
[withMaven] invokerPublisher - Archive invoker results for Maven artifact MavenArtifact{org.apache.maven.plugins:maven-remote-resources-plugin:maven-plugin:1.6.1-SNAPSHOT(version: 1.6.1-SNAPSHOT, snapshot:false) } generated by PluginInvocation{org.apache.maven.plugins:maven-invoker-plugin:3.1.0@integration-test integration-test}: windows-jdk11-m3.5.x_build\target\invoker-reports\*.xml
[withMaven] Publishers: Generated Artifacts Publisher: 210 ms, Junit Publisher: 630 ms, Open Task Scanner Publisher: 97 ms, Invoker Publisher: 976 ms, Pipeline Graph Publisher: 1 ms
[Pipeline] // withMaven
[Pipeline] cleanWs
[WS-CLEANUP] Deleting project workspace...
[WS-CLEANUP] Deferred wipeout is used...
[WS-CLEANUP] done
[Pipeline] }
[Pipeline] // stage
[Pipeline] }
[Pipeline] // ws
[Pipeline] }
[Pipeline] // node
[Pipeline] }
[Pipeline] // parallel
[Pipeline] stage
[Pipeline] { (Notifications)
[Pipeline] echo
Build result: UNSTABLE
[Pipeline] jiraIssueSelector
[Pipeline] emailext