You are viewing a plain text version of this content. The canonical link for it is here.
Posted to builds@cassandra.apache.org by Apache Jenkins Server <je...@builds.apache.org> on 2023/06/19 19:58:28 UTC
Build complete: Cassandra-trunk #1601 [UNSTABLE] cc3e742c735daddc29d2fb90aac638c641463d39
-------------------------------------------------------------------------------
Build Cassandra-trunk #1601 Still Unstable
URL: https://ci-cassandra.apache.org/job/Cassandra-trunk/1601/
-------------------------------------------------------------------------------
Changes:
[a.penya.garcia] Fix SSTabledump errors when dumping data from index
-------------------------------------------------------------------------------
Failed Tests:
7 tests failed.
FAILED: dtest-novnode.rebuild_test.TestRebuild.test_resumable_rebuild
FAILED: dtest.auth_test.TestAuth.test_system_auth_ks_is_alterable
FAILED: dtest.global_row_key_cache_test.TestGlobalRowKeyCache.test_functional
FAILED: dtest.cqlsh_tests.test_cqlsh_copy.TestCqlshCopy.test_bulk_round_trip_blogposts_with_max_connections
FAILED: org.apache.cassandra.distributed.test.ByteBuddyExamplesTest.countTest-.jdk1.8
FAILED: org.apache.cassandra.distributed.test.NetstatsRepairStreamingTest.testWithCompressionEnabled-cassandra.testtag_IS_UNDEFINED
FAILED: org.apache.cassandra.utils.bytecomparable.ByteSourceComparisonTest.testPatitionerOrder-cassandra.testtag_IS_UNDEFINED
-------------------------------------------------------------------------------
For complete test report and logs see https://nightlies.apache.org/cassandra/Cassandra-trunk/1601/