You are viewing a plain text version of this content. The canonical link for it is here.
Posted to builds@beam.apache.org by Apache Jenkins Server <je...@builds.apache.org> on 2020/08/06 07:06:08 UTC

Build failed in Jenkins: beam_PostCommit_Py_ValCont #6671

See <https://ci-beam.apache.org/job/beam_PostCommit_Py_ValCont/6671/display/redirect?page=changes>

Changes:

[noreply] [BEAM-7996] Add support for MapType and Nulls in container types for


------------------------------------------
[...truncated 2.11 MB...]
Collecting google-cloud-pubsub==1.0.2
  Downloading google_cloud_pubsub-1.0.2-py2.py3-none-any.whl (118 kB)
Collecting google-cloud-bigquery==1.26.1
  Downloading google_cloud_bigquery-1.26.1-py2.py3-none-any.whl (170 kB)
Collecting google-cloud-bigtable==1.0.0
  Downloading google_cloud_bigtable-1.0.0-py2.py3-none-any.whl (232 kB)
Collecting google-cloud-core==1.1.0
  Downloading google_cloud_core-1.1.0-py2.py3-none-any.whl (26 kB)
Collecting google-cloud-datastore==1.7.4
  Downloading google_cloud_datastore-1.7.4-py2.py3-none-any.whl (82 kB)
Collecting cython==0.29.13
  Downloading Cython-0.29.13-cp37-cp37m-manylinux1_x86_64.whl (2.1 MB)
Collecting guppy3==3.0.9
  Downloading guppy3-3.0.9-cp37-cp37m-manylinux1_x86_64.whl (614 kB)
Collecting numpy==1.17.3
  Downloading numpy-1.17.3-cp37-cp37m-manylinux1_x86_64.whl (20.0 MB)
Collecting scipy==1.4.1
  Downloading scipy-1.4.1-cp37-cp37m-manylinux1_x86_64.whl (26.1 MB)
Collecting pandas==0.25.2
  Downloading pandas-0.25.2-cp37-cp37m-manylinux1_x86_64.whl (10.4 MB)
Collecting protorpc==0.12.0
  Downloading protorpc-0.12.0.tar.gz (117 kB)
Collecting python-gflags==3.0.6
  Downloading python-gflags-3.0.6.tar.gz (49 kB)
Collecting tensorflow==2.2.0
  Downloading tensorflow-2.2.0-cp37-cp37m-manylinux2010_x86_64.whl (516.2 MB)
Collecting pymongo==3.9.0
  Downloading pymongo-3.9.0-cp37-cp37m-manylinux1_x86_64.whl (447 kB)
Collecting tenacity>=5.0.2
  Downloading tenacity-6.2.0-py2.py3-none-any.whl (24 kB)
Collecting pyhamcrest<2.0,>=1.9
  Downloading PyHamcrest-1.10.1-py3-none-any.whl (48 kB)
Collecting nose==1.3.7
  Downloading nose-1.3.7-py3-none-any.whl (154 kB)
Collecting six>=1.5.2
  Downloading six-1.15.0-py2.py3-none-any.whl (10 kB)
Collecting docopt
  Downloading docopt-0.6.2.tar.gz (25 kB)
Collecting requests>=2.7.0
  Downloading requests-2.24.0-py2.py3-none-any.whl (61 kB)
Collecting pbr>=0.11
  Downloading pbr-5.4.5-py2.py3-none-any.whl (110 kB)
Collecting pyasn1>=0.1.7
  Downloading pyasn1-0.4.8-py2.py3-none-any.whl (77 kB)
Collecting pyasn1-modules>=0.0.5
  Downloading pyasn1_modules-0.2.8-py2.py3-none-any.whl (155 kB)
Collecting rsa>=3.1.4
  Downloading rsa-4.6-py3-none-any.whl (47 kB)
Requirement already satisfied: setuptools in /usr/local/lib/python3.7/site-packages (from protobuf==3.12.2->-r /tmp/base_image_requirements.txt (line 38)) (49.2.1)
Collecting pyparsing>=2.1.4
  Downloading pyparsing-2.4.7-py2.py3-none-any.whl (67 kB)
Collecting google-auth<2.0dev,>=1.18.0
  Downloading google_auth-1.20.0-py2.py3-none-any.whl (91 kB)
Collecting googleapis-common-protos<2.0dev,>=1.6.0
  Downloading googleapis_common_protos-1.52.0-py2.py3-none-any.whl (100 kB)
Collecting fasteners>=0.14
  Downloading fasteners-0.15-py2.py3-none-any.whl (23 kB)
Collecting grpc-google-iam-v1<0.13dev,>=0.12.3
  Downloading grpc-google-iam-v1-0.12.3.tar.gz (13 kB)
Collecting google-resumable-media<2.0dev,>=0.5.0
  Downloading google_resumable_media-0.7.0-py2.py3-none-any.whl (42 kB)
Collecting python-dateutil>=2.6.1
  Downloading python_dateutil-2.8.1-py2.py3-none-any.whl (227 kB)
Requirement already satisfied: wheel>=0.26; python_version >= "3" in /usr/local/lib/python3.7/site-packages (from tensorflow==2.2.0->-r /tmp/base_image_requirements.txt (line 71)) (0.34.2)
Collecting absl-py>=0.7.0
  Downloading absl-py-0.9.0.tar.gz (104 kB)
Collecting keras-preprocessing>=1.1.0
  Downloading Keras_Preprocessing-1.1.2-py2.py3-none-any.whl (42 kB)
Collecting termcolor>=1.1.0
  Downloading termcolor-1.1.0.tar.gz (3.9 kB)
Collecting opt-einsum>=2.3.2
  Downloading opt_einsum-3.3.0-py3-none-any.whl (65 kB)
Collecting wrapt>=1.11.1
  Downloading wrapt-1.12.1.tar.gz (27 kB)
Collecting astunparse==1.6.3
  Downloading astunparse-1.6.3-py2.py3-none-any.whl (12 kB)
Collecting gast==0.3.3
  Downloading gast-0.3.3-py2.py3-none-any.whl (9.7 kB)
Collecting h5py<2.11.0,>=2.10.0
  Downloading h5py-2.10.0-cp37-cp37m-manylinux1_x86_64.whl (2.9 MB)
Collecting tensorboard<2.3.0,>=2.2.0
  Downloading tensorboard-2.2.2-py3-none-any.whl (3.0 MB)
Collecting google-pasta>=0.1.8
  Downloading google_pasta-0.2.0-py3-none-any.whl (57 kB)
Collecting tensorflow-estimator<2.3.0,>=2.2.0
  Downloading tensorflow_estimator-2.2.0-py2.py3-none-any.whl (454 kB)
Collecting urllib3!=1.25.0,!=1.25.1,<1.26,>=1.21.1
  Downloading urllib3-1.25.10-py2.py3-none-any.whl (127 kB)
Collecting certifi>=2017.4.17
  Downloading certifi-2020.6.20-py2.py3-none-any.whl (156 kB)
Collecting chardet<4,>=3.0.2
  Downloading chardet-3.0.4-py2.py3-none-any.whl (133 kB)
Collecting idna<3,>=2.5
  Downloading idna-2.10-py2.py3-none-any.whl (58 kB)
Collecting cachetools<5.0,>=2.0.0
  Downloading cachetools-4.1.1-py3-none-any.whl (10 kB)
Collecting monotonic>=0.1
  Downloading monotonic-1.5-py2.py3-none-any.whl (5.3 kB)
Collecting google-crc32c>=0.1.0; python_version >= "3.5"
  Downloading google_crc32c-0.1.0-cp37-cp37m-manylinux2010_x86_64.whl (39 kB)
Collecting markdown>=2.6.8
  Downloading Markdown-3.2.2-py3-none-any.whl (88 kB)
Collecting werkzeug>=0.11.15
  Downloading Werkzeug-1.0.1-py2.py3-none-any.whl (298 kB)
Collecting tensorboard-plugin-wit>=1.6.0
  Downloading tensorboard_plugin_wit-1.7.0-py3-none-any.whl (779 kB)
Collecting google-auth-oauthlib<0.5,>=0.4.1
  Downloading google_auth_oauthlib-0.4.1-py2.py3-none-any.whl (18 kB)
Collecting cffi>=1.0.0
  Downloading cffi-1.14.1-cp37-cp37m-manylinux1_x86_64.whl (401 kB)
Collecting importlib-metadata; python_version < "3.8"
  Downloading importlib_metadata-1.7.0-py2.py3-none-any.whl (31 kB)
Collecting requests-oauthlib>=0.7.0
  Downloading requests_oauthlib-1.3.0-py2.py3-none-any.whl (23 kB)
Collecting pycparser
  Downloading pycparser-2.20-py2.py3-none-any.whl (112 kB)
Collecting zipp>=0.5
  Downloading zipp-3.1.0-py3-none-any.whl (4.9 kB)
Collecting oauthlib>=3.0.0
  Downloading oauthlib-3.1.0-py2.py3-none-any.whl (147 kB)
Building wheels for collected packages: avro-python3, crcmod, dill, future, hdfs, httplib2, oauth2client, pyyaml, google-apitools, protorpc, python-gflags, docopt, grpc-google-iam-v1, absl-py, termcolor, wrapt
  Building wheel for avro-python3 (setup.py): started
  Building wheel for avro-python3 (setup.py): finished with status 'done'
  Created wheel for avro-python3: filename=avro_python3-1.8.2-py3-none-any.whl size=43249 sha256=12eb1828bc62844bfa597d3f3c4b9a9733367668622acd000f5044b84aa6106f
  Stored in directory: /root/.cache/pip/wheels/21/13/6f/cb2fe781dd05d05084356d29f660cd669fffc0bbfd87a9a613
  Building wheel for crcmod (setup.py): started
  Building wheel for crcmod (setup.py): finished with status 'done'
  Created wheel for crcmod: filename=crcmod-1.7-cp37-cp37m-linux_x86_64.whl size=36937 sha256=77ce004d89dac37b2b3c48b63ab7b99b69dfc63d575efa3fc884757d321d5cf7
  Stored in directory: /root/.cache/pip/wheels/dc/9a/e9/49e627353476cec8484343c4ab656f1e0d783ee77b9dde2d1f
  Building wheel for dill (setup.py): started
  Building wheel for dill (setup.py): finished with status 'done'
  Created wheel for dill: filename=dill-0.3.1.1-py3-none-any.whl size=78530 sha256=13148064d6bc3e6b08a4cae27882bc319fa228094cddeedcfabe2e366c577768
  Stored in directory: /root/.cache/pip/wheels/a4/61/fd/c57e374e580aa78a45ed78d5859b3a44436af17e22ca53284f
  Building wheel for future (setup.py): started
  Building wheel for future (setup.py): finished with status 'done'
  Created wheel for future: filename=future-0.18.2-py3-none-any.whl size=491058 sha256=960b7cf396a3ad8409a694067dbba1296f833319d7db9bc6c8279871de5b0c1a
  Stored in directory: /root/.cache/pip/wheels/56/b0/fe/4410d17b32f1f0c3cf54cdfb2bc04d7b4b8f4ae377e2229ba0
  Building wheel for hdfs (setup.py): started
  Building wheel for hdfs (setup.py): finished with status 'done'
  Created wheel for hdfs: filename=hdfs-2.5.8-py3-none-any.whl size=33213 sha256=0102a6432f6412c852fb4f6f55a21488d2d230cfd3cf8922af107ac0a9c844fc
  Stored in directory: /root/.cache/pip/wheels/0a/7d/38/ea4eaf831518e6cd867b515b88919a9785eb66f11def5ab859
  Building wheel for httplib2 (setup.py): started
  Building wheel for httplib2 (setup.py): finished with status 'done'
  Created wheel for httplib2: filename=httplib2-0.12.0-py3-none-any.whl size=93464 sha256=9712677c9cf1870bcc60054a899ae8e06ea4e3d64f1e212395b51d477c8a99d8
  Stored in directory: /root/.cache/pip/wheels/0d/e7/b6/0dd30343ceca921cfbd91f355041bd9c69e0f40b49f25b7b8a
  Building wheel for oauth2client (setup.py): started
  Building wheel for oauth2client (setup.py): finished with status 'done'
  Created wheel for oauth2client: filename=oauth2client-3.0.0-py3-none-any.whl size=106383 sha256=9aa96eceab2448b70172bdf55bfd325a59a8f4f402e741662e50f7cb6831f81d
  Stored in directory: /root/.cache/pip/wheels/86/73/7a/3b3f76a2142176605ff38fbca574327962c71e25a43197a4c1
  Building wheel for pyyaml (setup.py): started
  Building wheel for pyyaml (setup.py): finished with status 'done'
  Created wheel for pyyaml: filename=PyYAML-5.1-cp37-cp37m-linux_x86_64.whl size=468849 sha256=a08b18f7e56f2c0460b43c94141e85e1535ae4c9f8303ae1aceb075322ae7559
  Stored in directory: /root/.cache/pip/wheels/77/f5/10/d00a2bd30928b972790053b5de0c703ca87324f3fead0f2fd9
  Building wheel for google-apitools (setup.py): started
  Building wheel for google-apitools (setup.py): finished with status 'done'
  Created wheel for google-apitools: filename=google_apitools-0.5.28-py3-none-any.whl size=130110 sha256=b3c5885e7890ec0dc6c692da2fcd57f30a6cd17c3a85c2a868055b51423adedf
  Stored in directory: /root/.cache/pip/wheels/34/3b/69/ecd8e6ae89d9d71102a58962c29faa7a9467ba45f99f205920
  Building wheel for protorpc (setup.py): started
  Building wheel for protorpc (setup.py): finished with status 'done'
  Created wheel for protorpc: filename=protorpc-0.12.0-py3-none-any.whl size=137671 sha256=70d3a56b42760005c8212ab051f6d6f2a8c20bad50313989b6787e2f14aa20d7
  Stored in directory: /root/.cache/pip/wheels/fc/86/a3/44e716af12921112b03d56484f6864de427cd09d658827a903
  Building wheel for python-gflags (setup.py): started
  Building wheel for python-gflags (setup.py): finished with status 'done'
  Created wheel for python-gflags: filename=python_gflags-3.0.6-py3-none-any.whl size=54291 sha256=70b523771f76c84b475b9e3169b0ddd95eb22c511618848e63a5c8e5a4573b98
  Stored in directory: /root/.cache/pip/wheels/86/80/f0/25d8fdfc7735e5cd17d9b26738d19dfbb6cae9042ba89e7c02
  Building wheel for docopt (setup.py): started
  Building wheel for docopt (setup.py): finished with status 'done'
  Created wheel for docopt: filename=docopt-0.6.2-py2.py3-none-any.whl size=13704 sha256=9f08d28d803b43e73fe6f5126c4f9bba71243e94708ecbadb29844f3a88308cc
  Stored in directory: /root/.cache/pip/wheels/72/b0/3f/1d95f96ff986c7dfffe46ce2be4062f38ebd04b506c77c81b9
  Building wheel for grpc-google-iam-v1 (setup.py): started
  Building wheel for grpc-google-iam-v1 (setup.py): finished with status 'done'
  Created wheel for grpc-google-iam-v1: filename=grpc_google_iam_v1-0.12.3-py3-none-any.whl size=18499 sha256=90fa777501e80684ba31a176348c64d582f76db8bf58b37f029ecef9015ed4d1
  Stored in directory: /root/.cache/pip/wheels/b9/ee/67/2e444183030cb8d31ce8b34cee34a7afdbd3ba5959ea846380
  Building wheel for absl-py (setup.py): started
  Building wheel for absl-py (setup.py): finished with status 'done'
  Created wheel for absl-py: filename=absl_py-0.9.0-py3-none-any.whl size=121931 sha256=5dc79162222f54385a520bcfbc471bb7cdc944973274ef60c9aafa40155fff19
  Stored in directory: /root/.cache/pip/wheels/cc/af/1a/498a24d0730ef484019e007bb9e8cef3ac00311a672c049a3e
  Building wheel for termcolor (setup.py): started
  Building wheel for termcolor (setup.py): finished with status 'done'
  Created wheel for termcolor: filename=termcolor-1.1.0-py3-none-any.whl size=4830 sha256=2bbf1287a72d965a0635c427b23a31ee7b196df998c56e79aea961b6352ae459
  Stored in directory: /root/.cache/pip/wheels/3f/e3/ec/8a8336ff196023622fbcb36de0c5a5c218cbb24111d1d4c7f2
  Building wheel for wrapt (setup.py): started
  Building wheel for wrapt (setup.py): finished with status 'done'
  Created wheel for wrapt: filename=wrapt-1.12.1-cp37-cp37m-linux_x86_64.whl size=76421 sha256=446e197961e3d6dbce37f63ef672afbeeb536502a0b906790c08a0e21b2292b6
  Stored in directory: /root/.cache/pip/wheels/62/76/4c/aa25851149f3f6d9785f6c869387ad82b3fd37582fa8147ac6
Successfully built avro-python3 crcmod dill future hdfs httplib2 oauth2client pyyaml google-apitools protorpc python-gflags docopt grpc-google-iam-v1 absl-py termcolor wrapt
Installing collected packages: avro-python3, pytz, fastavro, crcmod, dill, future, six, grpcio, docopt, urllib3, certifi, chardet, idna, requests, hdfs, httplib2, pbr, mock, pyasn1, pyasn1-modules, rsa, oauth2client, protobuf, numpy, pyarrow, pyparsing, pydot, pyyaml, typing-extensions, cachetools, google-auth, googleapis-common-protos, google-api-core, monotonic, fasteners, google-apitools, grpc-google-iam-v1, google-cloud-pubsub, google-cloud-core, pycparser, cffi, google-crc32c, google-resumable-media, google-cloud-bigquery, google-cloud-bigtable, google-cloud-datastore, cython, guppy3, scipy, python-dateutil, pandas, protorpc, python-gflags, absl-py, keras-preprocessing, termcolor, opt-einsum, wrapt, astunparse, gast, h5py, zipp, importlib-metadata, markdown, werkzeug, tensorboard-plugin-wit, oauthlib, requests-oauthlib, google-auth-oauthlib, tensorboard, google-pasta, tensorflow-estimator, tensorflow, pymongo, tenacity, pyhamcrest, nose
Successfully installed absl-py-0.9.0 astunparse-1.6.3 avro-python3-1.8.2 cachetools-4.1.1 certifi-2020.6.20 cffi-1.14.1 chardet-3.0.4 crcmod-1.7 cython-0.29.13 dill-0.3.1.1 docopt-0.6.2 fastavro-0.23.3 fasteners-0.15 future-0.18.2 gast-0.3.3 google-api-core-1.21.0 google-apitools-0.5.28 google-auth-1.20.0 google-auth-oauthlib-0.4.1 google-cloud-bigquery-1.26.1 google-cloud-bigtable-1.0.0 google-cloud-core-1.1.0 google-cloud-datastore-1.7.4 google-cloud-pubsub-1.0.2 google-crc32c-0.1.0 google-pasta-0.2.0 google-resumable-media-0.7.0 googleapis-common-protos-1.52.0 grpc-google-iam-v1-0.12.3 grpcio-1.29.0 guppy3-3.0.9 h5py-2.10.0 hdfs-2.5.8 httplib2-0.12.0 idna-2.10 importlib-metadata-1.7.0 keras-preprocessing-1.1.2 markdown-3.2.2 mock-2.0.0 monotonic-1.5 nose-1.3.7 numpy-1.17.3 oauth2client-3.0.0 oauthlib-3.1.0 opt-einsum-3.3.0 pandas-0.25.2 pbr-5.4.5 protobuf-3.12.2 protorpc-0.12.0 pyarrow-0.16.0 pyasn1-0.4.8 pyasn1-modules-0.2.8 pycparser-2.20 pydot-1.4.1 pyhamcrest-1.10.1 pymongo-3.9.0 pyparsing-2.4.7 python-dateutil-2.8.1 python-gflags-3.0.6 pytz-2019.3 pyyaml-5.1 requests-2.24.0 requests-oauthlib-1.3.0 rsa-4.6 scipy-1.4.1 six-1.15.0 tenacity-6.2.0 tensorboard-2.2.2 tensorboard-plugin-wit-1.7.0 tensorflow-2.2.0 tensorflow-estimator-2.2.0 termcolor-1.1.0 typing-extensions-3.7.4.1 urllib3-1.25.10 werkzeug-1.0.1 wrapt-1.12.1 zipp-3.1.0
Verified fast protobuf used.

> Task :sdks:python:container:py37:docker FAILED
:sdks:python:container:py37:docker (Thread[Execution worker for ':' Thread 2,5,main]) completed. Took 2 mins 3.976 secs.

FAILURE: Build failed with an exception.

* What went wrong:
Execution failed for task ':sdks:python:container:py37:docker'.
> Process 'command 'docker'' finished with non-zero exit value 143

* Try:
Run with --stacktrace option to get the stack trace. Run with --debug option to get more log output. Run with --scan to get full insights.

* Get more help at https://help.gradle.org

Deprecated Gradle features were used in this build, making it incompatible with Gradle 6.0.
Use '--warning-mode all' to show the individual deprecation warnings.
See https://docs.gradle.org/5.2.1/userguide/command_line_interface.html#sec:command_line_warnings

BUILD FAILED in 2m 11s
20 actionable tasks: 14 executed, 6 up-to-date
The message received from the daemon indicates that the daemon has disappeared.
Build request sent: Build{id=51bea613-e5ec-4d9c-bce0-21cff44c742b, currentDir=<https://ci-beam.apache.org/job/beam_PostCommit_Py_ValCont/ws/src}>
Attempting to read last messages from the daemon log...
Daemon pid: 9282
  log file: /home/jenkins/.gradle/daemon/5.2.1/daemon-9282.out.log
----- Last  20 lines from daemon log file - daemon-9282.out.log -----
:sdks:python:container:py37:docker (Thread[Execution worker for ':' Thread 2,5,main]) completed. Took 2 mins 3.976 secs.

FAILURE: Build failed with an exception.

* What went wrong:
Execution failed for task ':sdks:python:container:py37:docker'.
> Process 'command 'docker'' finished with non-zero exit value 143

* Try:
Run with --stacktrace option to get the stack trace. Run with --debug option to get more log output. Run with --scan to get full insights.

* Get more help at https://help.gradle.org

Deprecated Gradle features were used in this build, making it incompatible with Gradle 6.0.
Use '--warning-mode all' to show the individual deprecation warnings.
See https://docs.gradle.org/5.2.1/userguide/command_line_interface.html#sec:command_line_warnings

BUILD FAILED in 2m 11s
20 actionable tasks: 14 executed, 6 up-to-date
Daemon vm is shutting down... The daemon has exited normally or was terminated in response to a user interrupt.
----- End of the daemon log -----


FAILURE: Build failed with an exception.

* What went wrong:
Gradle build daemon disappeared unexpectedly (it may have been killed or may have crashed)

* Try:
Run with --stacktrace option to get the stack trace. Run with --debug option to get more log output. Run with --scan to get full insights.

* Get more help at https://help.gradle.org
Build step 'Execute shell' marked build as failure

---------------------------------------------------------------------
To unsubscribe, e-mail: builds-unsubscribe@beam.apache.org
For additional commands, e-mail: builds-help@beam.apache.org


Jenkins build is back to normal : beam_PostCommit_Py_ValCont #6673

Posted by Apache Jenkins Server <je...@builds.apache.org>.
See <https://ci-beam.apache.org/job/beam_PostCommit_Py_ValCont/6673/display/redirect?page=changes>


---------------------------------------------------------------------
To unsubscribe, e-mail: builds-unsubscribe@beam.apache.org
For additional commands, e-mail: builds-help@beam.apache.org


Build failed in Jenkins: beam_PostCommit_Py_ValCont #6672

Posted by Apache Jenkins Server <je...@builds.apache.org>.
See <https://ci-beam.apache.org/job/beam_PostCommit_Py_ValCont/6672/display/redirect>

Changes:


------------------------------------------
[...truncated 2.36 MB...]
  copying apache_beam/examples/snippets/snippets_test_py3.py -> build/lib.linux-x86_64-3.7/apache_beam/examples/snippets
  copying apache_beam/examples/snippets/__init__.py -> build/lib.linux-x86_64-3.7/apache_beam/examples/snippets
  creating build/lib.linux-x86_64-3.7/apache_beam/examples/flink
  copying apache_beam/examples/flink/flink_streaming_impulse.py -> build/lib.linux-x86_64-3.7/apache_beam/examples/flink
  copying apache_beam/examples/flink/__init__.py -> build/lib.linux-x86_64-3.7/apache_beam/examples/flink
  creating build/lib.linux-x86_64-3.7/apache_beam/examples/kafkataxi
  copying apache_beam/examples/kafkataxi/kafka_taxi.py -> build/lib.linux-x86_64-3.7/apache_beam/examples/kafkataxi
  copying apache_beam/examples/kafkataxi/__init__.py -> build/lib.linux-x86_64-3.7/apache_beam/examples/kafkataxi
  creating build/lib.linux-x86_64-3.7/apache_beam/examples/complete
  copying apache_beam/examples/complete/distribopt_test.py -> build/lib.linux-x86_64-3.7/apache_beam/examples/complete
  copying apache_beam/examples/complete/autocomplete_test.py -> build/lib.linux-x86_64-3.7/apache_beam/examples/complete
  copying apache_beam/examples/complete/estimate_pi.py -> build/lib.linux-x86_64-3.7/apache_beam/examples/complete
  copying apache_beam/examples/complete/tfidf.py -> build/lib.linux-x86_64-3.7/apache_beam/examples/complete
  copying apache_beam/examples/complete/tfidf_test.py -> build/lib.linux-x86_64-3.7/apache_beam/examples/complete
  copying apache_beam/examples/complete/autocomplete.py -> build/lib.linux-x86_64-3.7/apache_beam/examples/complete
  copying apache_beam/examples/complete/top_wikipedia_sessions_test.py -> build/lib.linux-x86_64-3.7/apache_beam/examples/complete
  copying apache_beam/examples/complete/distribopt.py -> build/lib.linux-x86_64-3.7/apache_beam/examples/complete
  copying apache_beam/examples/complete/__init__.py -> build/lib.linux-x86_64-3.7/apache_beam/examples/complete
  copying apache_beam/examples/complete/estimate_pi_test.py -> build/lib.linux-x86_64-3.7/apache_beam/examples/complete
  copying apache_beam/examples/complete/top_wikipedia_sessions.py -> build/lib.linux-x86_64-3.7/apache_beam/examples/complete
  creating build/lib.linux-x86_64-3.7/apache_beam/examples/snippets/transforms
  copying apache_beam/examples/snippets/transforms/__init__.py -> build/lib.linux-x86_64-3.7/apache_beam/examples/snippets/transforms
  creating build/lib.linux-x86_64-3.7/apache_beam/examples/snippets/transforms/aggregation
  copying apache_beam/examples/snippets/transforms/aggregation/top.py -> build/lib.linux-x86_64-3.7/apache_beam/examples/snippets/transforms/aggregation
  copying apache_beam/examples/snippets/transforms/aggregation/combineperkey_test.py -> build/lib.linux-x86_64-3.7/apache_beam/examples/snippets/transforms/aggregation
  copying apache_beam/examples/snippets/transforms/aggregation/groupintobatches_test.py -> build/lib.linux-x86_64-3.7/apache_beam/examples/snippets/transforms/aggregation
  copying apache_beam/examples/snippets/transforms/aggregation/sum.py -> build/lib.linux-x86_64-3.7/apache_beam/examples/snippets/transforms/aggregation
  copying apache_beam/examples/snippets/transforms/aggregation/combinevalues_test.py -> build/lib.linux-x86_64-3.7/apache_beam/examples/snippets/transforms/aggregation
  copying apache_beam/examples/snippets/transforms/aggregation/min_test.py -> build/lib.linux-x86_64-3.7/apache_beam/examples/snippets/transforms/aggregation
  copying apache_beam/examples/snippets/transforms/aggregation/mean_test.py -> build/lib.linux-x86_64-3.7/apache_beam/examples/snippets/transforms/aggregation
  copying apache_beam/examples/snippets/transforms/aggregation/distinct.py -> build/lib.linux-x86_64-3.7/apache_beam/examples/snippets/transforms/aggregation
  copying apache_beam/examples/snippets/transforms/aggregation/groupintobatches.py -> build/lib.linux-x86_64-3.7/apache_beam/examples/snippets/transforms/aggregation
  copying apache_beam/examples/snippets/transforms/aggregation/max.py -> build/lib.linux-x86_64-3.7/apache_beam/examples/snippets/transforms/aggregation
  copying apache_beam/examples/snippets/transforms/aggregation/combineglobally_test.py -> build/lib.linux-x86_64-3.7/apache_beam/examples/snippets/transforms/aggregation
  copying apache_beam/examples/snippets/transforms/aggregation/count.py -> build/lib.linux-x86_64-3.7/apache_beam/examples/snippets/transforms/aggregation
  copying apache_beam/examples/snippets/transforms/aggregation/latest.py -> build/lib.linux-x86_64-3.7/apache_beam/examples/snippets/transforms/aggregation
  copying apache_beam/examples/snippets/transforms/aggregation/mean.py -> build/lib.linux-x86_64-3.7/apache_beam/examples/snippets/transforms/aggregation
  copying apache_beam/examples/snippets/transforms/aggregation/groupbykey.py -> build/lib.linux-x86_64-3.7/apache_beam/examples/snippets/transforms/aggregation
  copying apache_beam/examples/snippets/transforms/aggregation/latest_test.py -> build/lib.linux-x86_64-3.7/apache_beam/examples/snippets/transforms/aggregation
  copying apache_beam/examples/snippets/transforms/aggregation/sample_test.py -> build/lib.linux-x86_64-3.7/apache_beam/examples/snippets/transforms/aggregation
  copying apache_beam/examples/snippets/transforms/aggregation/combineglobally.py -> build/lib.linux-x86_64-3.7/apache_beam/examples/snippets/transforms/aggregation
  copying apache_beam/examples/snippets/transforms/aggregation/sum_test.py -> build/lib.linux-x86_64-3.7/apache_beam/examples/snippets/transforms/aggregation
  copying apache_beam/examples/snippets/transforms/aggregation/distinct_test.py -> build/lib.linux-x86_64-3.7/apache_beam/examples/snippets/transforms/aggregation
  copying apache_beam/examples/snippets/transforms/aggregation/combineperkey.py -> build/lib.linux-x86_64-3.7/apache_beam/examples/snippets/transforms/aggregation
  copying apache_beam/examples/snippets/transforms/aggregation/__init__.py -> build/lib.linux-x86_64-3.7/apache_beam/examples/snippets/transforms/aggregation
  copying apache_beam/examples/snippets/transforms/aggregation/cogroupbykey.py -> build/lib.linux-x86_64-3.7/apache_beam/examples/snippets/transforms/aggregation
  copying apache_beam/examples/snippets/transforms/aggregation/count_test.py -> build/lib.linux-x86_64-3.7/apache_beam/examples/snippets/transforms/aggregation
  copying apache_beam/examples/snippets/transforms/aggregation/combinevalues.py -> build/lib.linux-x86_64-3.7/apache_beam/examples/snippets/transforms/aggregation
  copying apache_beam/examples/snippets/transforms/aggregation/top_test.py -> build/lib.linux-x86_64-3.7/apache_beam/examples/snippets/transforms/aggregation
  copying apache_beam/examples/snippets/transforms/aggregation/min.py -> build/lib.linux-x86_64-3.7/apache_beam/examples/snippets/transforms/aggregation
  copying apache_beam/examples/snippets/transforms/aggregation/sample.py -> build/lib.linux-x86_64-3.7/apache_beam/examples/snippets/transforms/aggregation
  copying apache_beam/examples/snippets/transforms/aggregation/cogroupbykey_test.py -> build/lib.linux-x86_64-3.7/apache_beam/examples/snippets/transforms/aggregation
  copying apache_beam/examples/snippets/transforms/aggregation/groupbykey_test.py -> build/lib.linux-x86_64-3.7/apache_beam/examples/snippets/transforms/aggregation
  copying apache_beam/examples/snippets/transforms/aggregation/max_test.py -> build/lib.linux-x86_64-3.7/apache_beam/examples/snippets/transforms/aggregation
  creating build/lib.linux-x86_64-3.7/apache_beam/examples/snippets/transforms/elementwise
  copying apache_beam/examples/snippets/transforms/elementwise/values.py -> build/lib.linux-x86_64-3.7/apache_beam/examples/snippets/transforms/elementwise
  copying apache_beam/examples/snippets/transforms/elementwise/tostring_test.py -> build/lib.linux-x86_64-3.7/apache_beam/examples/snippets/transforms/elementwise
  copying apache_beam/examples/snippets/transforms/elementwise/withtimestamps_test.py -> build/lib.linux-x86_64-3.7/apache_beam/examples/snippets/transforms/elementwise
  copying apache_beam/examples/snippets/transforms/elementwise/kvswap.py -> build/lib.linux-x86_64-3.7/apache_beam/examples/snippets/transforms/elementwise
  copying apache_beam/examples/snippets/transforms/elementwise/map_test.py -> build/lib.linux-x86_64-3.7/apache_beam/examples/snippets/transforms/elementwise
  copying apache_beam/examples/snippets/transforms/elementwise/map.py -> build/lib.linux-x86_64-3.7/apache_beam/examples/snippets/transforms/elementwise
  copying apache_beam/examples/snippets/transforms/elementwise/regex_test.py -> build/lib.linux-x86_64-3.7/apache_beam/examples/snippets/transforms/elementwise
  copying apache_beam/examples/snippets/transforms/elementwise/flatmap_test.py -> build/lib.linux-x86_64-3.7/apache_beam/examples/snippets/transforms/elementwise
  copying apache_beam/examples/snippets/transforms/elementwise/partition.py -> build/lib.linux-x86_64-3.7/apache_beam/examples/snippets/transforms/elementwise
  copying apache_beam/examples/snippets/transforms/elementwise/keys.py -> build/lib.linux-x86_64-3.7/apache_beam/examples/snippets/transforms/elementwise
  copying apache_beam/examples/snippets/transforms/elementwise/pardo_test.py -> build/lib.linux-x86_64-3.7/apache_beam/examples/snippets/transforms/elementwise
  copying apache_beam/examples/snippets/transforms/elementwise/values_test.py -> build/lib.linux-x86_64-3.7/apache_beam/examples/snippets/transforms/elementwise
  copying apache_beam/examples/snippets/transforms/elementwise/filter.py -> build/lib.linux-x86_64-3.7/apache_beam/examples/snippets/transforms/elementwise
  copying apache_beam/examples/snippets/transforms/elementwise/__init__.py -> build/lib.linux-x86_64-3.7/apache_beam/examples/snippets/transforms/elementwise
  copying apache_beam/examples/snippets/transforms/elementwise/flatmap.py -> build/lib.linux-x86_64-3.7/apache_beam/examples/snippets/transforms/elementwise
  copying apache_beam/examples/snippets/transforms/elementwise/filter_test.py -> build/lib.linux-x86_64-3.7/apache_beam/examples/snippets/transforms/elementwise
  copying apache_beam/examples/snippets/transforms/elementwise/partition_test.py -> build/lib.linux-x86_64-3.7/apache_beam/examples/snippets/transforms/elementwise
  copying apache_beam/examples/snippets/transforms/elementwise/tostring.py -> build/lib.linux-x86_64-3.7/apache_beam/examples/snippets/transforms/elementwise
  copying apache_beam/examples/snippets/transforms/elementwise/regex.py -> build/lib.linux-x86_64-3.7/apache_beam/examples/snippets/transforms/elementwise
  copying apache_beam/examples/snippets/transforms/elementwise/keys_test.py -> build/lib.linux-x86_64-3.7/apache_beam/examples/snippets/transforms/elementwise
  copying apache_beam/examples/snippets/transforms/elementwise/withtimestamps.py -> build/lib.linux-x86_64-3.7/apache_beam/examples/snippets/transforms/elementwise
  copying apache_beam/examples/snippets/transforms/elementwise/kvswap_test.py -> build/lib.linux-x86_64-3.7/apache_beam/examples/snippets/transforms/elementwise
  copying apache_beam/examples/snippets/transforms/elementwise/pardo.py -> build/lib.linux-x86_64-3.7/apache_beam/examples/snippets/transforms/elementwise
  creating build/lib.linux-x86_64-3.7/apache_beam/examples/complete/game
  copying apache_beam/examples/complete/game/game_stats_it_test.py -> build/lib.linux-x86_64-3.7/apache_beam/examples/complete/game
  copying apache_beam/examples/complete/game/leader_board_it_test.py -> build/lib.linux-x86_64-3.7/apache_beam/examples/complete/game
  copying apache_beam/examples/complete/game/user_score_test.py -> build/lib.linux-x86_64-3.7/apache_beam/examples/complete/game
  copying apache_beam/examples/complete/game/hourly_team_score_test.py -> build/lib.linux-x86_64-3.7/apache_beam/examples/complete/game
  copying apache_beam/examples/complete/game/leader_board_test.py -> build/lib.linux-x86_64-3.7/apache_beam/examples/complete/game
  copying apache_beam/examples/complete/game/hourly_team_score.py -> build/lib.linux-x86_64-3.7/apache_beam/examples/complete/game
  copying apache_beam/examples/complete/game/game_stats.py -> build/lib.linux-x86_64-3.7/apache_beam/examples/complete/game
  copying apache_beam/examples/complete/game/leader_board.py -> build/lib.linux-x86_64-3.7/apache_beam/examples/complete/game
  copying apache_beam/examples/complete/game/__init__.py -> build/lib.linux-x86_64-3.7/apache_beam/examples/complete/game
  copying apache_beam/examples/complete/game/user_score_it_test.py -> build/lib.linux-x86_64-3.7/apache_beam/examples/complete/game
  copying apache_beam/examples/complete/game/user_score.py -> build/lib.linux-x86_64-3.7/apache_beam/examples/complete/game
  copying apache_beam/examples/complete/game/game_stats_test.py -> build/lib.linux-x86_64-3.7/apache_beam/examples/complete/game
  copying apache_beam/examples/complete/game/hourly_team_score_it_test.py -> build/lib.linux-x86_64-3.7/apache_beam/examples/complete/game
  creating build/lib.linux-x86_64-3.7/apache_beam/examples/complete/juliaset
  copying apache_beam/examples/complete/juliaset/setup.py -> build/lib.linux-x86_64-3.7/apache_beam/examples/complete/juliaset
  copying apache_beam/examples/complete/juliaset/__init__.py -> build/lib.linux-x86_64-3.7/apache_beam/examples/complete/juliaset
  copying apache_beam/examples/complete/juliaset/juliaset_main.py -> build/lib.linux-x86_64-3.7/apache_beam/examples/complete/juliaset
  creating build/lib.linux-x86_64-3.7/apache_beam/examples/complete/juliaset/juliaset
  copying apache_beam/examples/complete/juliaset/juliaset/juliaset.py -> build/lib.linux-x86_64-3.7/apache_beam/examples/complete/juliaset/juliaset
  copying apache_beam/examples/complete/juliaset/juliaset/juliaset_test.py -> build/lib.linux-x86_64-3.7/apache_beam/examples/complete/juliaset/juliaset
  copying apache_beam/examples/complete/juliaset/juliaset/__init__.py -> build/lib.linux-x86_64-3.7/apache_beam/examples/complete/juliaset/juliaset
  creating build/lib.linux-x86_64-3.7/apache_beam/portability/api
  copying apache_beam/portability/api/beam_interactive_api_pb2_grpc.py -> build/lib.linux-x86_64-3.7/apache_beam/portability/api
  copying apache_beam/portability/api/metrics_pb2.py -> build/lib.linux-x86_64-3.7/apache_beam/portability/api
  copying apache_beam/portability/api/beam_fn_api_pb2_grpc.py -> build/lib.linux-x86_64-3.7/apache_beam/portability/api
  copying apache_beam/portability/api/endpoints_pb2.py -> build/lib.linux-x86_64-3.7/apache_beam/portability/api
  copying apache_beam/portability/api/beam_fn_api_pb2_urns.py -> build/lib.linux-x86_64-3.7/apache_beam/portability/api
  copying apache_beam/portability/api/metrics_pb2_urns.py -> build/lib.linux-x86_64-3.7/apache_beam/portability/api
  copying apache_beam/portability/api/schema_pb2.py -> build/lib.linux-x86_64-3.7/apache_beam/portability/api
  copying apache_beam/portability/api/beam_runner_api_pb2_urns.py -> build/lib.linux-x86_64-3.7/apache_beam/portability/api
  copying apache_beam/portability/api/schema_pb2_grpc.py -> build/lib.linux-x86_64-3.7/apache_beam/portability/api
  copying apache_beam/portability/api/standard_window_fns_pb2_urns.py -> build/lib.linux-x86_64-3.7/apache_beam/portability/api
  copying apache_beam/portability/api/beam_artifact_api_pb2.py -> build/lib.linux-x86_64-3.7/apache_beam/portability/api
  copying apache_beam/portability/api/beam_expansion_api_pb2.py -> build/lib.linux-x86_64-3.7/apache_beam/portability/api
  copying apache_beam/portability/api/beam_expansion_api_pb2_grpc.py -> build/lib.linux-x86_64-3.7/apache_beam/portability/api
  copying apache_beam/portability/api/metrics_pb2_grpc.py -> build/lib.linux-x86_64-3.7/apache_beam/portability/api
  copying apache_beam/portability/api/beam_provision_api_pb2.py -> build/lib.linux-x86_64-3.7/apache_beam/portability/api
  copying apache_beam/portability/api/beam_provision_api_pb2_grpc.py -> build/lib.linux-x86_64-3.7/apache_beam/portability/api
  copying apache_beam/portability/api/beam_job_api_pb2_grpc.py -> build/lib.linux-x86_64-3.7/apache_beam/portability/api
  copying apache_beam/portability/api/beam_interactive_api_pb2.py -> build/lib.linux-x86_64-3.7/apache_beam/portability/api
  copying apache_beam/portability/api/beam_runner_api_pb2_grpc.py -> build/lib.linux-x86_64-3.7/apache_beam/portability/api
  copying apache_beam/portability/api/endpoints_pb2_grpc.py -> build/lib.linux-x86_64-3.7/apache_beam/portability/api
  copying apache_beam/portability/api/external_transforms_pb2_grpc.py -> build/lib.linux-x86_64-3.7/apache_beam/portability/api
  copying apache_beam/portability/api/beam_artifact_api_pb2_urns.py -> build/lib.linux-x86_64-3.7/apache_beam/portability/api
  copying apache_beam/portability/api/standard_window_fns_pb2.py -> build/lib.linux-x86_64-3.7/apache_beam/portability/api
  copying apache_beam/portability/api/__init__.py -> build/lib.linux-x86_64-3.7/apache_beam/portability/api
  copying apache_beam/portability/api/beam_fn_api_pb2.py -> build/lib.linux-x86_64-3.7/apache_beam/portability/api
  copying apache_beam/portability/api/standard_window_fns_pb2_grpc.py -> build/lib.linux-x86_64-3.7/apache_beam/portability/api
  copying apache_beam/portability/api/beam_job_api_pb2.py -> build/lib.linux-x86_64-3.7/apache_beam/portability/api
  copying apache_beam/portability/api/external_transforms_pb2.py -> build/lib.linux-x86_64-3.7/apache_beam/portability/api
  copying apache_beam/portability/api/beam_job_api_pb2_urns.py -> build/lib.linux-x86_64-3.7/apache_beam/portability/api
  copying apache_beam/portability/api/beam_artifact_api_pb2_grpc.py -> build/lib.linux-x86_64-3.7/apache_beam/portability/api
  copying apache_beam/portability/api/beam_runner_api_pb2.py -> build/lib.linux-x86_64-3.7/apache_beam/portability/api
  copying apache_beam/coders/stream.pyx -> build/lib.linux-x86_64-3.7/apache_beam/coders
  copying apache_beam/transforms/cy_dataflow_distribution_counter.pyx -> build/lib.linux-x86_64-3.7/apache_beam/transforms
  copying apache_beam/runners/worker/statesampler_fast.pyx -> build/lib.linux-x86_64-3.7/apache_beam/runners/worker
  copying apache_beam/coders/coder_impl.pxd -> build/lib.linux-x86_64-3.7/apache_beam/coders
  copying apache_beam/coders/stream.pxd -> build/lib.linux-x86_64-3.7/apache_beam/coders
  copying apache_beam/utils/counters.pxd -> build/lib.linux-x86_64-3.7/apache_beam/utils
  copying apache_beam/utils/windowed_value.pxd -> build/lib.linux-x86_64-3.7/apache_beam/utils
  copying apache_beam/transforms/cy_combiners.pxd -> build/lib.linux-x86_64-3.7/apache_beam/transforms
  copying apache_beam/transforms/cy_dataflow_distribution_counter.pxd -> build/lib.linux-x86_64-3.7/apache_beam/transforms
  copying apache_beam/runners/common.pxd -> build/lib.linux-x86_64-3.7/apache_beam/runners
  copying apache_beam/metrics/execution.pxd -> build/lib.linux-x86_64-3.7/apache_beam/metrics
  copying apache_beam/metrics/cells.pxd -> build/lib.linux-x86_64-3.7/apache_beam/metrics
  copying apache_beam/runners/worker/opcounters.pxd -> build/lib.linux-x86_64-3.7/apache_beam/runners/worker
  copying apache_beam/runners/worker/statesampler_fast.pxd -> build/lib.linux-x86_64-3.7/apache_beam/runners/worker
  copying apache_beam/runners/worker/operations.pxd -> build/lib.linux-x86_64-3.7/apache_beam/runners/worker
  copying apache_beam/runners/worker/crossplatform_time.h -> build/lib.linux-x86_64-3.7/apache_beam/runners/worker
  copying apache_beam/runners/worker/crossplatform_unistd.h -> build/lib.linux-x86_64-3.7/apache_beam/runners/worker
  creating build/lib.linux-x86_64-3.7/apache_beam/testing/data
  copying apache_beam/testing/data/trigger_transcripts.yaml -> build/lib.linux-x86_64-3.7/apache_beam/testing/data
  copying apache_beam/portability/api/standard_coders.yaml -> build/lib.linux-x86_64-3.7/apache_beam/portability/api
  running build_ext
  building 'apache_beam.coders.stream' extension
  creating build/temp.linux-x86_64-3.7
  creating build/temp.linux-x86_64-3.7/apache_beam
  creating build/temp.linux-x86_64-3.7/apache_beam/coders
  gcc -pthread -Wno-unused-result -Wsign-compare -DNDEBUG -g -fwrapv -O3 -Wall -fPIC -I/usr/local/include/python3.7m -c apache_beam/coders/stream.c -o build/temp.linux-x86_64-3.7/apache_beam/coders/stream.o
  apache_beam/coders/stream.c: In function ‘__pyx_f_11apache_beam_6coders_6stream_12OutputStream_write_bigendian_double’:
  apache_beam/coders/stream.c:3432:185: warning: dereferencing type-punned pointer will break strict-aliasing rules [-Wstrict-aliasing]
     __pyx_t_1 = ((struct __pyx_vtabstruct_11apache_beam_6coders_6stream_OutputStream *)__pyx_v_self->__pyx_vtab)->write_bigendian_int64(__pyx_v_self, (((int64_t *)((char *)(&__pyx_v_d)))[0]), 0); if (unlikely(!__pyx_t_1)) __PYX_ERR(1, 97, __pyx_L1_error)
                                                                                                                                                                                           ^
  apache_beam/coders/stream.c: In function ‘__pyx_f_11apache_beam_6coders_6stream_11InputStream_read_var_int64’:
  apache_beam/coders/stream.c:6411:33: warning: comparison of integer expressions of different signedness: ‘long int’ and ‘long unsigned int’ [-Wsign-compare]
       __pyx_t_8 = ((__pyx_v_shift >= ((sizeof(long)) * 8)) != 0);
                                   ^~
  apache_beam/coders/stream.c:6425:33: warning: comparison of integer expressions of different signedness: ‘long int’ and ‘long unsigned int’ [-Wsign-compare]
       __pyx_t_8 = ((__pyx_v_shift >= (((sizeof(long)) * 8) - 1)) != 0);
                                   ^~
  apache_beam/coders/stream.c: In function ‘__pyx_f_11apache_beam_6coders_6stream_11InputStream_read_bigendian_double’:
  apache_beam/coders/stream.c:7094:54: warning: dereferencing type-punned pointer will break strict-aliasing rules [-Wstrict-aliasing]
     __pyx_r = (((double *)((char *)(&__pyx_v_as_long)))[0]);
                                                        ^
  gcc -pthread -shared build/temp.linux-x86_64-3.7/apache_beam/coders/stream.o -L/usr/local/lib -lpython3.7m -o build/lib.linux-x86_64-3.7/apache_beam/coders/stream.cpython-37m-x86_64-linux-gnu.so
  building 'apache_beam.runners.worker.statesampler_fast' extension
  creating build/temp.linux-x86_64-3.7/apache_beam/runners
  creating build/temp.linux-x86_64-3.7/apache_beam/runners/worker
  gcc -pthread -Wno-unused-result -Wsign-compare -DNDEBUG -g -fwrapv -O3 -Wall -fPIC -Iapache_beam/runners/worker -I/usr/local/include/python3.7m -c apache_beam/runners/worker/statesampler_fast.c -o build/temp.linux-x86_64-3.7/apache_beam/runners/worker/statesampler_fast.o
  gcc -pthread -shared build/temp.linux-x86_64-3.7/apache_beam/runners/worker/statesampler_fast.o -L/usr/local/lib -lpython3.7m -o build/lib.linux-x86_64-3.7/apache_beam/runners/worker/statesampler_fast.cpython-37m-x86_64-linux-gnu.so
  building 'apache_beam.transforms.cy_dataflow_distribution_counter' extension
  creating build/temp.linux-x86_64-3.7/apache_beam/transforms
  gcc -pthread -Wno-unused-result -Wsign-compare -DNDEBUG -g -fwrapv -O3 -Wall -fPIC -I/usr/local/include/python3.7m -c apache_beam/transforms/cy_dataflow_distribution_counter.c -o build/temp.linux-x86_64-3.7/apache_beam/transforms/cy_dataflow_distribution_counter.o
  apache_beam/transforms/cy_dataflow_distribution_counter.c: In function ‘__pyx_f_11apache_beam_10transforms_32cy_dataflow_distribution_counter_get_log10_round_to_floor’:
  apache_beam/transforms/cy_dataflow_distribution_counter.c:1680:35: warning: comparison of integer expressions of different signedness: ‘int64_t’ {aka ‘long int’} and ‘long long unsigned int’ [-Wsign-compare]
       __pyx_t_1 = ((__pyx_v_element >= (__pyx_v_11apache_beam_10transforms_32cy_dataflow_distribution_counter_POWER_TEN[__pyx_v_power])) != 0);
                                     ^~
  gcc -pthread -shared build/temp.linux-x86_64-3.7/apache_beam/transforms/cy_dataflow_distribution_counter.o -L/usr/local/lib -lpython3.7m -o build/lib.linux-x86_64-3.7/apache_beam/transforms/cy_dataflow_distribution_counter.cpython-37m-x86_64-linux-gnu.so
  building 'apache_beam.coders.coder_impl' extension
  gcc -pthread -Wno-unused-result -Wsign-compare -DNDEBUG -g -fwrapv -O3 -Wall -fPIC -I/usr/local/include/python3.7m -c apache_beam/coders/coder_impl.c -o build/temp.linux-x86_64-3.7/apache_beam/coders/coder_impl.o

> Task :sdks:python:container:py37:docker FAILED
:sdks:python:container:py37:docker (Thread[Execution worker for ':',5,main]) completed. Took 3 mins 22.533 secs.

FAILURE: Build failed with an exception.

* What went wrong:
Execution failed for task ':sdks:python:container:py37:docker'.
> Process 'command 'docker'' finished with non-zero exit value 143

* Try:
Run with --stacktrace option to get the stack trace. Run with --debug option to get more log output. Run with --scan to get full insights.

* Get more help at https://help.gradle.org

Deprecated Gradle features were used in this build, making it incompatible with Gradle 6.0.
Use '--warning-mode all' to show the individual deprecation warnings.
See https://docs.gradle.org/5.2.1/userguide/command_line_interface.html#sec:command_line_warnings

BUILD FAILED in 3m 30s
20 actionable tasks: 14 executed, 6 up-to-date
The message received from the daemon indicates that the daemon has disappeared.
Build request sent: Build{id=8b954e19-11e0-41e4-b8a1-4d511bcdf4e4, currentDir=<https://ci-beam.apache.org/job/beam_PostCommit_Py_ValCont/ws/src}>
Attempting to read last messages from the daemon log...
Daemon pid: 29448
  log file: /home/jenkins/.gradle/daemon/5.2.1/daemon-29448.out.log
----- Last  20 lines from daemon log file - daemon-29448.out.log -----
:sdks:python:container:py37:docker (Thread[Execution worker for ':',5,main]) completed. Took 3 mins 22.533 secs.

FAILURE: Build failed with an exception.

* What went wrong:
Execution failed for task ':sdks:python:container:py37:docker'.
> Process 'command 'docker'' finished with non-zero exit value 143

* Try:
Run with --stacktrace option to get the stack trace. Run with --debug option to get more log output. Run with --scan to get full insights.

* Get more help at https://help.gradle.org

Deprecated Gradle features were used in this build, making it incompatible with Gradle 6.0.
Use '--warning-mode all' to show the individual deprecation warnings.
See https://docs.gradle.org/5.2.1/userguide/command_line_interface.html#sec:command_line_warnings

BUILD FAILED in 3m 30s
20 actionable tasks: 14 executed, 6 up-to-date
Daemon vm is shutting down... The daemon has exited normally or was terminated in response to a user interrupt.
----- End of the daemon log -----


FAILURE: Build failed with an exception.

* What went wrong:
Gradle build daemon disappeared unexpectedly (it may have been killed or may have crashed)

* Try:
Run with --stacktrace option to get the stack trace. Run with --debug option to get more log output. Run with --scan to get full insights.

* Get more help at https://help.gradle.org
Build step 'Execute shell' marked build as failure

---------------------------------------------------------------------
To unsubscribe, e-mail: builds-unsubscribe@beam.apache.org
For additional commands, e-mail: builds-help@beam.apache.org