You are viewing a plain text version of this content. The canonical link for it is here.
Posted to dev@geronimo.apache.org by ga...@apache.org on 2011/02/20 12:35:11 UTC

[BUILD] trunk: Failed for Revision: 1072525

Geronimo Revision: 1072525 built with tests included
 
See the full build-0300.log file at http://people.apache.org/builds/geronimo/server/binaries/trunk/20110220/build-0300.log
 
Download the binaries from http://people.apache.org/builds/geronimo/server/binaries/trunk/20110220
[INFO] BUILD SUCCESSFUL
[INFO] ------------------------------------------------------------------------
[INFO] Total time: 39 minutes 32 seconds
[INFO] Finished at: Sun Feb 20 03:43:46 EST 2011
[INFO] Final Memory: 609M/967M
[INFO] ------------------------------------------------------------------------
 
TESTSUITE RESULTS (Failures only)
=================================
 
Assembly: tomcat
=================================
See full test results and logs at http://people.apache.org/builds/geronimo/server/binaries/trunk/20110220/logs-0300-tomcat/
 
Running TestSuite
Tests run: 1, Failures: 1, Errors: 0, Skipped: 0, Time elapsed: 60.508 sec <<< FAILURE!
Running TestSuite
Tests run: 1, Failures: 1, Errors: 0, Skipped: 0, Time elapsed: 60.562 sec <<< FAILURE!
 
Assembly: jetty
=================================
See full test results and logs at http://people.apache.org/builds/geronimo/server/binaries/trunk/20110220/logs-0300-jetty/
 
Running TestSuite
Tests run: 2, Failures: 1, Errors: 0, Skipped: 0, Time elapsed: 1.509 sec <<< FAILURE!
--
Running TestSuite
Tests run: 1, Failures: 1, Errors: 0, Skipped: 0, Time elapsed: 60.521 sec <<< FAILURE!
Running TestSuite
Tests run: 1, Failures: 1, Errors: 0, Skipped: 0, Time elapsed: 60.616 sec <<< FAILURE!
 
Samples: trunk
=================================
Log: http://people.apache.org/builds/geronimo/server/binaries/trunk/20110220/samples-0300.log
 
Build status: FAILED