You are viewing a plain text version of this content. The canonical link for it is here.
Posted to dev@lucene.apache.org by Policeman Jenkins Server <je...@thetaphi.de> on 2014/05/01 14:08:07 UTC

[JENKINS] Lucene-Solr-4.x-Linux (64bit/jdk1.8.0_05) - Build # 10096 - Still Failing!

Build: http://jenkins.thetaphi.de/job/Lucene-Solr-4.x-Linux/10096/
Java: 64bit/jdk1.8.0_05 -XX:+UseCompressedOops -XX:+UseSerialGC

1 tests failed.
REGRESSION:  org.apache.lucene.analysis.core.TestRandomChains.testRandomChainsWithLargeStrings

Error Message:
some thread(s) failed

Stack Trace:
java.lang.RuntimeException: some thread(s) failed
	at org.apache.lucene.analysis.BaseTokenStreamTestCase.checkRandomData(BaseTokenStreamTestCase.java:533)
	at org.apache.lucene.analysis.core.TestRandomChains.testRandomChainsWithLargeStrings(TestRandomChains.java:941)
	at sun.reflect.NativeMethodAccessorImpl.invoke0(Native Method)
	at sun.reflect.NativeMethodAccessorImpl.invoke(NativeMethodAccessorImpl.java:62)
	at sun.reflect.DelegatingMethodAccessorImpl.invoke(DelegatingMethodAccessorImpl.java:43)
	at java.lang.reflect.Method.invoke(Method.java:483)
	at com.carrotsearch.randomizedtesting.RandomizedRunner.invoke(RandomizedRunner.java:1618)
	at com.carrotsearch.randomizedtesting.RandomizedRunner$6.evaluate(RandomizedRunner.java:827)
	at com.carrotsearch.randomizedtesting.RandomizedRunner$7.evaluate(RandomizedRunner.java:863)
	at com.carrotsearch.randomizedtesting.RandomizedRunner$8.evaluate(RandomizedRunner.java:877)
	at org.apache.lucene.util.TestRuleSetupTeardownChained$1.evaluate(TestRuleSetupTeardownChained.java:50)
	at org.apache.lucene.util.TestRuleFieldCacheSanity$1.evaluate(TestRuleFieldCacheSanity.java:51)
	at org.apache.lucene.util.AbstractBeforeAfterRule$1.evaluate(AbstractBeforeAfterRule.java:46)
	at com.carrotsearch.randomizedtesting.rules.SystemPropertiesInvariantRule$1.evaluate(SystemPropertiesInvariantRule.java:55)
	at org.apache.lucene.util.TestRuleThreadAndTestName$1.evaluate(TestRuleThreadAndTestName.java:49)
	at org.apache.lucene.util.TestRuleIgnoreAfterMaxFailures$1.evaluate(TestRuleIgnoreAfterMaxFailures.java:65)
	at org.apache.lucene.util.TestRuleMarkFailure$1.evaluate(TestRuleMarkFailure.java:48)
	at com.carrotsearch.randomizedtesting.rules.StatementAdapter.evaluate(StatementAdapter.java:36)
	at com.carrotsearch.randomizedtesting.ThreadLeakControl$StatementRunner.run(ThreadLeakControl.java:360)
	at com.carrotsearch.randomizedtesting.ThreadLeakControl.forkTimeoutingTask(ThreadLeakControl.java:793)
	at com.carrotsearch.randomizedtesting.ThreadLeakControl$3.evaluate(ThreadLeakControl.java:453)
	at com.carrotsearch.randomizedtesting.RandomizedRunner.runSingleTest(RandomizedRunner.java:836)
	at com.carrotsearch.randomizedtesting.RandomizedRunner$3.evaluate(RandomizedRunner.java:738)
	at com.carrotsearch.randomizedtesting.RandomizedRunner$4.evaluate(RandomizedRunner.java:772)
	at com.carrotsearch.randomizedtesting.RandomizedRunner$5.evaluate(RandomizedRunner.java:783)
	at org.apache.lucene.util.AbstractBeforeAfterRule$1.evaluate(AbstractBeforeAfterRule.java:46)
	at org.apache.lucene.util.TestRuleStoreClassName$1.evaluate(TestRuleStoreClassName.java:42)
	at com.carrotsearch.randomizedtesting.rules.SystemPropertiesInvariantRule$1.evaluate(SystemPropertiesInvariantRule.java:55)
	at com.carrotsearch.randomizedtesting.rules.NoShadowingOrOverridesOnMethodsRule$1.evaluate(NoShadowingOrOverridesOnMethodsRule.java:39)
	at com.carrotsearch.randomizedtesting.rules.NoShadowingOrOverridesOnMethodsRule$1.evaluate(NoShadowingOrOverridesOnMethodsRule.java:39)
	at com.carrotsearch.randomizedtesting.rules.StatementAdapter.evaluate(StatementAdapter.java:36)
	at com.carrotsearch.randomizedtesting.rules.StatementAdapter.evaluate(StatementAdapter.java:36)
	at com.carrotsearch.randomizedtesting.rules.StatementAdapter.evaluate(StatementAdapter.java:36)
	at org.apache.lucene.util.TestRuleAssertionsRequired$1.evaluate(TestRuleAssertionsRequired.java:43)
	at org.apache.lucene.util.TestRuleMarkFailure$1.evaluate(TestRuleMarkFailure.java:48)
	at org.apache.lucene.util.TestRuleIgnoreAfterMaxFailures$1.evaluate(TestRuleIgnoreAfterMaxFailures.java:65)
	at org.apache.lucene.util.TestRuleIgnoreTestSuites$1.evaluate(TestRuleIgnoreTestSuites.java:55)
	at com.carrotsearch.randomizedtesting.rules.StatementAdapter.evaluate(StatementAdapter.java:36)
	at com.carrotsearch.randomizedtesting.ThreadLeakControl$StatementRunner.run(ThreadLeakControl.java:360)
	at java.lang.Thread.run(Thread.java:745)




Build Log:
[...truncated 5627 lines...]
   [junit4] Suite: org.apache.lucene.analysis.core.TestRandomChains
   [junit4]   2> TEST FAIL: useCharFilter=false text='determinazione a cui perverr\u00e0 il Parlamento europeo in merito ai due regolamenti'
   [junit4]   2> TEST FAIL: useCharFilter=false text='determinazione a cui perverr\u00e0 il Parlamento europeo in merito ai due regolamenti'
   [junit4]   2> TEST FAIL: useCharFilter=false text='determinazione a cui perverr\u00e0 il Parlamento europeo in merito ai due regolamenti'
   [junit4]   2> 五月 01, 2014 3:05:21 下午 com.carrotsearch.randomizedtesting.RandomizedRunner$QueueUncaughtExceptionsHandler uncaughtException
   [junit4]   2> WARNING: Uncaught exception in thread: Thread[Thread-640,5,TGRP-TestRandomChains]
   [junit4]   2> java.lang.AssertionError: TokenStream implementation classes or at least their incrementToken() implementation must be final
   [junit4]   2> 	at __randomizedtesting.SeedInfo.seed([2B00935AB15D6B4F]:0)
   [junit4]   2> 	at org.apache.lucene.analysis.TokenStream.assertFinal(TokenStream.java:117)
   [junit4]   2> 	at org.apache.lucene.analysis.TokenStream.<init>(TokenStream.java:101)
   [junit4]   2> 	at org.apache.lucene.analysis.TokenFilter.<init>(TokenFilter.java:33)
   [junit4]   2> 	at org.apache.lucene.analysis.CrankyTokenFilter.<init>(CrankyTokenFilter.java:35)
   [junit4]   2> 	at sun.reflect.NativeConstructorAccessorImpl.newInstance0(Native Method)
   [junit4]   2> 	at sun.reflect.NativeConstructorAccessorImpl.newInstance(NativeConstructorAccessorImpl.java:62)
   [junit4]   2> 	at sun.reflect.DelegatingConstructorAccessorImpl.newInstance(DelegatingConstructorAccessorImpl.java:45)
   [junit4]   2> 	at java.lang.reflect.Constructor.newInstance(Constructor.java:408)
   [junit4]   2> 	at org.apache.lucene.analysis.core.TestRandomChains$MockRandomAnalyzer.createComponent(TestRandomChains.java:699)
   [junit4]   2> 	at org.apache.lucene.analysis.core.TestRandomChains$MockRandomAnalyzer.newFilterChain(TestRandomChains.java:814)
   [junit4]   2> 	at org.apache.lucene.analysis.core.TestRandomChains$MockRandomAnalyzer.createComponents(TestRandomChains.java:663)
   [junit4]   2> 	at org.apache.lucene.analysis.Analyzer.tokenStream(Analyzer.java:142)
   [junit4]   2> 	at org.apache.lucene.analysis.BaseTokenStreamTestCase.checkAnalysisConsistency(BaseTokenStreamTestCase.java:686)
   [junit4]   2> 	at org.apache.lucene.analysis.BaseTokenStreamTestCase.checkRandomData(BaseTokenStreamTestCase.java:612)
   [junit4]   2> 	at org.apache.lucene.analysis.BaseTokenStreamTestCase.access$000(BaseTokenStreamTestCase.java:59)
   [junit4]   2> 	at org.apache.lucene.analysis.BaseTokenStreamTestCase$AnalysisThread.run(BaseTokenStreamTestCase.java:481)
   [junit4]   2> 
   [junit4]   2> 五月 01, 2014 3:05:21 下午 com.carrotsearch.randomizedtesting.RandomizedRunner$QueueUncaughtExceptionsHandler uncaughtException
   [junit4]   2> WARNING: Uncaught exception in thread: Thread[Thread-639,5,TGRP-TestRandomChains]
   [junit4]   2> java.lang.AssertionError: TokenStream implementation classes or at least their incrementToken() implementation must be final
   [junit4]   2> 	at __randomizedtesting.SeedInfo.seed([2B00935AB15D6B4F]:0)
   [junit4]   2> 	at org.apache.lucene.analysis.TokenStream.assertFinal(TokenStream.java:117)
   [junit4]   2> 	at org.apache.lucene.analysis.TokenStream.<init>(TokenStream.java:101)
   [junit4]   2> 	at org.apache.lucene.analysis.TokenFilter.<init>(TokenFilter.java:33)
   [junit4]   2> 	at org.apache.lucene.analysis.CrankyTokenFilter.<init>(CrankyTokenFilter.java:35)
   [junit4]   2> 	at sun.reflect.NativeConstructorAccessorImpl.newInstance0(Native Method)
   [junit4]   2> 	at sun.reflect.NativeConstructorAccessorImpl.newInstance(NativeConstructorAccessorImpl.java:62)
   [junit4]   2> 	at sun.reflect.DelegatingConstructorAccessorImpl.newInstance(DelegatingConstructorAccessorImpl.java:45)
   [junit4]   2> 	at java.lang.reflect.Constructor.newInstance(Constructor.java:408)
   [junit4]   2> 	at org.apache.lucene.analysis.core.TestRandomChains$MockRandomAnalyzer.createComponent(TestRandomChains.java:699)
   [junit4]   2> 	at org.apache.lucene.analysis.core.TestRandomChains$MockRandomAnalyzer.newFilterChain(TestRandomChains.java:814)
   [junit4]   2> 	at org.apache.lucene.analysis.core.TestRandomChains$MockRandomAnalyzer.createComponents(TestRandomChains.java:663)
   [junit4]   2> 	at org.apache.lucene.analysis.Analyzer.tokenStream(Analyzer.java:142)
   [junit4]   2> 	at org.apache.lucene.analysis.BaseTokenStreamTestCase.checkAnalysisConsistency(BaseTokenStreamTestCase.java:686)
   [junit4]   2> 	at org.apache.lucene.analysis.BaseTokenStreamTestCase.checkRandomData(BaseTokenStreamTestCase.java:612)
   [junit4]   2> 	at org.apache.lucene.analysis.BaseTokenStreamTestCase.access$000(BaseTokenStreamTestCase.java:59)
   [junit4]   2> 	at org.apache.lucene.analysis.BaseTokenStreamTestCase$AnalysisThread.run(BaseTokenStreamTestCase.java:481)
   [junit4]   2> 
   [junit4]   2> 五月 01, 2014 3:05:21 下午 com.carrotsearch.randomizedtesting.RandomizedRunner$QueueUncaughtExceptionsHandler uncaughtException
   [junit4]   2> WARNING: Uncaught exception in thread: Thread[Thread-638,5,TGRP-TestRandomChains]
   [junit4]   2> java.lang.AssertionError: TokenStream implementation classes or at least their incrementToken() implementation must be final
   [junit4]   2> 	at __randomizedtesting.SeedInfo.seed([2B00935AB15D6B4F]:0)
   [junit4]   2> 	at org.apache.lucene.analysis.TokenStream.assertFinal(TokenStream.java:117)
   [junit4]   2> 	at org.apache.lucene.analysis.TokenStream.<init>(TokenStream.java:101)
   [junit4]   2> 	at org.apache.lucene.analysis.TokenFilter.<init>(TokenFilter.java:33)
   [junit4]   2> 	at org.apache.lucene.analysis.CrankyTokenFilter.<init>(CrankyTokenFilter.java:35)
   [junit4]   2> 	at sun.reflect.NativeConstructorAccessorImpl.newInstance0(Native Method)
   [junit4]   2> 	at sun.reflect.NativeConstructorAccessorImpl.newInstance(NativeConstructorAccessorImpl.java:62)
   [junit4]   2> 	at sun.reflect.DelegatingConstructorAccessorImpl.newInstance(DelegatingConstructorAccessorImpl.java:45)
   [junit4]   2> 	at java.lang.reflect.Constructor.newInstance(Constructor.java:408)
   [junit4]   2> 	at org.apache.lucene.analysis.core.TestRandomChains$MockRandomAnalyzer.createComponent(TestRandomChains.java:699)
   [junit4]   2> 	at org.apache.lucene.analysis.core.TestRandomChains$MockRandomAnalyzer.newFilterChain(TestRandomChains.java:814)
   [junit4]   2> 	at org.apache.lucene.analysis.core.TestRandomChains$MockRandomAnalyzer.createComponents(TestRandomChains.java:663)
   [junit4]   2> 	at org.apache.lucene.analysis.Analyzer.tokenStream(Analyzer.java:142)
   [junit4]   2> 	at org.apache.lucene.analysis.BaseTokenStreamTestCase.checkAnalysisConsistency(BaseTokenStreamTestCase.java:686)
   [junit4]   2> 	at org.apache.lucene.analysis.BaseTokenStreamTestCase.checkRandomData(BaseTokenStreamTestCase.java:612)
   [junit4]   2> 	at org.apache.lucene.analysis.BaseTokenStreamTestCase.access$000(BaseTokenStreamTestCase.java:59)
   [junit4]   2> 	at org.apache.lucene.analysis.BaseTokenStreamTestCase$AnalysisThread.run(BaseTokenStreamTestCase.java:481)
   [junit4]   2> 
   [junit4]   2> Exception from random analyzer: 
   [junit4]   2> charfilters=
   [junit4]   2>   org.apache.lucene.analysis.pattern.PatternReplaceCharFilter(a, , java.io.StringReader@564333d)
   [junit4]   2>   org.apache.lucene.analysis.MockCharFilter(org.apache.lucene.analysis.pattern.PatternReplaceCharFilter@1b81bf55)
   [junit4]   2> tokenizer=
   [junit4]   2>   org.apache.lucene.analysis.core.KeywordTokenizer(org.apache.lucene.util.AttributeSource$AttributeFactory$DefaultAttributeFactory@245a286f, org.apache.lucene.analysis.core.TestRandomChains$CheckThatYouDidntReadAnythingReaderWrapper@11740b1d, 8)
   [junit4]   2> filters=
   [junit4]   2>   org.apache.lucene.analysis.synonym.SynonymFilter(ValidatingTokenFilter@1b773f72 term=,bytes=[],startOffset=0,endOffset=0,positionIncrement=1,positionLength=1,type=word, org.apache.lucene.analysis.synonym.SynonymMap@475c9099, false)
   [junit4]   2>   org.apache.lucene.analysis.reverse.ReverseStringFilter(LUCENE_4_9, ValidatingTokenFilter@29101d1d term=,bytes=[],startOffset=0,endOffset=0,positionIncrement=1,positionLength=1,type=word, ᇭ)
   [junit4]   2>   org.apache.lucene.analysis.cjk.CJKBigramFilter(ValidatingTokenFilter@2845aa44 term=,bytes=[],startOffset=0,endOffset=0,positionIncrement=1,positionLength=1,type=word, -15)
   [junit4]   2> offsetsAreCorrect=false
   [junit4]   2> NOTE: reproduce with: ant test  -Dtestcase=TestRandomChains -Dtests.method=testRandomChainsWithLargeStrings -Dtests.seed=2B00935AB15D6B4F -Dtests.multiplier=3 -Dtests.slow=true -Dtests.locale=zh_SG -Dtests.timezone=Asia/Kuwait -Dtests.file.encoding=UTF-8
   [junit4] ERROR   18.9s J1 | TestRandomChains.testRandomChainsWithLargeStrings <<<
   [junit4]    > Throwable #1: java.lang.RuntimeException: some thread(s) failed
   [junit4]    > 	at org.apache.lucene.analysis.BaseTokenStreamTestCase.checkRandomData(BaseTokenStreamTestCase.java:533)
   [junit4]    > 	at org.apache.lucene.analysis.core.TestRandomChains.testRandomChainsWithLargeStrings(TestRandomChains.java:941)
   [junit4]    > 	at java.lang.Thread.run(Thread.java:745)Throwable #2: com.carrotsearch.randomizedtesting.UncaughtExceptionError: Captured an uncaught exception in thread: Thread[id=784, name=Thread-640, state=RUNNABLE, group=TGRP-TestRandomChains]
   [junit4]    > Caused by: java.lang.AssertionError: TokenStream implementation classes or at least their incrementToken() implementation must be final
   [junit4]    > 	at __randomizedtesting.SeedInfo.seed([2B00935AB15D6B4F]:0)
   [junit4]    > 	at org.apache.lucene.analysis.TokenStream.assertFinal(TokenStream.java:117)
   [junit4]    > 	at org.apache.lucene.analysis.TokenStream.<init>(TokenStream.java:101)
   [junit4]    > 	at org.apache.lucene.analysis.TokenFilter.<init>(TokenFilter.java:33)
   [junit4]    > 	at org.apache.lucene.analysis.CrankyTokenFilter.<init>(CrankyTokenFilter.java:35)
   [junit4]    > 	at java.lang.reflect.Constructor.newInstance(Constructor.java:408)
   [junit4]    > 	at org.apache.lucene.analysis.core.TestRandomChains$MockRandomAnalyzer.createComponent(TestRandomChains.java:699)
   [junit4]    > 	at org.apache.lucene.analysis.core.TestRandomChains$MockRandomAnalyzer.newFilterChain(TestRandomChains.java:814)
   [junit4]    > 	at org.apache.lucene.analysis.core.TestRandomChains$MockRandomAnalyzer.createComponents(TestRandomChains.java:663)
   [junit4]    > 	at org.apache.lucene.analysis.Analyzer.tokenStream(Analyzer.java:142)
   [junit4]    > 	at org.apache.lucene.analysis.BaseTokenStreamTestCase.checkAnalysisConsistency(BaseTokenStreamTestCase.java:686)
   [junit4]    > 	at org.apache.lucene.analysis.BaseTokenStreamTestCase.checkRandomData(BaseTokenStreamTestCase.java:612)
   [junit4]    > 	at org.apache.lucene.analysis.BaseTokenStreamTestCase.access$000(BaseTokenStreamTestCase.java:59)
   [junit4]    > 	at org.apache.lucene.analysis.BaseTokenStreamTestCase$AnalysisThread.run(BaseTokenStreamTestCase.java:481)Throwable #3: com.carrotsearch.randomizedtesting.UncaughtExceptionError: Captured an uncaught exception in thread: Thread[id=782, name=Thread-638, state=RUNNABLE, group=TGRP-TestRandomChains]
   [junit4]    > Caused by: java.lang.AssertionError: TokenStream implementation classes or at least their incrementToken() implementation must be final
   [junit4]    > 	at __randomizedtesting.SeedInfo.seed([2B00935AB15D6B4F]:0)
   [junit4]    > 	at org.apache.lucene.analysis.TokenStream.assertFinal(TokenStream.java:117)
   [junit4]    > 	at org.apache.lucene.analysis.TokenStream.<init>(TokenStream.java:101)
   [junit4]    > 	at org.apache.lucene.analysis.TokenFilter.<init>(TokenFilter.java:33)
   [junit4]    > 	at org.apache.lucene.analysis.CrankyTokenFilter.<init>(CrankyTokenFilter.java:35)
   [junit4]    > 	at java.lang.reflect.Constructor.newInstance(Constructor.java:408)
   [junit4]    > 	at org.apache.lucene.analysis.core.TestRandomChains$MockRandomAnalyzer.createComponent(TestRandomChains.java:699)
   [junit4]    > 	at org.apache.lucene.analysis.core.TestRandomChains$MockRandomAnalyzer.newFilterChain(TestRandomChains.java:814)
   [junit4]    > 	at org.apache.lucene.analysis.core.TestRandomChains$MockRandomAnalyzer.createComponents(TestRandomChains.java:663)
   [junit4]    > 	at org.apache.lucene.analysis.Analyzer.tokenStream(Analyzer.java:142)
   [junit4]    > 	at org.apache.lucene.analysis.BaseTokenStreamTestCase.checkAnalysisConsistency(BaseTokenStreamTestCase.java:686)
   [junit4]    > 	at org.apache.lucene.analysis.BaseTokenStreamTestCase.checkRandomData(BaseTokenStreamTestCase.java:612)
   [junit4]    > 	at org.apache.lucene.analysis.BaseTokenStreamTestCase.access$000(BaseTokenStreamTestCase.java:59)
   [junit4]    > 	at org.apache.lucene.analysis.BaseTokenStreamTestCase$AnalysisThread.run(BaseTokenStreamTestCase.java:481)Throwable #4: com.carrotsearch.randomizedtesting.UncaughtExceptionError: Captured an uncaught exception in thread: Thread[id=783, name=Thread-639, state=RUNNABLE, group=TGRP-TestRandomChains]
   [junit4]    > Caused by: java.lang.AssertionError: TokenStream implementation classes or at least their incrementToken() implementation must be final
   [junit4]    > 	at __randomizedtesting.SeedInfo.seed([2B00935AB15D6B4F]:0)
   [junit4]    > 	at org.apache.lucene.analysis.TokenStream.assertFinal(TokenStream.java:117)
   [junit4]    > 	at org.apache.lucene.analysis.TokenStream.<init>(TokenStream.java:101)
   [junit4]    > 	at org.apache.lucene.analysis.TokenFilter.<init>(TokenFilter.java:33)
   [junit4]    > 	at org.apache.lucene.analysis.CrankyTokenFilter.<init>(CrankyTokenFilter.java:35)
   [junit4]    > 	at java.lang.reflect.Constructor.newInstance(Constructor.java:408)
   [junit4]    > 	at org.apache.lucene.analysis.core.TestRandomChains$MockRandomAnalyzer.createComponent(TestRandomChains.java:699)
   [junit4]    > 	at org.apache.lucene.analysis.core.TestRandomChains$MockRandomAnalyzer.newFilterChain(TestRandomChains.java:814)
   [junit4]    > 	at org.apache.lucene.analysis.core.TestRandomChains$MockRandomAnalyzer.createComponents(TestRandomChains.java:663)
   [junit4]    > 	at org.apache.lucene.analysis.Analyzer.tokenStream(Analyzer.java:142)
   [junit4]    > 	at org.apache.lucene.analysis.BaseTokenStreamTestCase.checkAnalysisConsistency(BaseTokenStreamTestCase.java:686)
   [junit4]    > 	at org.apache.lucene.analysis.BaseTokenStreamTestCase.checkRandomData(BaseTokenStreamTestCase.java:612)
   [junit4]    > 	at org.apache.lucene.analysis.BaseTokenStreamTestCase.access$000(BaseTokenStreamTestCase.java:59)
   [junit4]    > 	at org.apache.lucene.analysis.BaseTokenStreamTestCase$AnalysisThread.run(BaseTokenStreamTestCase.java:481)
   [junit4]   2> NOTE: leaving temporary files on disk at: /mnt/ssd/jenkins/workspace/Lucene-Solr-4.x-Linux@2/lucene/build/analysis/common/test/J1/./lucene.analysis.core.TestRandomChains-2B00935AB15D6B4F-001
   [junit4]   2> NOTE: test params are: codec=Asserting, sim=RandomSimilarityProvider(queryNorm=true,coord=no): {dummy=DFR I(F)B1}, locale=zh_SG, timezone=Asia/Kuwait
   [junit4]   2> NOTE: Linux 3.8.0-38-generic amd64/Oracle Corporation 1.8.0_05 (64-bit)/cpus=8,threads=1,free=100559000,total=189792256
   [junit4]   2> NOTE: All tests run in this JVM: [TestWordlistLoader, TestPortugueseLightStemFilterFactory, TestSolrSynonymParser, TestDictionaryCompoundWordTokenFilterFactory, TestStandardFactories, TestEnglishMinimalStemFilter, TestSnowball, CommonGramsFilterTest, TestFrenchMinimalStemFilterFactory, TestCharacterUtils, TestHungarianLightStemFilter, TestKeepFilterFactory, TestCJKWidthFilterFactory, TestDanishAnalyzer, TestScandinavianNormalizationFilter, DelimitedPayloadTokenFilterTest, TestPatternCaptureGroupTokenFilter, TestFinnishAnalyzer, TestBrazilianStemmer, TestCollationKeyAnalyzer, TestThaiTokenizerFactory, TestSegmentingTokenizerBase, TestSoraniStemFilterFactory, TestCzechStemmer, TestOptionalCondition, TokenRangeSinkTokenizerTest, TestGermanAnalyzer, TestGermanStemFilterFactory, TestFrenchAnalyzer, TestArmenianAnalyzer, DateRecognizerSinkTokenizerTest, TestLimitTokenPositionFilter, TypeAsPayloadTokenFilterTest, TestTrimFilterFactory, TestPortugueseLightStemFilter, TestSpanishLightStemFilterFactory, TestKeywordMarkerFilter, TestAnalysisSPILoader, NGramTokenFilterTest, TestSoraniAnalyzer, TestPerFieldAnalyzerWrapper, TestCJKBigramFilterFactory, TestCodepointCountFilter, TestTurkishLowerCaseFilter, TestKeepWordFilter, TestCJKWidthFilter, TestCharArrayMap, TestRussianLetterTokenizer, TestAllAnalyzersHaveFactories, TestStandardAnalyzer, TestSpanishLightStemFilter, TestGermanMinimalStemFilterFactory, TestGreekStemmer, TestGreekLowerCaseFilterFactory, TestComplexPrefix, TestBulgarianStemmer, TestCapitalizationFilter, TestArabicAnalyzer, TestTurkishAnalyzer, TestStemmer, TokenTypeSinkTokenizerTest, TestNorwegianLightStemFilterFactory, TestReverseStringFilter, TestStopFilter, TestMappingCharFilterFactory, TestTypeTokenFilter, TestRandomChains]
   [junit4] Completed on J1 in 53.48s, 2 tests, 1 error <<< FAILURES!

[...truncated 401 lines...]
BUILD FAILED
/mnt/ssd/jenkins/workspace/Lucene-Solr-4.x-Linux@2/build.xml:467: The following error occurred while executing this line:
/mnt/ssd/jenkins/workspace/Lucene-Solr-4.x-Linux@2/build.xml:447: The following error occurred while executing this line:
/mnt/ssd/jenkins/workspace/Lucene-Solr-4.x-Linux@2/build.xml:45: The following error occurred while executing this line:
/mnt/ssd/jenkins/workspace/Lucene-Solr-4.x-Linux@2/extra-targets.xml:37: The following error occurred while executing this line:
/mnt/ssd/jenkins/workspace/Lucene-Solr-4.x-Linux@2/lucene/build.xml:539: The following error occurred while executing this line:
/mnt/ssd/jenkins/workspace/Lucene-Solr-4.x-Linux@2/lucene/common-build.xml:2017: The following error occurred while executing this line:
/mnt/ssd/jenkins/workspace/Lucene-Solr-4.x-Linux@2/lucene/analysis/build.xml:106: The following error occurred while executing this line:
/mnt/ssd/jenkins/workspace/Lucene-Solr-4.x-Linux@2/lucene/analysis/build.xml:38: The following error occurred while executing this line:
/mnt/ssd/jenkins/workspace/Lucene-Solr-4.x-Linux@2/lucene/module-build.xml:60: The following error occurred while executing this line:
/mnt/ssd/jenkins/workspace/Lucene-Solr-4.x-Linux@2/lucene/common-build.xml:1297: The following error occurred while executing this line:
/mnt/ssd/jenkins/workspace/Lucene-Solr-4.x-Linux@2/lucene/common-build.xml:921: There were test failures: 266 suites, 1451 tests, 1 error, 1 ignored

Total time: 25 minutes 2 seconds
Build step 'Invoke Ant' marked build as failure
Description set: Java: 64bit/jdk1.8.0_05 -XX:+UseCompressedOops -XX:+UseSerialGC
Archiving artifacts
Recording test results
Email was triggered for: Failure
Sending email for trigger: Failure