You are viewing a plain text version of this content. The canonical link for it is here.
Posted to dev@lucene.apache.org by Policeman Jenkins Server <je...@thetaphi.de> on 2016/05/21 00:02:25 UTC

[JENKINS] Lucene-Solr-6.0-Windows (64bit/jdk1.8.0_92) - Build # 43 - Failure!

Build: http://jenkins.thetaphi.de/job/Lucene-Solr-6.0-Windows/43/
Java: 64bit/jdk1.8.0_92 -XX:-UseCompressedOops -XX:+UseSerialGC

5 tests failed.
FAILED:  TEST-org.apache.lucene.codecs.compressing.TestGrowableByteArrayDataOutput.xml.[failed-to-read]

Error Message:


Stack Trace:
Failed to read test report file C:\Users\jenkins\workspace\Lucene-Solr-6.0-Windows\lucene\build\core\test\TEST-org.apache.lucene.codecs.compressing.TestGrowableByteArrayDataOutput.xml
org.dom4j.DocumentException: Error on line 3 of document file:///C:/Users/jenkins/workspace/Lucene-Solr-6.0-Windows/lucene/build/core/test/TEST-org.apache.lucene.codecs.compressing.TestGrowableByteArrayDataOutput.xml : XML document structures must start and end within the same entity. Nested exception: XML document structures must start and end within the same entity.
	at org.dom4j.io.SAXReader.read(SAXReader.java:482)
	at org.dom4j.io.SAXReader.read(SAXReader.java:264)
	at hudson.tasks.junit.SuiteResult.parse(SuiteResult.java:126)
	at hudson.tasks.junit.TestResult.parse(TestResult.java:301)
	at hudson.tasks.junit.TestResult.parsePossiblyEmpty(TestResult.java:244)
	at hudson.tasks.junit.TestResult.parse(TestResult.java:175)
	at hudson.tasks.junit.TestResult.parse(TestResult.java:154)
	at hudson.tasks.junit.TestResult.<init>(TestResult.java:126)
	at hudson.tasks.junit.JUnitParser$ParseResultCallable.invoke(JUnitParser.java:132)
	at hudson.tasks.junit.JUnitParser$ParseResultCallable.invoke(JUnitParser.java:107)
	at hudson.FilePath$FileCallableWrapper.call(FilePath.java:2772)
	at hudson.remoting.UserRequest.perform(UserRequest.java:152)
	at hudson.remoting.UserRequest.perform(UserRequest.java:50)
	at hudson.remoting.Request$2.run(Request.java:332)
	at hudson.remoting.InterceptingExecutorService$1.call(InterceptingExecutorService.java:68)
	at java.util.concurrent.FutureTask.run(Unknown Source)
	at java.util.concurrent.ThreadPoolExecutor.runWorker(Unknown Source)
	at java.util.concurrent.ThreadPoolExecutor$Worker.run(Unknown Source)
	at java.lang.Thread.run(Unknown Source)
Caused by: org.xml.sax.SAXParseException; systemId: file:///C:/Users/jenkins/workspace/Lucene-Solr-6.0-Windows/lucene/build/core/test/TEST-org.apache.lucene.codecs.compressing.TestGrowableByteArrayDataOutput.xml; lineNumber: 3; columnNumber: 50; XML document structures must start and end within the same entity.
	at com.sun.org.apache.xerces.internal.util.ErrorHandlerWrapper.createSAXParseException(Unknown Source)
	at com.sun.org.apache.xerces.internal.util.ErrorHandlerWrapper.fatalError(Unknown Source)
	at com.sun.org.apache.xerces.internal.impl.XMLErrorReporter.reportError(Unknown Source)
	at com.sun.org.apache.xerces.internal.impl.XMLErrorReporter.reportError(Unknown Source)
	at com.sun.org.apache.xerces.internal.impl.XMLScanner.reportFatalError(Unknown Source)
	at com.sun.org.apache.xerces.internal.impl.XMLDocumentFragmentScannerImpl.endEntity(Unknown Source)
	at com.sun.org.apache.xerces.internal.impl.XMLDocumentScannerImpl.endEntity(Unknown Source)
	at com.sun.org.apache.xerces.internal.impl.XMLEntityManager.endEntity(Unknown Source)
	at com.sun.org.apache.xerces.internal.impl.XMLEntityScanner.load(Unknown Source)
	at com.sun.org.apache.xerces.internal.impl.XMLEntityScanner.peekChar(Unknown Source)
	at com.sun.org.apache.xerces.internal.impl.XMLDocumentFragmentScannerImpl$FragmentContentDriver.next(Unknown Source)
	at com.sun.org.apache.xerces.internal.impl.XMLDocumentScannerImpl.next(Unknown Source)
	at com.sun.org.apache.xerces.internal.impl.XMLNSDocumentScannerImpl.next(Unknown Source)
	at com.sun.org.apache.xerces.internal.impl.XMLDocumentFragmentScannerImpl.scanDocument(Unknown Source)
	at com.sun.org.apache.xerces.internal.parsers.XML11Configuration.parse(Unknown Source)
	at com.sun.org.apache.xerces.internal.parsers.XML11Configuration.parse(Unknown Source)
	at com.sun.org.apache.xerces.internal.parsers.XMLParser.parse(Unknown Source)
	at com.sun.org.apache.xerces.internal.parsers.AbstractSAXParser.parse(Unknown Source)
	at com.sun.org.apache.xerces.internal.jaxp.SAXParserImpl$JAXPSAXParser.parse(Unknown Source)
	at org.dom4j.io.SAXReader.read(SAXReader.java:465)
	... 18 more
Nested exception: 
org.xml.sax.SAXParseException; systemId: file:///C:/Users/jenkins/workspace/Lucene-Solr-6.0-Windows/lucene/build/core/test/TEST-org.apache.lucene.codecs.compressing.TestGrowableByteArrayDataOutput.xml; lineNumber: 3; columnNumber: 50; XML document structures must start and end within the same entity.
	at com.sun.org.apache.xerces.internal.util.ErrorHandlerWrapper.createSAXParseException(Unknown Source)
	at com.sun.org.apache.xerces.internal.util.ErrorHandlerWrapper.fatalError(Unknown Source)
	at com.sun.org.apache.xerces.internal.impl.XMLErrorReporter.reportError(Unknown Source)
	at com.sun.org.apache.xerces.internal.impl.XMLErrorReporter.reportError(Unknown Source)
	at com.sun.org.apache.xerces.internal.impl.XMLScanner.reportFatalError(Unknown Source)
	at com.sun.org.apache.xerces.internal.impl.XMLDocumentFragmentScannerImpl.endEntity(Unknown Source)
	at com.sun.org.apache.xerces.internal.impl.XMLDocumentScannerImpl.endEntity(Unknown Source)
	at com.sun.org.apache.xerces.internal.impl.XMLEntityManager.endEntity(Unknown Source)
	at com.sun.org.apache.xerces.internal.impl.XMLEntityScanner.load(Unknown Source)
	at com.sun.org.apache.xerces.internal.impl.XMLEntityScanner.peekChar(Unknown Source)
	at com.sun.org.apache.xerces.internal.impl.XMLDocumentFragmentScannerImpl$FragmentContentDriver.next(Unknown Source)
	at com.sun.org.apache.xerces.internal.impl.XMLDocumentScannerImpl.next(Unknown Source)
	at com.sun.org.apache.xerces.internal.impl.XMLNSDocumentScannerImpl.next(Unknown Source)
	at com.sun.org.apache.xerces.internal.impl.XMLDocumentFragmentScannerImpl.scanDocument(Unknown Source)
	at com.sun.org.apache.xerces.internal.parsers.XML11Configuration.parse(Unknown Source)
	at com.sun.org.apache.xerces.internal.parsers.XML11Configuration.parse(Unknown Source)
	at com.sun.org.apache.xerces.internal.parsers.XMLParser.parse(Unknown Source)
	at com.sun.org.apache.xerces.internal.parsers.AbstractSAXParser.parse(Unknown Source)
	at com.sun.org.apache.xerces.internal.jaxp.SAXParserImpl$JAXPSAXParser.parse(Unknown Source)
	at org.dom4j.io.SAXReader.read(SAXReader.java:465)
	at org.dom4j.io.SAXReader.read(SAXReader.java:264)
	at hudson.tasks.junit.SuiteResult.parse(SuiteResult.java:126)
	at hudson.tasks.junit.TestResult.parse(TestResult.java:301)
	at hudson.tasks.junit.TestResult.parsePossiblyEmpty(TestResult.java:244)
	at hudson.tasks.junit.TestResult.parse(TestResult.java:175)
	at hudson.tasks.junit.TestResult.parse(TestResult.java:154)
	at hudson.tasks.junit.TestResult.<init>(TestResult.java:126)
	at hudson.tasks.junit.JUnitParser$ParseResultCallable.invoke(JUnitParser.java:132)
	at hudson.tasks.junit.JUnitParser$ParseResultCallable.invoke(JUnitParser.java:107)
	at hudson.FilePath$FileCallableWrapper.call(FilePath.java:2772)
	at hudson.remoting.UserRequest.perform(UserRequest.java:152)
	at hudson.remoting.UserRequest.perform(UserRequest.java:50)
	at hudson.remoting.Request$2.run(Request.java:332)
	at hudson.remoting.InterceptingExecutorService$1.call(InterceptingExecutorService.java:68)
	at java.util.concurrent.FutureTask.run(Unknown Source)
	at java.util.concurrent.ThreadPoolExecutor.runWorker(Unknown Source)
	at java.util.concurrent.ThreadPoolExecutor$Worker.run(Unknown Source)
	at java.lang.Thread.run(Unknown Source)


FAILED:  TEST-org.apache.lucene.codecs.lucene50.TestLucene50CompoundFormat.xml.[failed-to-read]

Error Message:


Stack Trace:
Failed to read test report file C:\Users\jenkins\workspace\Lucene-Solr-6.0-Windows\lucene\build\core\test\TEST-org.apache.lucene.codecs.lucene50.TestLucene50CompoundFormat.xml
org.dom4j.DocumentException: Error on line 3 of document file:///C:/Users/jenkins/workspace/Lucene-Solr-6.0-Windows/lucene/build/core/test/TEST-org.apache.lucene.codecs.lucene50.TestLucene50CompoundFormat.xml : XML document structures must start and end within the same entity. Nested exception: XML document structures must start and end within the same entity.
	at org.dom4j.io.SAXReader.read(SAXReader.java:482)
	at org.dom4j.io.SAXReader.read(SAXReader.java:264)
	at hudson.tasks.junit.SuiteResult.parse(SuiteResult.java:126)
	at hudson.tasks.junit.TestResult.parse(TestResult.java:301)
	at hudson.tasks.junit.TestResult.parsePossiblyEmpty(TestResult.java:244)
	at hudson.tasks.junit.TestResult.parse(TestResult.java:175)
	at hudson.tasks.junit.TestResult.parse(TestResult.java:154)
	at hudson.tasks.junit.TestResult.<init>(TestResult.java:126)
	at hudson.tasks.junit.JUnitParser$ParseResultCallable.invoke(JUnitParser.java:132)
	at hudson.tasks.junit.JUnitParser$ParseResultCallable.invoke(JUnitParser.java:107)
	at hudson.FilePath$FileCallableWrapper.call(FilePath.java:2772)
	at hudson.remoting.UserRequest.perform(UserRequest.java:152)
	at hudson.remoting.UserRequest.perform(UserRequest.java:50)
	at hudson.remoting.Request$2.run(Request.java:332)
	at hudson.remoting.InterceptingExecutorService$1.call(InterceptingExecutorService.java:68)
	at java.util.concurrent.FutureTask.run(Unknown Source)
	at java.util.concurrent.ThreadPoolExecutor.runWorker(Unknown Source)
	at java.util.concurrent.ThreadPoolExecutor$Worker.run(Unknown Source)
	at java.lang.Thread.run(Unknown Source)
Caused by: org.xml.sax.SAXParseException; systemId: file:///C:/Users/jenkins/workspace/Lucene-Solr-6.0-Windows/lucene/build/core/test/TEST-org.apache.lucene.codecs.lucene50.TestLucene50CompoundFormat.xml; lineNumber: 3; columnNumber: 50; XML document structures must start and end within the same entity.
	at com.sun.org.apache.xerces.internal.util.ErrorHandlerWrapper.createSAXParseException(Unknown Source)
	at com.sun.org.apache.xerces.internal.util.ErrorHandlerWrapper.fatalError(Unknown Source)
	at com.sun.org.apache.xerces.internal.impl.XMLErrorReporter.reportError(Unknown Source)
	at com.sun.org.apache.xerces.internal.impl.XMLErrorReporter.reportError(Unknown Source)
	at com.sun.org.apache.xerces.internal.impl.XMLScanner.reportFatalError(Unknown Source)
	at com.sun.org.apache.xerces.internal.impl.XMLDocumentFragmentScannerImpl.endEntity(Unknown Source)
	at com.sun.org.apache.xerces.internal.impl.XMLDocumentScannerImpl.endEntity(Unknown Source)
	at com.sun.org.apache.xerces.internal.impl.XMLEntityManager.endEntity(Unknown Source)
	at com.sun.org.apache.xerces.internal.impl.XMLEntityScanner.load(Unknown Source)
	at com.sun.org.apache.xerces.internal.impl.XMLEntityScanner.peekChar(Unknown Source)
	at com.sun.org.apache.xerces.internal.impl.XMLDocumentFragmentScannerImpl$FragmentContentDriver.next(Unknown Source)
	at com.sun.org.apache.xerces.internal.impl.XMLDocumentScannerImpl.next(Unknown Source)
	at com.sun.org.apache.xerces.internal.impl.XMLNSDocumentScannerImpl.next(Unknown Source)
	at com.sun.org.apache.xerces.internal.impl.XMLDocumentFragmentScannerImpl.scanDocument(Unknown Source)
	at com.sun.org.apache.xerces.internal.parsers.XML11Configuration.parse(Unknown Source)
	at com.sun.org.apache.xerces.internal.parsers.XML11Configuration.parse(Unknown Source)
	at com.sun.org.apache.xerces.internal.parsers.XMLParser.parse(Unknown Source)
	at com.sun.org.apache.xerces.internal.parsers.AbstractSAXParser.parse(Unknown Source)
	at com.sun.org.apache.xerces.internal.jaxp.SAXParserImpl$JAXPSAXParser.parse(Unknown Source)
	at org.dom4j.io.SAXReader.read(SAXReader.java:465)
	... 18 more
Nested exception: 
org.xml.sax.SAXParseException; systemId: file:///C:/Users/jenkins/workspace/Lucene-Solr-6.0-Windows/lucene/build/core/test/TEST-org.apache.lucene.codecs.lucene50.TestLucene50CompoundFormat.xml; lineNumber: 3; columnNumber: 50; XML document structures must start and end within the same entity.
	at com.sun.org.apache.xerces.internal.util.ErrorHandlerWrapper.createSAXParseException(Unknown Source)
	at com.sun.org.apache.xerces.internal.util.ErrorHandlerWrapper.fatalError(Unknown Source)
	at com.sun.org.apache.xerces.internal.impl.XMLErrorReporter.reportError(Unknown Source)
	at com.sun.org.apache.xerces.internal.impl.XMLErrorReporter.reportError(Unknown Source)
	at com.sun.org.apache.xerces.internal.impl.XMLScanner.reportFatalError(Unknown Source)
	at com.sun.org.apache.xerces.internal.impl.XMLDocumentFragmentScannerImpl.endEntity(Unknown Source)
	at com.sun.org.apache.xerces.internal.impl.XMLDocumentScannerImpl.endEntity(Unknown Source)
	at com.sun.org.apache.xerces.internal.impl.XMLEntityManager.endEntity(Unknown Source)
	at com.sun.org.apache.xerces.internal.impl.XMLEntityScanner.load(Unknown Source)
	at com.sun.org.apache.xerces.internal.impl.XMLEntityScanner.peekChar(Unknown Source)
	at com.sun.org.apache.xerces.internal.impl.XMLDocumentFragmentScannerImpl$FragmentContentDriver.next(Unknown Source)
	at com.sun.org.apache.xerces.internal.impl.XMLDocumentScannerImpl.next(Unknown Source)
	at com.sun.org.apache.xerces.internal.impl.XMLNSDocumentScannerImpl.next(Unknown Source)
	at com.sun.org.apache.xerces.internal.impl.XMLDocumentFragmentScannerImpl.scanDocument(Unknown Source)
	at com.sun.org.apache.xerces.internal.parsers.XML11Configuration.parse(Unknown Source)
	at com.sun.org.apache.xerces.internal.parsers.XML11Configuration.parse(Unknown Source)
	at com.sun.org.apache.xerces.internal.parsers.XMLParser.parse(Unknown Source)
	at com.sun.org.apache.xerces.internal.parsers.AbstractSAXParser.parse(Unknown Source)
	at com.sun.org.apache.xerces.internal.jaxp.SAXParserImpl$JAXPSAXParser.parse(Unknown Source)
	at org.dom4j.io.SAXReader.read(SAXReader.java:465)
	at org.dom4j.io.SAXReader.read(SAXReader.java:264)
	at hudson.tasks.junit.SuiteResult.parse(SuiteResult.java:126)
	at hudson.tasks.junit.TestResult.parse(TestResult.java:301)
	at hudson.tasks.junit.TestResult.parsePossiblyEmpty(TestResult.java:244)
	at hudson.tasks.junit.TestResult.parse(TestResult.java:175)
	at hudson.tasks.junit.TestResult.parse(TestResult.java:154)
	at hudson.tasks.junit.TestResult.<init>(TestResult.java:126)
	at hudson.tasks.junit.JUnitParser$ParseResultCallable.invoke(JUnitParser.java:132)
	at hudson.tasks.junit.JUnitParser$ParseResultCallable.invoke(JUnitParser.java:107)
	at hudson.FilePath$FileCallableWrapper.call(FilePath.java:2772)
	at hudson.remoting.UserRequest.perform(UserRequest.java:152)
	at hudson.remoting.UserRequest.perform(UserRequest.java:50)
	at hudson.remoting.Request$2.run(Request.java:332)
	at hudson.remoting.InterceptingExecutorService$1.call(InterceptingExecutorService.java:68)
	at java.util.concurrent.FutureTask.run(Unknown Source)
	at java.util.concurrent.ThreadPoolExecutor.runWorker(Unknown Source)
	at java.util.concurrent.ThreadPoolExecutor$Worker.run(Unknown Source)
	at java.lang.Thread.run(Unknown Source)


FAILED:  TEST-org.apache.lucene.codecs.lucene50.TestLucene50FieldInfoFormat.xml.[failed-to-read]

Error Message:


Stack Trace:
Failed to read test report file C:\Users\jenkins\workspace\Lucene-Solr-6.0-Windows\lucene\build\core\test\TEST-org.apache.lucene.codecs.lucene50.TestLucene50FieldInfoFormat.xml
org.dom4j.DocumentException: Error on line 3 of document file:///C:/Users/jenkins/workspace/Lucene-Solr-6.0-Windows/lucene/build/core/test/TEST-org.apache.lucene.codecs.lucene50.TestLucene50FieldInfoFormat.xml : XML document structures must start and end within the same entity. Nested exception: XML document structures must start and end within the same entity.
	at org.dom4j.io.SAXReader.read(SAXReader.java:482)
	at org.dom4j.io.SAXReader.read(SAXReader.java:264)
	at hudson.tasks.junit.SuiteResult.parse(SuiteResult.java:126)
	at hudson.tasks.junit.TestResult.parse(TestResult.java:301)
	at hudson.tasks.junit.TestResult.parsePossiblyEmpty(TestResult.java:244)
	at hudson.tasks.junit.TestResult.parse(TestResult.java:175)
	at hudson.tasks.junit.TestResult.parse(TestResult.java:154)
	at hudson.tasks.junit.TestResult.<init>(TestResult.java:126)
	at hudson.tasks.junit.JUnitParser$ParseResultCallable.invoke(JUnitParser.java:132)
	at hudson.tasks.junit.JUnitParser$ParseResultCallable.invoke(JUnitParser.java:107)
	at hudson.FilePath$FileCallableWrapper.call(FilePath.java:2772)
	at hudson.remoting.UserRequest.perform(UserRequest.java:152)
	at hudson.remoting.UserRequest.perform(UserRequest.java:50)
	at hudson.remoting.Request$2.run(Request.java:332)
	at hudson.remoting.InterceptingExecutorService$1.call(InterceptingExecutorService.java:68)
	at java.util.concurrent.FutureTask.run(Unknown Source)
	at java.util.concurrent.ThreadPoolExecutor.runWorker(Unknown Source)
	at java.util.concurrent.ThreadPoolExecutor$Worker.run(Unknown Source)
	at java.lang.Thread.run(Unknown Source)
Caused by: org.xml.sax.SAXParseException; systemId: file:///C:/Users/jenkins/workspace/Lucene-Solr-6.0-Windows/lucene/build/core/test/TEST-org.apache.lucene.codecs.lucene50.TestLucene50FieldInfoFormat.xml; lineNumber: 3; columnNumber: 50; XML document structures must start and end within the same entity.
	at com.sun.org.apache.xerces.internal.util.ErrorHandlerWrapper.createSAXParseException(Unknown Source)
	at com.sun.org.apache.xerces.internal.util.ErrorHandlerWrapper.fatalError(Unknown Source)
	at com.sun.org.apache.xerces.internal.impl.XMLErrorReporter.reportError(Unknown Source)
	at com.sun.org.apache.xerces.internal.impl.XMLErrorReporter.reportError(Unknown Source)
	at com.sun.org.apache.xerces.internal.impl.XMLScanner.reportFatalError(Unknown Source)
	at com.sun.org.apache.xerces.internal.impl.XMLDocumentFragmentScannerImpl.endEntity(Unknown Source)
	at com.sun.org.apache.xerces.internal.impl.XMLDocumentScannerImpl.endEntity(Unknown Source)
	at com.sun.org.apache.xerces.internal.impl.XMLEntityManager.endEntity(Unknown Source)
	at com.sun.org.apache.xerces.internal.impl.XMLEntityScanner.load(Unknown Source)
	at com.sun.org.apache.xerces.internal.impl.XMLEntityScanner.peekChar(Unknown Source)
	at com.sun.org.apache.xerces.internal.impl.XMLDocumentFragmentScannerImpl$FragmentContentDriver.next(Unknown Source)
	at com.sun.org.apache.xerces.internal.impl.XMLDocumentScannerImpl.next(Unknown Source)
	at com.sun.org.apache.xerces.internal.impl.XMLNSDocumentScannerImpl.next(Unknown Source)
	at com.sun.org.apache.xerces.internal.impl.XMLDocumentFragmentScannerImpl.scanDocument(Unknown Source)
	at com.sun.org.apache.xerces.internal.parsers.XML11Configuration.parse(Unknown Source)
	at com.sun.org.apache.xerces.internal.parsers.XML11Configuration.parse(Unknown Source)
	at com.sun.org.apache.xerces.internal.parsers.XMLParser.parse(Unknown Source)
	at com.sun.org.apache.xerces.internal.parsers.AbstractSAXParser.parse(Unknown Source)
	at com.sun.org.apache.xerces.internal.jaxp.SAXParserImpl$JAXPSAXParser.parse(Unknown Source)
	at org.dom4j.io.SAXReader.read(SAXReader.java:465)
	... 18 more
Nested exception: 
org.xml.sax.SAXParseException; systemId: file:///C:/Users/jenkins/workspace/Lucene-Solr-6.0-Windows/lucene/build/core/test/TEST-org.apache.lucene.codecs.lucene50.TestLucene50FieldInfoFormat.xml; lineNumber: 3; columnNumber: 50; XML document structures must start and end within the same entity.
	at com.sun.org.apache.xerces.internal.util.ErrorHandlerWrapper.createSAXParseException(Unknown Source)
	at com.sun.org.apache.xerces.internal.util.ErrorHandlerWrapper.fatalError(Unknown Source)
	at com.sun.org.apache.xerces.internal.impl.XMLErrorReporter.reportError(Unknown Source)
	at com.sun.org.apache.xerces.internal.impl.XMLErrorReporter.reportError(Unknown Source)
	at com.sun.org.apache.xerces.internal.impl.XMLScanner.reportFatalError(Unknown Source)
	at com.sun.org.apache.xerces.internal.impl.XMLDocumentFragmentScannerImpl.endEntity(Unknown Source)
	at com.sun.org.apache.xerces.internal.impl.XMLDocumentScannerImpl.endEntity(Unknown Source)
	at com.sun.org.apache.xerces.internal.impl.XMLEntityManager.endEntity(Unknown Source)
	at com.sun.org.apache.xerces.internal.impl.XMLEntityScanner.load(Unknown Source)
	at com.sun.org.apache.xerces.internal.impl.XMLEntityScanner.peekChar(Unknown Source)
	at com.sun.org.apache.xerces.internal.impl.XMLDocumentFragmentScannerImpl$FragmentContentDriver.next(Unknown Source)
	at com.sun.org.apache.xerces.internal.impl.XMLDocumentScannerImpl.next(Unknown Source)
	at com.sun.org.apache.xerces.internal.impl.XMLNSDocumentScannerImpl.next(Unknown Source)
	at com.sun.org.apache.xerces.internal.impl.XMLDocumentFragmentScannerImpl.scanDocument(Unknown Source)
	at com.sun.org.apache.xerces.internal.parsers.XML11Configuration.parse(Unknown Source)
	at com.sun.org.apache.xerces.internal.parsers.XML11Configuration.parse(Unknown Source)
	at com.sun.org.apache.xerces.internal.parsers.XMLParser.parse(Unknown Source)
	at com.sun.org.apache.xerces.internal.parsers.AbstractSAXParser.parse(Unknown Source)
	at com.sun.org.apache.xerces.internal.jaxp.SAXParserImpl$JAXPSAXParser.parse(Unknown Source)
	at org.dom4j.io.SAXReader.read(SAXReader.java:465)
	at org.dom4j.io.SAXReader.read(SAXReader.java:264)
	at hudson.tasks.junit.SuiteResult.parse(SuiteResult.java:126)
	at hudson.tasks.junit.TestResult.parse(TestResult.java:301)
	at hudson.tasks.junit.TestResult.parsePossiblyEmpty(TestResult.java:244)
	at hudson.tasks.junit.TestResult.parse(TestResult.java:175)
	at hudson.tasks.junit.TestResult.parse(TestResult.java:154)
	at hudson.tasks.junit.TestResult.<init>(TestResult.java:126)
	at hudson.tasks.junit.JUnitParser$ParseResultCallable.invoke(JUnitParser.java:132)
	at hudson.tasks.junit.JUnitParser$ParseResultCallable.invoke(JUnitParser.java:107)
	at hudson.FilePath$FileCallableWrapper.call(FilePath.java:2772)
	at hudson.remoting.UserRequest.perform(UserRequest.java:152)
	at hudson.remoting.UserRequest.perform(UserRequest.java:50)
	at hudson.remoting.Request$2.run(Request.java:332)
	at hudson.remoting.InterceptingExecutorService$1.call(InterceptingExecutorService.java:68)
	at java.util.concurrent.FutureTask.run(Unknown Source)
	at java.util.concurrent.ThreadPoolExecutor.runWorker(Unknown Source)
	at java.util.concurrent.ThreadPoolExecutor$Worker.run(Unknown Source)
	at java.lang.Thread.run(Unknown Source)


FAILED:  TEST-org.apache.lucene.codecs.lucene50.TestLucene50StoredFieldsFormatHighCompression.xml.[failed-to-read]

Error Message:


Stack Trace:
Failed to read test report file C:\Users\jenkins\workspace\Lucene-Solr-6.0-Windows\lucene\build\core\test\TEST-org.apache.lucene.codecs.lucene50.TestLucene50StoredFieldsFormatHighCompression.xml
org.dom4j.DocumentException: Error on line 3 of document file:///C:/Users/jenkins/workspace/Lucene-Solr-6.0-Windows/lucene/build/core/test/TEST-org.apache.lucene.codecs.lucene50.TestLucene50StoredFieldsFormatHighCompression.xml : XML document structures must start and end within the same entity. Nested exception: XML document structures must start and end within the same entity.
	at org.dom4j.io.SAXReader.read(SAXReader.java:482)
	at org.dom4j.io.SAXReader.read(SAXReader.java:264)
	at hudson.tasks.junit.SuiteResult.parse(SuiteResult.java:126)
	at hudson.tasks.junit.TestResult.parse(TestResult.java:301)
	at hudson.tasks.junit.TestResult.parsePossiblyEmpty(TestResult.java:244)
	at hudson.tasks.junit.TestResult.parse(TestResult.java:175)
	at hudson.tasks.junit.TestResult.parse(TestResult.java:154)
	at hudson.tasks.junit.TestResult.<init>(TestResult.java:126)
	at hudson.tasks.junit.JUnitParser$ParseResultCallable.invoke(JUnitParser.java:132)
	at hudson.tasks.junit.JUnitParser$ParseResultCallable.invoke(JUnitParser.java:107)
	at hudson.FilePath$FileCallableWrapper.call(FilePath.java:2772)
	at hudson.remoting.UserRequest.perform(UserRequest.java:152)
	at hudson.remoting.UserRequest.perform(UserRequest.java:50)
	at hudson.remoting.Request$2.run(Request.java:332)
	at hudson.remoting.InterceptingExecutorService$1.call(InterceptingExecutorService.java:68)
	at java.util.concurrent.FutureTask.run(Unknown Source)
	at java.util.concurrent.ThreadPoolExecutor.runWorker(Unknown Source)
	at java.util.concurrent.ThreadPoolExecutor$Worker.run(Unknown Source)
	at java.lang.Thread.run(Unknown Source)
Caused by: org.xml.sax.SAXParseException; systemId: file:///C:/Users/jenkins/workspace/Lucene-Solr-6.0-Windows/lucene/build/core/test/TEST-org.apache.lucene.codecs.lucene50.TestLucene50StoredFieldsFormatHighCompression.xml; lineNumber: 3; columnNumber: 50; XML document structures must start and end within the same entity.
	at com.sun.org.apache.xerces.internal.util.ErrorHandlerWrapper.createSAXParseException(Unknown Source)
	at com.sun.org.apache.xerces.internal.util.ErrorHandlerWrapper.fatalError(Unknown Source)
	at com.sun.org.apache.xerces.internal.impl.XMLErrorReporter.reportError(Unknown Source)
	at com.sun.org.apache.xerces.internal.impl.XMLErrorReporter.reportError(Unknown Source)
	at com.sun.org.apache.xerces.internal.impl.XMLScanner.reportFatalError(Unknown Source)
	at com.sun.org.apache.xerces.internal.impl.XMLDocumentFragmentScannerImpl.endEntity(Unknown Source)
	at com.sun.org.apache.xerces.internal.impl.XMLDocumentScannerImpl.endEntity(Unknown Source)
	at com.sun.org.apache.xerces.internal.impl.XMLEntityManager.endEntity(Unknown Source)
	at com.sun.org.apache.xerces.internal.impl.XMLEntityScanner.load(Unknown Source)
	at com.sun.org.apache.xerces.internal.impl.XMLEntityScanner.peekChar(Unknown Source)
	at com.sun.org.apache.xerces.internal.impl.XMLDocumentFragmentScannerImpl$FragmentContentDriver.next(Unknown Source)
	at com.sun.org.apache.xerces.internal.impl.XMLDocumentScannerImpl.next(Unknown Source)
	at com.sun.org.apache.xerces.internal.impl.XMLNSDocumentScannerImpl.next(Unknown Source)
	at com.sun.org.apache.xerces.internal.impl.XMLDocumentFragmentScannerImpl.scanDocument(Unknown Source)
	at com.sun.org.apache.xerces.internal.parsers.XML11Configuration.parse(Unknown Source)
	at com.sun.org.apache.xerces.internal.parsers.XML11Configuration.parse(Unknown Source)
	at com.sun.org.apache.xerces.internal.parsers.XMLParser.parse(Unknown Source)
	at com.sun.org.apache.xerces.internal.parsers.AbstractSAXParser.parse(Unknown Source)
	at com.sun.org.apache.xerces.internal.jaxp.SAXParserImpl$JAXPSAXParser.parse(Unknown Source)
	at org.dom4j.io.SAXReader.read(SAXReader.java:465)
	... 18 more
Nested exception: 
org.xml.sax.SAXParseException; systemId: file:///C:/Users/jenkins/workspace/Lucene-Solr-6.0-Windows/lucene/build/core/test/TEST-org.apache.lucene.codecs.lucene50.TestLucene50StoredFieldsFormatHighCompression.xml; lineNumber: 3; columnNumber: 50; XML document structures must start and end within the same entity.
	at com.sun.org.apache.xerces.internal.util.ErrorHandlerWrapper.createSAXParseException(Unknown Source)
	at com.sun.org.apache.xerces.internal.util.ErrorHandlerWrapper.fatalError(Unknown Source)
	at com.sun.org.apache.xerces.internal.impl.XMLErrorReporter.reportError(Unknown Source)
	at com.sun.org.apache.xerces.internal.impl.XMLErrorReporter.reportError(Unknown Source)
	at com.sun.org.apache.xerces.internal.impl.XMLScanner.reportFatalError(Unknown Source)
	at com.sun.org.apache.xerces.internal.impl.XMLDocumentFragmentScannerImpl.endEntity(Unknown Source)
	at com.sun.org.apache.xerces.internal.impl.XMLDocumentScannerImpl.endEntity(Unknown Source)
	at com.sun.org.apache.xerces.internal.impl.XMLEntityManager.endEntity(Unknown Source)
	at com.sun.org.apache.xerces.internal.impl.XMLEntityScanner.load(Unknown Source)
	at com.sun.org.apache.xerces.internal.impl.XMLEntityScanner.peekChar(Unknown Source)
	at com.sun.org.apache.xerces.internal.impl.XMLDocumentFragmentScannerImpl$FragmentContentDriver.next(Unknown Source)
	at com.sun.org.apache.xerces.internal.impl.XMLDocumentScannerImpl.next(Unknown Source)
	at com.sun.org.apache.xerces.internal.impl.XMLNSDocumentScannerImpl.next(Unknown Source)
	at com.sun.org.apache.xerces.internal.impl.XMLDocumentFragmentScannerImpl.scanDocument(Unknown Source)
	at com.sun.org.apache.xerces.internal.parsers.XML11Configuration.parse(Unknown Source)
	at com.sun.org.apache.xerces.internal.parsers.XML11Configuration.parse(Unknown Source)
	at com.sun.org.apache.xerces.internal.parsers.XMLParser.parse(Unknown Source)
	at com.sun.org.apache.xerces.internal.parsers.AbstractSAXParser.parse(Unknown Source)
	at com.sun.org.apache.xerces.internal.jaxp.SAXParserImpl$JAXPSAXParser.parse(Unknown Source)
	at org.dom4j.io.SAXReader.read(SAXReader.java:465)
	at org.dom4j.io.SAXReader.read(SAXReader.java:264)
	at hudson.tasks.junit.SuiteResult.parse(SuiteResult.java:126)
	at hudson.tasks.junit.TestResult.parse(TestResult.java:301)
	at hudson.tasks.junit.TestResult.parsePossiblyEmpty(TestResult.java:244)
	at hudson.tasks.junit.TestResult.parse(TestResult.java:175)
	at hudson.tasks.junit.TestResult.parse(TestResult.java:154)
	at hudson.tasks.junit.TestResult.<init>(TestResult.java:126)
	at hudson.tasks.junit.JUnitParser$ParseResultCallable.invoke(JUnitParser.java:132)
	at hudson.tasks.junit.JUnitParser$ParseResultCallable.invoke(JUnitParser.java:107)
	at hudson.FilePath$FileCallableWrapper.call(FilePath.java:2772)
	at hudson.remoting.UserRequest.perform(UserRequest.java:152)
	at hudson.remoting.UserRequest.perform(UserRequest.java:50)
	at hudson.remoting.Request$2.run(Request.java:332)
	at hudson.remoting.InterceptingExecutorService$1.call(InterceptingExecutorService.java:68)
	at java.util.concurrent.FutureTask.run(Unknown Source)
	at java.util.concurrent.ThreadPoolExecutor.runWorker(Unknown Source)
	at java.util.concurrent.ThreadPoolExecutor$Worker.run(Unknown Source)
	at java.lang.Thread.run(Unknown Source)


FAILED:  junit.framework.TestSuite.Test mechanism

Error Message:
There is not enough space on the disk

Stack Trace:
java.io.IOException: There is not enough space on the disk
	at java.io.FileOutputStream.writeBytes(Native Method)
	at java.io.FileOutputStream.write(FileOutputStream.java:326)
	at java.io.BufferedOutputStream.flushBuffer(BufferedOutputStream.java:82)
	at java.io.BufferedOutputStream.flush(BufferedOutputStream.java:140)
	at com.carrotsearch.ant.tasks.junit4.slave.EventsOutputStream.flush(EventsOutputStream.java:33)
	at sun.nio.cs.StreamEncoder.implFlush(StreamEncoder.java:297)
	at sun.nio.cs.StreamEncoder.flush(StreamEncoder.java:141)
	at java.io.OutputStreamWriter.flush(OutputStreamWriter.java:229)
	at com.carrotsearch.ant.tasks.junit4.events.Serializer.flush(Serializer.java:127)
	at com.carrotsearch.ant.tasks.junit4.slave.SlaveMain$2.testRunStarted(SlaveMain.java:180)
	at com.carrotsearch.ant.tasks.junit4.slave.OrderedRunNotifier$1.notifyListener(OrderedRunNotifier.java:82)
	at com.carrotsearch.ant.tasks.junit4.slave.OrderedRunNotifier$SafeNotifier.run(OrderedRunNotifier.java:63)
	at com.carrotsearch.ant.tasks.junit4.slave.OrderedRunNotifier$SafeNotifier.run(OrderedRunNotifier.java:49)
	at com.carrotsearch.ant.tasks.junit4.slave.OrderedRunNotifier.fireTestRunStarted(OrderedRunNotifier.java:79)
	at com.carrotsearch.ant.tasks.junit4.slave.SlaveMain.execute(SlaveMain.java:241)
	at com.carrotsearch.ant.tasks.junit4.slave.SlaveMain.main(SlaveMain.java:354)
	at com.carrotsearch.ant.tasks.junit4.slave.SlaveMainSafe.main(SlaveMainSafe.java:10)




Build Log:
[...truncated 1329 lines...]
   [junit4] Suite: org.apache.lucene.codecs.lucene50.TestLucene50CompoundFormat
   [junit4]   2> NOTE: reproduce with: ant test  -Dtestcase=TestLucene50CompoundFormat -Dtests.method=testLargeCFS -Dtests.seed=9B0B762D2273F539 -Dtests.slow=true -Dtests.locale=no -Dtests.timezone=America/Tortola -Dtests.asserts=true -Dtests.file.encoding=ISO-8859-1
   [junit4] ERROR   5.54s J1 | TestLucene50CompoundFormat.testLargeCFS <<<
   [junit4]    > Throwable #1: java.io.IOException: There is not enough space on the disk
   [junit4]    > 	at __randomizedtesting.SeedInfo.seed([9B0B762D2273F539:B9496A77114CC82C]:0)
   [junit4]    > 	at sun.nio.ch.FileDispatcherImpl.write0(Native Method)
   [junit4]    > 	at sun.nio.ch.FileDispatcherImpl.write(FileDispatcherImpl.java:75)
   [junit4]    > 	at sun.nio.ch.IOUtil.writeFromNativeBuffer(IOUtil.java:93)
   [junit4]    > 	at sun.nio.ch.IOUtil.write(IOUtil.java:65)
   [junit4]    > 	at sun.nio.ch.FileChannelImpl.write(FileChannelImpl.java:211)
   [junit4]    > 	at java.nio.channels.Channels.writeFullyImpl(Channels.java:78)
   [junit4]    > 	at java.nio.channels.Channels.writeFully(Channels.java:101)
   [junit4]    > 	at java.nio.channels.Channels.access$000(Channels.java:61)
   [junit4]    > 	at java.nio.channels.Channels$1.write(Channels.java:174)
   [junit4]    > 	at org.apache.lucene.mockfile.FilterOutputStream2.write(FilterOutputStream2.java:62)
   [junit4]    > 	at org.apache.lucene.mockfile.FilterOutputStream2.write(FilterOutputStream2.java:62)
   [junit4]    > 	at org.apache.lucene.store.FSDirectory$FSIndexOutput$1.write(FSDirectory.java:414)
   [junit4]    > 	at java.util.zip.CheckedOutputStream.write(CheckedOutputStream.java:73)
   [junit4]    > 	at java.io.BufferedOutputStream.write(BufferedOutputStream.java:122)
   [junit4]    > 	at org.apache.lucene.store.OutputStreamIndexOutput.writeBytes(OutputStreamIndexOutput.java:53)
   [junit4]    > 	at org.apache.lucene.store.DataOutput.copyBytes(DataOutput.java:278)
   [junit4]    > 	at org.apache.lucene.store.MockIndexOutputWrapper.copyBytes(MockIndexOutputWrapper.java:165)
   [junit4]    > 	at org.apache.lucene.codecs.lucene50.Lucene50CompoundFormat.write(Lucene50CompoundFormat.java:91)
   [junit4]    > 	at org.apache.lucene.index.BaseCompoundFormatTestCase.testLargeCFS(BaseCompoundFormatTestCase.java:177)
   [junit4]    > 	at java.lang.Thread.run(Thread.java:745)
   [junit4]   2> NOTE: leaving temporary files on disk at: C:\Users\jenkins\workspace\Lucene-Solr-6.0-Windows\lucene\build\core\test\J1\temp\lucene.codecs.lucene50.TestLucene50CompoundFormat_9B0B762D2273F539-001
   [junit4]   2> NOTE: test params are: codec=Asserting(Lucene60): {}, docValues:{}, maxPointsInLeafNode=992, maxMBSortInHeap=7.526783984190798, sim=RandomSimilarity(queryNorm=false,coord=yes): {body=IB LL-LZ(0.3)}, locale=no, timezone=America/Tortola
   [junit4]   2> NOTE: Windows 10 10.0 amd64/Oracle Corporation 1.8.0_92 (64-bit)/cpus=3,threads=1,free=215819440,total=421056512
   [junit4]   2> 
   [junit4] Completed [342/414 (1!)] on J1 in 8.58s, 24 tests, 1 error <<< FAILURES!

[...truncated 10 lines...]
   [junit4] Suite: org.apache.lucene.codecs.lucene50.TestLucene50FieldInfoFormat
   [junit4]   2> NOTE: reproduce with: ant test  -Dtestcase=TestLucene50FieldInfoFormat -Dtests.method=testMultiClose -Dtests.seed=9B0B762D2273F539 -Dtests.slow=true -Dtests.locale=ja-JP -Dtests.timezone=Etc/GMT-0 -Dtests.asserts=true -Dtests.file.encoding=ISO-8859-1
   [junit4] ERROR   0.01s J1 | TestLucene50FieldInfoFormat.testMultiClose <<<
   [junit4]    > Throwable #1: java.nio.file.FileSystemException: C:\Users\jenkins\workspace\Lucene-Solr-6.0-Windows\lucene\build\core\test\J1\temp\lucene.codecs.lucene50.TestLucene50FieldInfoFormat_9B0B762D2273F539-001\justSoYouGetSomeChannelErrors-001\_0_Lucene50_0.pos: There is not enough space on the disk.
   [junit4]    > 	at __randomizedtesting.SeedInfo.seed([9B0B762D2273F539:1F369A163D119C21]:0)
   [junit4]    > 	at sun.nio.fs.WindowsException.translateToIOException(WindowsException.java:86)
   [junit4]    > 	at sun.nio.fs.WindowsException.rethrowAsIOException(WindowsException.java:97)
   [junit4]    > 	at sun.nio.fs.WindowsException.rethrowAsIOException(WindowsException.java:102)
   [junit4]    > 	at sun.nio.fs.WindowsFileSystemProvider.newByteChannel(WindowsFileSystemProvider.java:230)
   [junit4]    > 	at java.nio.file.spi.FileSystemProvider.newOutputStream(FileSystemProvider.java:434)
   [junit4]    > 	at org.apache.lucene.mockfile.FilterFileSystemProvider.newOutputStream(FilterFileSystemProvider.java:197)
   [junit4]    > 	at org.apache.lucene.mockfile.FilterFileSystemProvider.newOutputStream(FilterFileSystemProvider.java:197)
   [junit4]    > 	at org.apache.lucene.mockfile.HandleTrackingFS.newOutputStream(HandleTrackingFS.java:129)
   [junit4]    > 	at org.apache.lucene.mockfile.HandleTrackingFS.newOutputStream(HandleTrackingFS.java:129)
   [junit4]    > 	at org.apache.lucene.mockfile.FilterFileSystemProvider.newOutputStream(FilterFileSystemProvider.java:197)
   [junit4]    > 	at java.nio.file.Files.newOutputStream(Files.java:216)
   [junit4]    > 	at org.apache.lucene.store.FSDirectory$FSIndexOutput.<init>(FSDirectory.java:408)
   [junit4]    > 	at org.apache.lucene.store.FSDirectory$FSIndexOutput.<init>(FSDirectory.java:404)
   [junit4]    > 	at org.apache.lucene.store.FSDirectory.createOutput(FSDirectory.java:253)
   [junit4]    > 	at org.apache.lucene.store.MockDirectoryWrapper.createOutput(MockDirectoryWrapper.java:653)
   [junit4]    > 	at org.apache.lucene.codecs.lucene50.Lucene50PostingsWriter.<init>(Lucene50PostingsWriter.java:116)
   [junit4]    > 	at org.apache.lucene.codecs.lucene50.Lucene50PostingsFormat.fieldsConsumer(Lucene50PostingsFormat.java:424)
   [junit4]    > 	at org.apache.lucene.codecs.perfield.PerFieldPostingsFormat$FieldsWriter.write(PerFieldPostingsFormat.java:196)
   [junit4]    > 	at org.apache.lucene.index.BaseIndexFileFormatTestCase.testMultiClose(BaseIndexFileFormatTestCase.java:322)
   [junit4]    > 	at org.apache.lucene.index.BaseFieldInfoFormatTestCase.testMultiClose(BaseFieldInfoFormatTestCase.java:49)
   [junit4]    > 	at java.lang.Thread.run(Thread.java:745)
   [junit4]   2> NOTE: leaving temporary files on disk at: C:\Users\jenkins\workspace\Lucene-Solr-6.0-Windows\lucene\build\core\test\J1\temp\lucene.codecs.lucene50.TestLucene50FieldInfoFormat_9B0B762D2273F539-001
   [junit4]   2> NOTE: test params are: codec=Asserting(Lucene60): {}, docValues:{}, maxPointsInLeafNode=1691, maxMBSortInHeap=6.522707091544174, sim=RandomSimilarity(queryNorm=true,coord=yes): {}, locale=ja-JP, timezone=Etc/GMT-0
   [junit4]   2> NOTE: Windows 10 10.0 amd64/Oracle Corporation 1.8.0_92 (64-bit)/cpus=3,threads=1,free=166810672,total=421056512
   [junit4]   2> 
   [junit4] Completed [343/414 (2!)] on J1 in 0.11s, 11 tests, 1 error <<< FAILURES!

[...truncated 14 lines...]
   [junit4] Suite: org.apache.lucene.codecs.lucene50.TestLucene50StoredFieldsFormatHighCompression
   [junit4] IGNOR/A 0.00s J0 | TestLucene50StoredFieldsFormatHighCompression.testBigDocuments
   [junit4]    > Assumption #1: 'nightly' test group is disabled (@Nightly())
   [junit4]   2> NOTE: reproduce with: ant test  -Dtestcase=TestLucene50StoredFieldsFormatHighCompression -Dtests.method=testMultiClose -Dtests.seed=9B0B762D2273F539 -Dtests.slow=true -Dtests.locale=es-MX -Dtests.timezone=MET -Dtests.asserts=true -Dtests.file.encoding=ISO-8859-1
   [junit4] ERROR   1.55s J0 | TestLucene50StoredFieldsFormatHighCompression.testMultiClose <<<
   [junit4]    > Throwable #1: java.nio.file.FileSystemException: C:\Users\jenkins\workspace\Lucene-Solr-6.0-Windows\lucene\build\core\test\J0\temp\lucene.codecs.lucene50.TestLucene50StoredFieldsFormatHighCompression_9B0B762D2273F539-001\justSoYouGetSomeChannelErrors-001\_0_Lucene50_0.pos: There is not enough space on the disk.
   [junit4]    > 	at __randomizedtesting.SeedInfo.seed([9B0B762D2273F539:1F369A163D119C21]:0)
   [junit4]    > 	at sun.nio.fs.WindowsException.translateToIOException(WindowsException.java:86)
   [junit4]    > 	at sun.nio.fs.WindowsException.rethrowAsIOException(WindowsException.java:97)
   [junit4]    > 	at sun.nio.fs.WindowsException.rethrowAsIOException(WindowsException.java:102)
   [junit4]    > 	at sun.nio.fs.WindowsFileSystemProvider.newByteChannel(WindowsFileSystemProvider.java:230)
   [junit4]    > 	at java.nio.file.spi.FileSystemProvider.newOutputStream(FileSystemProvider.java:434)
   [junit4]    > 	at org.apache.lucene.mockfile.FilterFileSystemProvider.newOutputStream(FilterFileSystemProvider.java:197)
   [junit4]    > 	at org.apache.lucene.mockfile.FilterFileSystemProvider.newOutputStream(FilterFileSystemProvider.java:197)
   [junit4]    > 	at org.apache.lucene.mockfile.HandleTrackingFS.newOutputStream(HandleTrackingFS.java:129)
   [junit4]    > 	at org.apache.lucene.mockfile.HandleTrackingFS.newOutputStream(HandleTrackingFS.java:129)
   [junit4]    > 	at org.apache.lucene.mockfile.FilterFileSystemProvider.newOutputStream(FilterFileSystemProvider.java:197)
   [junit4]    > 	at java.nio.file.Files.newOutputStream(Files.java:216)
   [junit4]    > 	at org.apache.lucene.store.FSDirectory$FSIndexOutput.<init>(FSDirectory.java:408)
   [junit4]    > 	at org.apache.lucene.store.FSDirectory$FSIndexOutput.<init>(FSDirectory.java:404)
   [junit4]    > 	at org.apache.lucene.store.FSDirectory.createOutput(FSDirectory.java:253)
   [junit4]    > 	at org.apache.lucene.store.MockDirectoryWrapper.createOutput(MockDirectoryWrapper.java:653)
   [junit4]    > 	at org.apache.lucene.codecs.lucene50.Lucene50PostingsWriter.<init>(Lucene50PostingsWriter.java:116)
   [junit4]    > 	at org.apache.lucene.codecs.lucene50.Lucene50PostingsFormat.fieldsConsumer(Lucene50PostingsFormat.java:424)
   [junit4]    > 	at org.apache.lucene.codecs.perfield.PerFieldPostingsFormat$FieldsWriter.write(PerFieldPostingsFormat.java:196)
   [junit4]    > 	at org.apache.lucene.index.BaseIndexFileFormatTestCase.testMultiClose(BaseIndexFileFormatTestCase.java:322)
   [junit4]    > 	at org.apache.lucene.index.BaseStoredFieldsFormatTestCase.testMultiClose(BaseStoredFieldsFormatTestCase.java:66)
   [junit4]    > 	at java.lang.Thread.run(Thread.java:745)
   [junit4]   2> NOTE: leaving temporary files on disk at: C:\Users\jenkins\workspace\Lucene-Solr-6.0-Windows\lucene\build\core\test\J0\temp\lucene.codecs.lucene50.TestLucene50StoredFieldsFormatHighCompression_9B0B762D2273F539-001
   [junit4]   2> NOTE: test params are: codec=Lucene60, sim=ClassicSimilarity, locale=es-MX, timezone=MET
   [junit4]   2> NOTE: Windows 10 10.0 amd64/Oracle Corporation 1.8.0_92 (64-bit)/cpus=3,threads=1,free=130875816,total=161370112
   [junit4]   2> 
   [junit4] Completed [345/414 (3!)] on J0 in 3.47s, 19 tests, 1 error, 1 skipped <<< FAILURES!

[...truncated 43 lines...]
   [junit4] JVM J1: stderr was not empty, see: C:\Users\jenkins\workspace\Lucene-Solr-6.0-Windows\lucene\build\core\test\temp\junit4-J1-20160520_235719_305.syserr
   [junit4] >>> JVM J1 emitted unexpected output (verbatim) ----
   [junit4] WARN: Unhandled exception in event serialization. -> java.security.PrivilegedActionException: java.io.IOException: There is not enough space on the disk
   [junit4] 	at java.security.AccessController.doPrivileged(Native Method)
   [junit4] 	at com.carrotsearch.ant.tasks.junit4.events.Serializer.flushQueue(Serializer.java:96)
   [junit4] 	at com.carrotsearch.ant.tasks.junit4.events.Serializer.serialize(Serializer.java:81)
   [junit4] 	at com.carrotsearch.ant.tasks.junit4.slave.SlaveMain$3$2.write(SlaveMain.java:456)
   [junit4] 	at java.io.BufferedOutputStream.flushBuffer(BufferedOutputStream.java:82)
   [junit4] 	at java.io.BufferedOutputStream.flush(BufferedOutputStream.java:140)
   [junit4] 	at java.io.PrintStream.flush(PrintStream.java:338)
   [junit4] 	at java.io.FilterOutputStream.flush(FilterOutputStream.java:140)
   [junit4] 	at java.io.PrintStream.write(PrintStream.java:482)
   [junit4] 	at sun.nio.cs.StreamEncoder.writeBytes(StreamEncoder.java:221)
   [junit4] 	at sun.nio.cs.StreamEncoder.implFlushBuffer(StreamEncoder.java:291)
   [junit4] 	at sun.nio.cs.StreamEncoder.flushBuffer(StreamEncoder.java:104)
   [junit4] 	at java.io.OutputStreamWriter.flushBuffer(OutputStreamWriter.java:185)
   [junit4] 	at java.io.PrintStream.write(PrintStream.java:527)
   [junit4] 	at java.io.PrintStream.print(PrintStream.java:669)
   [junit4] 	at java.io.PrintStream.println(PrintStream.java:806)
   [junit4] 	at org.apache.lucene.util.RunListenerPrintReproduceInfo.printDebuggingInformation(RunListenerPrintReproduceInfo.java:144)
   [junit4] 	at org.apache.lucene.util.RunListenerPrintReproduceInfo.testRunFinished(RunListenerPrintReproduceInfo.java:118)
   [junit4] 	at com.carrotsearch.randomizedtesting.RandomizedRunner.runSuite(RandomizedRunner.java:706)
   [junit4] 	at com.carrotsearch.randomizedtesting.RandomizedRunner.access$200(RandomizedRunner.java:140)
   [junit4] 	at com.carrotsearch.randomizedtesting.RandomizedRunner$2.run(RandomizedRunner.java:591)
   [junit4] Caused by: java.io.IOException: There is not enough space on the disk
   [junit4] 	at java.io.FileOutputStream.writeBytes(Native Method)
   [junit4] 	at java.io.FileOutputStream.write(FileOutputStream.java:326)
   [junit4] 	at java.io.BufferedOutputStream.flushBuffer(BufferedOutputStream.java:82)
   [junit4] 	at java.io.BufferedOutputStream.
   [junit4] write(BufferedOutputStream.java:121)
   [junit4] 	at com.carrotsearch.ant.tasks.junit4.slave.EventsOutputStream.write(EventsOutputStream.java:28)
   [junit4] 	at sun.nio.cs.StreamEncoder.writeBytes(StreamEncoder.java:221)
   [junit4] 	at sun.nio.cs.StreamEncoder.implWrite(StreamEncoder.java:282)
   [junit4] 	at sun.nio.cs.StreamEncoder.write(StreamEncoder.java:125)
   [junit4] 	at sun.nio.cs.StreamEncoder.write(StreamEncoder.java:135)
   [junit4] 	at java.io.OutputStreamWriter.write(OutputStreamWriter.java:220)
   [junit4] 	at com.carrotsearch.ant.tasks.junit4.gson.stream.JsonWriter.string(JsonWriter.java:571)
   [junit4] 	at com.carrotsearch.ant.tasks.junit4.gson.stream.JsonWriter.value(JsonWriter.java:414)
   [junit4] 	at com.carrotsearch.ant.tasks.junit4.events.AbstractEvent.writeBinaryProperty(AbstractEvent.java:36)
   [junit4] 	at com.carrotsearch.ant.tasks.junit4.events.AppendStdErrEvent.serialize(AppendStdErrEvent.java:30)
   [junit4] 	at com.carrotsearch.ant.tasks.junit4.events.Serializer$2.run(Serializer.java:101)
   [junit4] 	at com.carrotsearch.ant.tasks.junit4.events.Serializer$2.run(Serializer.java:96)
   [junit4] 	... 21 more
   [junit4] <<< JVM J1: EOF ----

   [junit4] Suite: org.apache.lucene.codecs.lucene50.TestLucene50TermVectorsFormat
   [junit4] ERROR   0.00s J0 | TestLucene50TermVectorsFormat (suite) <<<
   [junit4]    > Throwable #1: java.io.IOException: There is not enough space on the disk
   [junit4]    > 	at java.io.FileOutputStream.writeBytes(Native Method)
   [junit4]    > 	at java.io.FileOutputStream.write(FileOutputStream.java:326)
   [junit4]    > 	at java.io.BufferedOutputStream.flushBuffer(BufferedOutputStream.java:82)
   [junit4]    > 	at java.io.BufferedOutputStream.flush(BufferedOutputStream.java:140)
   [junit4]    > 	at com.carrotsearch.ant.tasks.junit4.slave.EventsOutputStream.flush(EventsOutputStream.java:33)
   [junit4]    > 	at sun.nio.cs.StreamEncoder.implFlush(StreamEncoder.java:297)
   [junit4]    > 	at sun.nio.cs.StreamEncoder.flush(StreamEncoder.java:141)
   [junit4]    > 	at java.io.OutputStreamWriter.flush(OutputStreamWriter.java:229)
   [junit4]    > 	at com.carrotsearch.ant.tasks.junit4.events.Serializer.flush(Serializer.java:127)
   [junit4]    > 	at com.carrotsearch.ant.tasks.junit4.slave.OrderedRunNotifier$1.notifyListener(OrderedRunNotifier.java:82)
   [junit4]    > 	at com.carrotsearch.ant.tasks.junit4.slave.OrderedRunNotifier$SafeNotifier.run(OrderedRunNotifier.java:63)
   [junit4]    > 	at com.carrotsearch.ant.tasks.junit4.slave.OrderedRunNotifier$SafeNotifier.run(OrderedRunNotifier.java:49)
   [junit4]    > 	at com.carrotsearch.ant.tasks.junit4.slave.OrderedRunNotifier.fireTestRunStarted(OrderedRunNotifier.java:79)
   [junit4] Completed [346/414 (4!)] on J0 in 9.38s, 17 tests, 1 error <<< FAILURES!

[...truncated 1 lines...]
   [junit4] JVM J0: stderr was not empty, see: C:\Users\jenkins\workspace\Lucene-Solr-6.0-Windows\lucene\build\core\test\temp\junit4-J0-20160520_235719_304.syserr
   [junit4] >>> JVM J0 emitted unexpected output (verbatim) ----
   [junit4] WARN: Unhandled exception in event serialization. -> java.security.PrivilegedActionException: java.io.IOException: There is not enough space on the disk
   [junit4] 	at java.security.AccessController.doPrivileged(Native Method)
   [junit4] 	at com.carrotsearch.ant.tasks.junit4.events.Serializer.flushQueue(Serializer.java:96)
   [junit4] 	at com.carrotsearch.ant.tasks.junit4.events.Serializer.serialize(Serializer.java:81)
   [junit4] 	at com.carrotsearch.ant.tasks.junit4.slave.RunListenerEmitter.testFailure(RunListenerEmitter.java:54)
   [junit4] 	at com.carrotsearch.ant.tasks.junit4.slave.NoExceptionRunListenerDecorator.testFailure(NoExceptionRunListenerDecorator.java:55)
   [junit4] 	at com.carrotsearch.ant.tasks.junit4.slave.BeforeAfterRunListenerDecorator.testFailure(BeforeAfterRunListenerDecorator.java:60)
   [junit4] 	at com.carrotsearch.ant.tasks.junit4.slave.OrderedRunNotifier$4.notifyListener(OrderedRunNotifier.java:129)
   [junit4] 	at com.carrotsearch.ant.tasks.junit4.slave.OrderedRunNotifier$SafeNotifier.run(OrderedRunNotifier.java:63)
   [junit4] 	at com.carrotsearch.ant.tasks.junit4.slave.OrderedRunNotifier.fireTestFailure(OrderedRunNotifier.java:126)
   [junit4] 	at com.carrotsearch.randomizedtesting.ThreadLeakControl$SubNotifier.fireTestFailure(ThreadLeakControl.java:183)
   [junit4] 	at com.carrotsearch.randomizedtesting.RandomizedRunner.fireTestFailure(RandomizedRunner.java:798)
   [junit4] 	at com.carrotsearch.randomizedtesting.RandomizedRunner.runSingleTest(RandomizedRunner.java:886)
   [junit4] 	at com.carrotsearch.randomizedtesting.RandomizedRunner$5.evaluate(RandomizedRunner.java:781)
   [junit4] 	at com.carrotsearch.randomizedtesting.RandomizedRunner$6.evaluate(RandomizedRunner.java:816)
   [junit4] 	at com.carrotsearch.randomizedtesting.RandomizedRunner$7.evaluate(RandomizedRunner.java:827)
   [junit4] 	at org.apache.lucene.util.AbstractBeforeAfterRule$1.evaluate(AbstractBeforeAfterRule.java:45)
   [junit4] 	at com.carrotsearch.randomizedtesting.rules.StatementAdapter.evaluate(StatementAdapter.java:36)
   [junit4] 	at org.apache.lucene.util.TestRuleStoreClassName$1.evaluate(TestRuleStoreClassName.java:41)
   [junit4] 	at com.carrotsearch.randomizedtesting.rules.NoShadowingOrOverridesOnMethodsRu
   [junit4] le$1.evaluate(NoShadowingOrOverridesOnMethodsRule.java:40)
   [junit4] 	at com.carrotsearch.randomizedtesting.rules.NoShadowingOrOverridesOnMethodsRule$1.evaluate(NoShadowingOrOverridesOnMethodsRule.java:40)
   [junit4] 	at com.carrotsearch.randomizedtesting.rules.StatementAdapter.evaluate(StatementAdapter.java:36)
   [junit4] 	at com.carrotsearch.randomizedtesting.rules.StatementAdapter.evaluate(StatementAdapter.java:36)
   [junit4] 	at com.carrotsearch.randomizedtesting.rules.StatementAdapter.evaluate(StatementAdapter.java:36)
   [junit4] 	at org.apache.lucene.util.TestRuleAssertionsRequired$1.evaluate(TestRuleAssertionsRequired.java:53)
   [junit4] 	at org.apache.lucene.util.TestRuleMarkFailure$1.evaluate(TestRuleMarkFailure.java:47)
   [junit4] 	at org.apache.lucene.util.TestRuleIgnoreAfterMaxFailures$1.evaluate(TestRuleIgnoreAfterMaxFailures.java:64)
   [junit4] 	at org.apache.lucene.util.TestRuleIgnoreTestSuites$1.evaluate(TestRuleIgnoreTestSuites.java:54)
   [junit4] 	at com.carrotsearch.randomizedtesting.rules.StatementAdapter.evaluate(StatementAdapter.java:36)
   [junit4] 	at com.carrotsearch.randomizedtesting.ThreadLeakControl$StatementRunner.run(ThreadLeakControl.java:367)
   [junit4] 	at java.lang.Thread.run(Thread.java:745)
   [junit4] Caused by: java.io.IOException: There is not enough space on the disk
   [junit4] 	at java.io.FileOutputStream.writeBytes(Native Method)
   [junit4] 	at java.io.FileOutputStream.write(FileOutputStream.java:326)
   [junit4] 	at java.io.BufferedOutputStream.write(BufferedOutputStream.java:122)
   [junit4] 	at com.carrotsearch.ant.tasks.junit4.slave.EventsOutputStream.write(EventsOutputStream.java:28)
   [junit4] 	at sun.nio.cs.StreamEncoder.writeBytes(StreamEncoder.java:221)
   [junit4] 	at sun.nio.cs.StreamEncoder.implWrite(StreamEncoder.java:282)
   [junit4] 	at sun.nio.cs.StreamEncoder.write(StreamEncoder.java:125)
   [junit4] 	at sun.nio.cs.StreamEncoder.write(StreamEncoder.java:135)
   [junit4] 	at java.io.OutputStreamWriter.write(OutputStreamWriter.java:220)
   [junit4] 	at com.carrotsearch.ant.tasks.junit4.gson.stream.JsonWriter.string(JsonWriter.java:565)
   [junit4] 	at com.carrotsearch.ant.tasks.junit4.gson.stream.JsonWriter.value(JsonWriter.java:414)
   [junit4] 	at com.carrotsearch.ant.tasks.junit4.events.FailureEvent
   [junit4] .serialize(FailureEvent.java:46)
   [junit4] 	at com.carrotsearch.ant.tasks.junit4.events.Serializer$2.run(Serializer.java:101)
   [junit4] 	at com.carrotsearch.ant.tasks.junit4.events.Serializer$2.run(Serializer.java:96)
   [junit4] 	... 30 more
   [junit4] <<< JVM J0: EOF ----

[...truncated 10 lines...]
   [junit4] ERROR: JVM J0 ended with an exception, command line: C:\Users\jenkins\tools\java\64bit\jdk1.8.0_92\jre\bin\java.exe -XX:-UseCompressedOops -XX:+UseSerialGC -XX:+HeapDumpOnOutOfMemoryError -XX:HeapDumpPath=C:\Users\jenkins\workspace\Lucene-Solr-6.0-Windows\heapdumps -ea -esa -Dtests.prefix=tests -Dtests.seed=9B0B762D2273F539 -Xmx512M -Dtests.iters= -Dtests.verbose=false -Dtests.infostream=false -Dtests.codec=random -Dtests.postingsformat=random -Dtests.docvaluesformat=random -Dtests.locale=random -Dtests.timezone=random -Dtests.directory=random -Dtests.linedocsfile=europarl.lines.txt.gz -Dtests.luceneMatchVersion=6.0.1 -Dtests.cleanthreads=perMethod -Djava.util.logging.config.file=C:\Users\jenkins\workspace\Lucene-Solr-6.0-Windows\lucene\tools\junit4\logging.properties -Dtests.nightly=false -Dtests.weekly=false -Dtests.monster=false -Dtests.slow=true -Dtests.asserts=true -Dtests.multiplier=1 -DtempDir=./temp -Djava.io.tmpdir=./temp -Djunit4.tempDir=C:\Users\jenkins\workspace\Lucene-Solr-6.0-Windows\lucene\build\core\test\temp -Dcommon.dir=C:\Users\jenkins\workspace\Lucene-Solr-6.0-Windows\lucene -Dclover.db.dir=C:\Users\jenkins\workspace\Lucene-Solr-6.0-Windows\lucene\build\clover\db -Djava.security.policy=C:\Users\jenkins\workspace\Lucene-Solr-6.0-Windows\lucene\tools\junit4\tests.policy -Dtests.LUCENE_VERSION=6.0.1 -Djetty.testMode=1 -Djetty.insecurerandom=1 -Dsolr.directoryFactory=org.apache.solr.core.MockDirectoryFactory -Djava.awt.headless=true -Djdk.map.althashing.threshold=0 -Djunit4.childvm.cwd=C:\Users\jenkins\workspace\Lucene-Solr-6.0-Windows\lucene\build\core\test\J0 -Djunit4.childvm.id=0 -Djunit4.childvm.count=2 -Dtests.leaveTemporary=false -Dtests.filterstacks=true -Djava.security.manager=org.apache.lucene.util.TestSecurityManager -Dfile.encoding=ISO-8859-1 -classpath C:\Users\jenkins\workspace\Lucene-Solr-6.0-Windows\lucene\build\codecs\classes\java;C:\Users\jenkins\workspace\Lucene-Solr-6.0-Windows\lucene\build\test-framework\classes\java;C:\Users\jenkins\workspace\Lucene-Solr-6.0-Windows\lucene\test-framework\lib\junit-4.10.jar;C:\Users\jenkins\workspace\Lucene-Solr-6.0-Windows\lucene\test-framework\lib\randomizedtesting-runner-2.3.2.jar;C:\Users\jenkins\workspace\Lucene-Solr-6.0-Windows\lucene\build\core\classes\java;C:\Users\jenkins\workspace\Lucene-Solr-6.0-Windows\lucene\build\core\classes\test;C:\Users\jenkins\tools\hudson.tasks.Ant_AntInstallation\ANT_1.8.2\lib\ant-launcher.jar;C:\Users\jenkins\.ant\lib\ivy-2.3.0.jar;C:\Users\jenkins\tools\hudson.tasks.Ant_AntInstallation\ANT_1.8.2\lib\ant-antlr.jar;C:\Users\jenkins\tools\hudson.tasks.Ant_AntInstallation\ANT_1.8.2\lib\ant-apache-bcel.jar;C:\Users\jenkins\tools\hudson.tasks.Ant_AntInstallation\ANT_1.8.2\lib\ant-apache-bsf.jar;C:\Users\jenkins\tools\hudson.tasks.Ant_AntInstallation\ANT_1.8.2\lib\ant-apache-log4j.jar;C:\Users\jenkins\tools\hudson.tasks.Ant_AntInstallation\ANT_1.8.2\lib\ant-apache-oro.jar;C:\Users\jenkins\tools\hudson.tasks.Ant_AntInstallation\ANT_1.8.2\lib\ant-apache-regexp.jar;C:\Users\jenkins\tools\hudson.tasks.Ant_AntInstallation\ANT_1.8.2\lib\ant-apache-resolver.jar;C:\Users\jenkins\tools\hudson.tasks.Ant_AntInstallation\ANT_1.8.2\lib\ant-apache-xalan2.jar;C:\Users\jenkins\tools\hudson.tasks.Ant_AntInstallation\ANT_1.8.2\lib\ant-commons-logging.jar;C:\Users\jenkins\tools\hudson.tasks.Ant_AntInstallation\ANT_1.8.2\lib\ant-commons-net.jar;C:\Users\jenkins\tools\hudson.tasks.Ant_AntInstallation\ANT_1.8.2\lib\ant-jai.jar;C:\Users\jenkins\tools\hudson.tasks.Ant_AntInstallation\ANT_1.8.2\lib\ant-javamail.jar;C:\Users\jenkins\tools\hudson.tasks.Ant_AntInstallation\ANT_1.8.2\lib\ant-jdepend.jar;C:\Users\jenkins\tools\hudson.tasks.Ant_AntInstallation\ANT_1.8.2\lib\ant-jmf.jar;C:\Users\jenkins\tools\hudson.tasks.Ant_AntInstallation\ANT_1.8.2\lib\ant-jsch.jar;C:\Users\jenkins\tools\hudson.tasks.Ant_AntInstallation\ANT_1.8.2\lib\ant-junit.jar;C:\Users\jenkins\tools\hudson.tasks.Ant_AntInstallation\ANT_1.8.2\lib\ant-junit4.jar;C:\Users\jenkins\tools\hudson.tasks.Ant_AntInstallation\ANT_1.8.2\lib\ant-netrexx.jar;C:\Users\jenkins\tools\hudson.tasks.Ant_AntInstallation\ANT_1.8.2\lib\ant-swing.jar;C:\Users\jenkins\tools\hudson.tasks.Ant_AntInstallation\ANT_1.8.2\lib\ant-testutil.jar;C:\Users\jenkins\tools\hudson.tasks.Ant_AntInstallation\ANT_1.8.2\lib\ant.jar;C:\Users\jenkins\tools\java\64bit\jdk1.8.0_92\lib\tools.jar;C:\Users\jenkins\.ivy2\cache\com.carrotsearch.randomizedtesting\junit4-ant\jars\junit4-ant-2.3.2.jar com.carrotsearch.ant.tasks.junit4.slave.SlaveMainSafe -eventsfile C:\Users\jenkins\workspace\Lucene-Solr-6.0-Windows\lucene\build\core\test\temp\junit4-J0-20160520_235719_304.events @C:\Users\jenkins\workspace\Lucene-Solr-6.0-Windows\lucene\build\core\test\temp\junit4-J0-20160520_235719_304.suites -stdin
   [junit4] ERROR: JVM J0 ended with an exception: Quit event not received from the forked process? This may indicate JVM crash or runner bugs.
   [junit4] 	at com.carrotsearch.ant.tasks.junit4.JUnit4.executeSlave(JUnit4.java:1501)
   [junit4] 	at com.carrotsearch.ant.tasks.junit4.JUnit4.access$000(JUnit4.java:121)
   [junit4] 	at com.carrotsearch.ant.tasks.junit4.JUnit4$2.call(JUnit4.java:955)
   [junit4] 	at com.carrotsearch.ant.tasks.junit4.JUnit4$2.call(JUnit4.java:952)
   [junit4] 	at java.util.concurrent.FutureTask.run(FutureTask.java:266)
   [junit4] 	at java.util.concurrent.ThreadPoolExecutor.runWorker(ThreadPoolExecutor.java:1142)
   [junit4] 	at java.util.concurrent.ThreadPoolExecutor$Worker.run(ThreadPoolExecutor.java:617)
   [junit4] 	at java.lang.Thread.run(Thread.java:745)
   [junit4] ERROR: JVM J1 ended with an exception, command line: C:\Users\jenkins\tools\java\64bit\jdk1.8.0_92\jre\bin\java.exe -XX:-UseCompressedOops -XX:+UseSerialGC -XX:+HeapDumpOnOutOfMemoryError -XX:HeapDumpPath=C:\Users\jenkins\workspace\Lucene-Solr-6.0-Windows\heapdumps -ea -esa -Dtests.prefix=tests -Dtests.seed=9B0B762D2273F539 -Xmx512M -Dtests.iters= -Dtests.verbose=false -Dtests.infostream=false -Dtests.codec=random -Dtests.postingsformat=random -Dtests.docvaluesformat=random -Dtests.locale=random -Dtests.timezone=random -Dtests.directory=random -Dtests.linedocsfile=europarl.lines.txt.gz -Dtests.luceneMatchVersion=6.0.1 -Dtests.cleanthreads=perMethod -Djava.util.logging.config.file=C:\Users\jenkins\workspace\Lucene-Solr-6.0-Windows\lucene\tools\junit4\logging.properties -Dtests.nightly=false -Dtests.weekly=false -Dtests.monster=false -Dtests.slow=true -Dtests.asserts=true -Dtests.multiplier=1 -DtempDir=./temp -Djava.io.tmpdir=./temp -Djunit4.tempDir=C:\Users\jenkins\workspace\Lucene-Solr-6.0-Windows\lucene\build\core\test\temp -Dcommon.dir=C:\Users\jenkins\workspace\Lucene-Solr-6.0-Windows\lucene -Dclover.db.dir=C:\Users\jenkins\workspace\Lucene-Solr-6.0-Windows\lucene\build\clover\db -Djava.security.policy=C:\Users\jenkins\workspace\Lucene-Solr-6.0-Windows\lucene\tools\junit4\tests.policy -Dtests.LUCENE_VERSION=6.0.1 -Djetty.testMode=1 -Djetty.insecurerandom=1 -Dsolr.directoryFactory=org.apache.solr.core.MockDirectoryFactory -Djava.awt.headless=true -Djdk.map.althashing.threshold=0 -Djunit4.childvm.cwd=C:\Users\jenkins\workspace\Lucene-Solr-6.0-Windows\lucene\build\core\test\J1 -Djunit4.childvm.id=1 -Djunit4.childvm.count=2 -Dtests.leaveTemporary=false -Dtests.filterstacks=true -Djava.security.manager=org.apache.lucene.util.TestSecurityManager -Dfile.encoding=ISO-8859-1 -classpath C:\Users\jenkins\workspace\Lucene-Solr-6.0-Windows\lucene\build\codecs\classes\java;C:\Users\jenkins\workspace\Lucene-Solr-6.0-Windows\lucene\build\test-framework\classes\java;C:\Users\jenkins\workspace\Lucene-Solr-6.0-Windows\lucene\test-framework\lib\junit-4.10.jar;C:\Users\jenkins\workspace\Lucene-Solr-6.0-Windows\lucene\test-framework\lib\randomizedtesting-runner-2.3.2.jar;C:\Users\jenkins\workspace\Lucene-Solr-6.0-Windows\lucene\build\core\classes\java;C:\Users\jenkins\workspace\Lucene-Solr-6.0-Windows\lucene\build\core\classes\test;C:\Users\jenkins\tools\hudson.tasks.Ant_AntInstallation\ANT_1.8.2\lib\ant-launcher.jar;C:\Users\jenkins\.ant\lib\ivy-2.3.0.jar;C:\Users\jenkins\tools\hudson.tasks.Ant_AntInstallation\ANT_1.8.2\lib\ant-antlr.jar;C:\Users\jenkins\tools\hudson.tasks.Ant_AntInstallation\ANT_1.8.2\lib\ant-apache-bcel.jar;C:\Users\jenkins\tools\hudson.tasks.Ant_AntInstallation\ANT_1.8.2\lib\ant-apache-bsf.jar;C:\Users\jenkins\tools\hudson.tasks.Ant_AntInstallation\ANT_1.8.2\lib\ant-apache-log4j.jar;C:\Users\jenkins\tools\hudson.tasks.Ant_AntInstallation\ANT_1.8.2\lib\ant-apache-oro.jar;C:\Users\jenkins\tools\hudson.tasks.Ant_AntInstallation\ANT_1.8.2\lib\ant-apache-regexp.jar;C:\Users\jenkins\tools\hudson.tasks.Ant_AntInstallation\ANT_1.8.2\lib\ant-apache-resolver.jar;C:\Users\jenkins\tools\hudson.tasks.Ant_AntInstallation\ANT_1.8.2\lib\ant-apache-xalan2.jar;C:\Users\jenkins\tools\hudson.tasks.Ant_AntInstallation\ANT_1.8.2\lib\ant-commons-logging.jar;C:\Users\jenkins\tools\hudson.tasks.Ant_AntInstallation\ANT_1.8.2\lib\ant-commons-net.jar;C:\Users\jenkins\tools\hudson.tasks.Ant_AntInstallation\ANT_1.8.2\lib\ant-jai.jar;C:\Users\jenkins\tools\hudson.tasks.Ant_AntInstallation\ANT_1.8.2\lib\ant-javamail.jar;C:\Users\jenkins\tools\hudson.tasks.Ant_AntInstallation\ANT_1.8.2\lib\ant-jdepend.jar;C:\Users\jenkins\tools\hudson.tasks.Ant_AntInstallation\ANT_1.8.2\lib\ant-jmf.jar;C:\Users\jenkins\tools\hudson.tasks.Ant_AntInstallation\ANT_1.8.2\lib\ant-jsch.jar;C:\Users\jenkins\tools\hudson.tasks.Ant_AntInstallation\ANT_1.8.2\lib\ant-junit.jar;C:\Users\jenkins\tools\hudson.tasks.Ant_AntInstallation\ANT_1.8.2\lib\ant-junit4.jar;C:\Users\jenkins\tools\hudson.tasks.Ant_AntInstallation\ANT_1.8.2\lib\ant-netrexx.jar;C:\Users\jenkins\tools\hudson.tasks.Ant_AntInstallation\ANT_1.8.2\lib\ant-swing.jar;C:\Users\jenkins\tools\hudson.tasks.Ant_AntInstallation\ANT_1.8.2\lib\ant-testutil.jar;C:\Users\jenkins\tools\hudson.tasks.Ant_AntInstallation\ANT_1.8.2\lib\ant.jar;C:\Users\jenkins\tools\java\64bit\jdk1.8.0_92\lib\tools.jar;C:\Users\jenkins\.ivy2\cache\com.carrotsearch.randomizedtesting\junit4-ant\jars\junit4-ant-2.3.2.jar com.carrotsearch.ant.tasks.junit4.slave.SlaveMainSafe -eventsfile C:\Users\jenkins\workspace\Lucene-Solr-6.0-Windows\lucene\build\core\test\temp\junit4-J1-20160520_235719_305.events @C:\Users\jenkins\workspace\Lucene-Solr-6.0-Windows\lucene\build\core\test\temp\junit4-J1-20160520_235719_305.suites -stdin
   [junit4] ERROR: JVM J1 ended with an exception: Quit event not received from the forked process? This may indicate JVM crash or runner bugs.
   [junit4] 	at com.carrotsearch.ant.tasks.junit4.JUnit4.executeSlave(JUnit4.java:1501)
   [junit4] 	at com.carrotsearch.ant.tasks.junit4.JUnit4.access$000(JUnit4.java:121)
   [junit4] 	at com.carrotsearch.ant.tasks.junit4.JUnit4$2.call(JUnit4.java:955)
   [junit4] 	at com.carrotsearch.ant.tasks.junit4.JUnit4$2.call(JUnit4.java:952)
   [junit4] 	at java.util.concurrent.FutureTask.run(FutureTask.java:266)
   [junit4] 	at java.util.concurrent.ThreadPoolExecutor.runWorker(ThreadPoolExecutor.java:1142)
   [junit4] 	at java.util.concurrent.ThreadPoolExecutor$Worker.run(ThreadPoolExecutor.java:617)
   [junit4] 	at java.lang.Thread.run(Thread.java:745)

BUILD FAILED
C:\Users\jenkins\workspace\Lucene-Solr-6.0-Windows\build.xml:740: The following error occurred while executing this line:
C:\Users\jenkins\workspace\Lucene-Solr-6.0-Windows\build.xml:684: The following error occurred while executing this line:
C:\Users\jenkins\workspace\Lucene-Solr-6.0-Windows\build.xml:59: The following error occurred while executing this line:
C:\Users\jenkins\workspace\Lucene-Solr-6.0-Windows\lucene\build.xml:50: The following error occurred while executing this line:
C:\Users\jenkins\workspace\Lucene-Solr-6.0-Windows\lucene\common-build.xml:1457: The following error occurred while executing this line:
C:\Users\jenkins\workspace\Lucene-Solr-6.0-Windows\lucene\common-build.xml:1014: At least one slave process threw an exception, first: Quit event not received from the forked process? This may indicate JVM crash or runner bugs.

Total time: 5 minutes 26 seconds
Build step 'Invoke Ant' marked build as failure
Archiving artifacts
[WARNINGS] Skipping publisher since build result is FAILURE
Recording test results
Email was triggered for: Failure - Any
Sending email for trigger: Failure - Any



[JENKINS] Lucene-Solr-6.0-Windows (64bit/jdk1.8.0_92) - Build # 44 - Still Failing!

Posted by Policeman Jenkins Server <je...@thetaphi.de>.
Build: http://jenkins.thetaphi.de/job/Lucene-Solr-6.0-Windows/44/
Java: 64bit/jdk1.8.0_92 -XX:+UseCompressedOops -XX:+UseConcMarkSweepGC

1 tests failed.
FAILED:  org.apache.solr.handler.TestReqParamsAPI.test

Error Message:
Could not get expected value  'null' for path 'response/params/y/p' full output: {   "responseHeader":{     "status":0,     "QTime":0},   "response":{     "znodeVersion":3,     "params":{       "x":{         "a":"A val",         "b":"B val",         "":{"v":0}},       "y":{         "p":"P val",         "q":"Q val",         "":{"v":2}}}}}

Stack Trace:
java.lang.AssertionError: Could not get expected value  'null' for path 'response/params/y/p' full output: {
  "responseHeader":{
    "status":0,
    "QTime":0},
  "response":{
    "znodeVersion":3,
    "params":{
      "x":{
        "a":"A val",
        "b":"B val",
        "":{"v":0}},
      "y":{
        "p":"P val",
        "q":"Q val",
        "":{"v":2}}}}}
	at __randomizedtesting.SeedInfo.seed([21F9A04D1A9C912D:A9AD9F97B460FCD5]:0)
	at org.junit.Assert.fail(Assert.java:93)
	at org.junit.Assert.assertTrue(Assert.java:43)
	at org.apache.solr.core.TestSolrConfigHandler.testForResponseElement(TestSolrConfigHandler.java:458)
	at org.apache.solr.handler.TestReqParamsAPI.testReqParams(TestReqParamsAPI.java:264)
	at org.apache.solr.handler.TestReqParamsAPI.test(TestReqParamsAPI.java:67)
	at sun.reflect.NativeMethodAccessorImpl.invoke0(Native Method)
	at sun.reflect.NativeMethodAccessorImpl.invoke(NativeMethodAccessorImpl.java:62)
	at sun.reflect.DelegatingMethodAccessorImpl.invoke(DelegatingMethodAccessorImpl.java:43)
	at java.lang.reflect.Method.invoke(Method.java:498)
	at com.carrotsearch.randomizedtesting.RandomizedRunner.invoke(RandomizedRunner.java:1764)
	at com.carrotsearch.randomizedtesting.RandomizedRunner$8.evaluate(RandomizedRunner.java:871)
	at com.carrotsearch.randomizedtesting.RandomizedRunner$9.evaluate(RandomizedRunner.java:907)
	at com.carrotsearch.randomizedtesting.RandomizedRunner$10.evaluate(RandomizedRunner.java:921)
	at org.apache.solr.BaseDistributedSearchTestCase$ShardsRepeatRule$ShardsFixedStatement.callStatement(BaseDistributedSearchTestCase.java:992)
	at org.apache.solr.BaseDistributedSearchTestCase$ShardsRepeatRule$ShardsStatement.evaluate(BaseDistributedSearchTestCase.java:967)
	at com.carrotsearch.randomizedtesting.rules.SystemPropertiesRestoreRule$1.evaluate(SystemPropertiesRestoreRule.java:57)
	at org.apache.lucene.util.TestRuleSetupTeardownChained$1.evaluate(TestRuleSetupTeardownChained.java:49)
	at org.apache.lucene.util.AbstractBeforeAfterRule$1.evaluate(AbstractBeforeAfterRule.java:45)
	at org.apache.lucene.util.TestRuleThreadAndTestName$1.evaluate(TestRuleThreadAndTestName.java:48)
	at org.apache.lucene.util.TestRuleIgnoreAfterMaxFailures$1.evaluate(TestRuleIgnoreAfterMaxFailures.java:64)
	at org.apache.lucene.util.TestRuleMarkFailure$1.evaluate(TestRuleMarkFailure.java:47)
	at com.carrotsearch.randomizedtesting.rules.StatementAdapter.evaluate(StatementAdapter.java:36)
	at com.carrotsearch.randomizedtesting.ThreadLeakControl$StatementRunner.run(ThreadLeakControl.java:367)
	at com.carrotsearch.randomizedtesting.ThreadLeakControl.forkTimeoutingTask(ThreadLeakControl.java:809)
	at com.carrotsearch.randomizedtesting.ThreadLeakControl$3.evaluate(ThreadLeakControl.java:460)
	at com.carrotsearch.randomizedtesting.RandomizedRunner.runSingleTest(RandomizedRunner.java:880)
	at com.carrotsearch.randomizedtesting.RandomizedRunner$5.evaluate(RandomizedRunner.java:781)
	at com.carrotsearch.randomizedtesting.RandomizedRunner$6.evaluate(RandomizedRunner.java:816)
	at com.carrotsearch.randomizedtesting.RandomizedRunner$7.evaluate(RandomizedRunner.java:827)
	at com.carrotsearch.randomizedtesting.rules.StatementAdapter.evaluate(StatementAdapter.java:36)
	at com.carrotsearch.randomizedtesting.rules.SystemPropertiesRestoreRule$1.evaluate(SystemPropertiesRestoreRule.java:57)
	at org.apache.lucene.util.AbstractBeforeAfterRule$1.evaluate(AbstractBeforeAfterRule.java:45)
	at com.carrotsearch.randomizedtesting.rules.StatementAdapter.evaluate(StatementAdapter.java:36)
	at org.apache.lucene.util.TestRuleStoreClassName$1.evaluate(TestRuleStoreClassName.java:41)
	at com.carrotsearch.randomizedtesting.rules.NoShadowingOrOverridesOnMethodsRule$1.evaluate(NoShadowingOrOverridesOnMethodsRule.java:40)
	at com.carrotsearch.randomizedtesting.rules.NoShadowingOrOverridesOnMethodsRule$1.evaluate(NoShadowingOrOverridesOnMethodsRule.java:40)
	at com.carrotsearch.randomizedtesting.rules.StatementAdapter.evaluate(StatementAdapter.java:36)
	at com.carrotsearch.randomizedtesting.rules.StatementAdapter.evaluate(StatementAdapter.java:36)
	at com.carrotsearch.randomizedtesting.rules.StatementAdapter.evaluate(StatementAdapter.java:36)
	at org.apache.lucene.util.TestRuleAssertionsRequired$1.evaluate(TestRuleAssertionsRequired.java:53)
	at org.apache.lucene.util.TestRuleMarkFailure$1.evaluate(TestRuleMarkFailure.java:47)
	at org.apache.lucene.util.TestRuleIgnoreAfterMaxFailures$1.evaluate(TestRuleIgnoreAfterMaxFailures.java:64)
	at org.apache.lucene.util.TestRuleIgnoreTestSuites$1.evaluate(TestRuleIgnoreTestSuites.java:54)
	at com.carrotsearch.randomizedtesting.rules.StatementAdapter.evaluate(StatementAdapter.java:36)
	at com.carrotsearch.randomizedtesting.ThreadLeakControl$StatementRunner.run(ThreadLeakControl.java:367)
	at java.lang.Thread.run(Thread.java:745)




Build Log:
[...truncated 11285 lines...]
   [junit4] Suite: org.apache.solr.handler.TestReqParamsAPI
   [junit4]   2> Creating dataDir: C:\Users\jenkins\workspace\Lucene-Solr-6.0-Windows\solr\build\solr-core\test\J1\temp\solr.handler.TestReqParamsAPI_21F9A04D1A9C912D-001\init-core-data-001
   [junit4]   2> 1160267 INFO  (SUITE-TestReqParamsAPI-seed#[21F9A04D1A9C912D]-worker) [    ] o.a.s.SolrTestCaseJ4 Randomized ssl (false) and clientAuth (false)
   [junit4]   2> 1160274 INFO  (SUITE-TestReqParamsAPI-seed#[21F9A04D1A9C912D]-worker) [    ] o.a.s.BaseDistributedSearchTestCase Setting hostContext system property: /
   [junit4]   2> 1160277 INFO  (TEST-TestReqParamsAPI.test-seed#[21F9A04D1A9C912D]) [    ] o.a.s.c.ZkTestServer STARTING ZK TEST SERVER
   [junit4]   2> 1160279 INFO  (Thread-2933) [    ] o.a.s.c.ZkTestServer client port:0.0.0.0/0.0.0.0:0
   [junit4]   2> 1160279 INFO  (Thread-2933) [    ] o.a.s.c.ZkTestServer Starting server
   [junit4]   2> 1160378 INFO  (TEST-TestReqParamsAPI.test-seed#[21F9A04D1A9C912D]) [    ] o.a.s.c.ZkTestServer start zk server on port:65128
   [junit4]   2> 1160378 INFO  (TEST-TestReqParamsAPI.test-seed#[21F9A04D1A9C912D]) [    ] o.a.s.c.c.SolrZkClient Using default ZkCredentialsProvider
   [junit4]   2> 1160379 INFO  (TEST-TestReqParamsAPI.test-seed#[21F9A04D1A9C912D]) [    ] o.a.s.c.c.ConnectionManager Waiting for client to connect to ZooKeeper
   [junit4]   2> 1160383 INFO  (zkCallback-1392-thread-1) [    ] o.a.s.c.c.ConnectionManager Watcher org.apache.solr.common.cloud.ConnectionManager@10582151 name:ZooKeeperConnection Watcher:127.0.0.1:65128 got event WatchedEvent state:SyncConnected type:None path:null path:null type:None
   [junit4]   2> 1160383 INFO  (TEST-TestReqParamsAPI.test-seed#[21F9A04D1A9C912D]) [    ] o.a.s.c.c.ConnectionManager Client is connected to ZooKeeper
   [junit4]   2> 1160383 INFO  (TEST-TestReqParamsAPI.test-seed#[21F9A04D1A9C912D]) [    ] o.a.s.c.c.SolrZkClient Using default ZkACLProvider
   [junit4]   2> 1160383 INFO  (TEST-TestReqParamsAPI.test-seed#[21F9A04D1A9C912D]) [    ] o.a.s.c.c.SolrZkClient makePath: /solr
   [junit4]   2> 1160386 INFO  (TEST-TestReqParamsAPI.test-seed#[21F9A04D1A9C912D]) [    ] o.a.s.c.c.SolrZkClient Using default ZkCredentialsProvider
   [junit4]   2> 1160387 INFO  (TEST-TestReqParamsAPI.test-seed#[21F9A04D1A9C912D]) [    ] o.a.s.c.c.ConnectionManager Waiting for client to connect to ZooKeeper
   [junit4]   2> 1160389 INFO  (zkCallback-1393-thread-1) [    ] o.a.s.c.c.ConnectionManager Watcher org.apache.solr.common.cloud.ConnectionManager@459211e5 name:ZooKeeperConnection Watcher:127.0.0.1:65128/solr got event WatchedEvent state:SyncConnected type:None path:null path:null type:None
   [junit4]   2> 1160389 INFO  (TEST-TestReqParamsAPI.test-seed#[21F9A04D1A9C912D]) [    ] o.a.s.c.c.ConnectionManager Client is connected to ZooKeeper
   [junit4]   2> 1160389 INFO  (TEST-TestReqParamsAPI.test-seed#[21F9A04D1A9C912D]) [    ] o.a.s.c.c.SolrZkClient Using default ZkACLProvider
   [junit4]   2> 1160389 INFO  (TEST-TestReqParamsAPI.test-seed#[21F9A04D1A9C912D]) [    ] o.a.s.c.c.SolrZkClient makePath: /collections/collection1
   [junit4]   2> 1160391 INFO  (TEST-TestReqParamsAPI.test-seed#[21F9A04D1A9C912D]) [    ] o.a.s.c.c.SolrZkClient makePath: /collections/collection1/shards
   [junit4]   2> 1160392 INFO  (TEST-TestReqParamsAPI.test-seed#[21F9A04D1A9C912D]) [    ] o.a.s.c.c.SolrZkClient makePath: /collections/control_collection
   [junit4]   2> 1160394 INFO  (TEST-TestReqParamsAPI.test-seed#[21F9A04D1A9C912D]) [    ] o.a.s.c.c.SolrZkClient makePath: /collections/control_collection/shards
   [junit4]   2> 1160396 INFO  (TEST-TestReqParamsAPI.test-seed#[21F9A04D1A9C912D]) [    ] o.a.s.c.AbstractZkTestCase put C:\Users\jenkins\workspace\Lucene-Solr-6.0-Windows\solr\core\src\test-files\solr\collection1\conf\solrconfig-tlog.xml to /configs/conf1/solrconfig.xml
   [junit4]   2> 1160396 INFO  (TEST-TestReqParamsAPI.test-seed#[21F9A04D1A9C912D]) [    ] o.a.s.c.c.SolrZkClient makePath: /configs/conf1/solrconfig.xml
   [junit4]   2> 1160400 INFO  (TEST-TestReqParamsAPI.test-seed#[21F9A04D1A9C912D]) [    ] o.a.s.c.AbstractZkTestCase put C:\Users\jenkins\workspace\Lucene-Solr-6.0-Windows\solr\core\src\test-files\solr\collection1\conf\schema.xml to /configs/conf1/schema.xml
   [junit4]   2> 1160400 INFO  (TEST-TestReqParamsAPI.test-seed#[21F9A04D1A9C912D]) [    ] o.a.s.c.c.SolrZkClient makePath: /configs/conf1/schema.xml
   [junit4]   2> 1160403 INFO  (TEST-TestReqParamsAPI.test-seed#[21F9A04D1A9C912D]) [    ] o.a.s.c.AbstractZkTestCase put C:\Users\jenkins\workspace\Lucene-Solr-6.0-Windows\solr\core\src\test-files\solr\collection1\conf\solrconfig.snippet.randomindexconfig.xml to /configs/conf1/solrconfig.snippet.randomindexconfig.xml
   [junit4]   2> 1160403 INFO  (TEST-TestReqParamsAPI.test-seed#[21F9A04D1A9C912D]) [    ] o.a.s.c.c.SolrZkClient makePath: /configs/conf1/solrconfig.snippet.randomindexconfig.xml
   [junit4]   2> 1160406 INFO  (TEST-TestReqParamsAPI.test-seed#[21F9A04D1A9C912D]) [    ] o.a.s.c.AbstractZkTestCase put C:\Users\jenkins\workspace\Lucene-Solr-6.0-Windows\solr\core\src\test-files\solr\collection1\conf\stopwords.txt to /configs/conf1/stopwords.txt
   [junit4]   2> 1160406 INFO  (TEST-TestReqParamsAPI.test-seed#[21F9A04D1A9C912D]) [    ] o.a.s.c.c.SolrZkClient makePath: /configs/conf1/stopwords.txt
   [junit4]   2> 1160408 INFO  (TEST-TestReqParamsAPI.test-seed#[21F9A04D1A9C912D]) [    ] o.a.s.c.AbstractZkTestCase put C:\Users\jenkins\workspace\Lucene-Solr-6.0-Windows\solr\core\src\test-files\solr\collection1\conf\protwords.txt to /configs/conf1/protwords.txt
   [junit4]   2> 1160408 INFO  (TEST-TestReqParamsAPI.test-seed#[21F9A04D1A9C912D]) [    ] o.a.s.c.c.SolrZkClient makePath: /configs/conf1/protwords.txt
   [junit4]   2> 1160412 INFO  (TEST-TestReqParamsAPI.test-seed#[21F9A04D1A9C912D]) [    ] o.a.s.c.AbstractZkTestCase put C:\Users\jenkins\workspace\Lucene-Solr-6.0-Windows\solr\core\src\test-files\solr\collection1\conf\currency.xml to /configs/conf1/currency.xml
   [junit4]   2> 1160412 INFO  (TEST-TestReqParamsAPI.test-seed#[21F9A04D1A9C912D]) [    ] o.a.s.c.c.SolrZkClient makePath: /configs/conf1/currency.xml
   [junit4]   2> 1160414 INFO  (TEST-TestReqParamsAPI.test-seed#[21F9A04D1A9C912D]) [    ] o.a.s.c.AbstractZkTestCase put C:\Users\jenkins\workspace\Lucene-Solr-6.0-Windows\solr\core\src\test-files\solr\collection1\conf\enumsConfig.xml to /configs/conf1/enumsConfig.xml
   [junit4]   2> 1160415 INFO  (TEST-TestReqParamsAPI.test-seed#[21F9A04D1A9C912D]) [    ] o.a.s.c.c.SolrZkClient makePath: /configs/conf1/enumsConfig.xml
   [junit4]   2> 1160417 INFO  (TEST-TestReqParamsAPI.test-seed#[21F9A04D1A9C912D]) [    ] o.a.s.c.AbstractZkTestCase put C:\Users\jenkins\workspace\Lucene-Solr-6.0-Windows\solr\core\src\test-files\solr\collection1\conf\open-exchange-rates.json to /configs/conf1/open-exchange-rates.json
   [junit4]   2> 1160417 INFO  (TEST-TestReqParamsAPI.test-seed#[21F9A04D1A9C912D]) [    ] o.a.s.c.c.SolrZkClient makePath: /configs/conf1/open-exchange-rates.json
   [junit4]   2> 1160419 INFO  (TEST-TestReqParamsAPI.test-seed#[21F9A04D1A9C912D]) [    ] o.a.s.c.AbstractZkTestCase put C:\Users\jenkins\workspace\Lucene-Solr-6.0-Windows\solr\core\src\test-files\solr\collection1\conf\mapping-ISOLatin1Accent.txt to /configs/conf1/mapping-ISOLatin1Accent.txt
   [junit4]   2> 1160420 INFO  (TEST-TestReqParamsAPI.test-seed#[21F9A04D1A9C912D]) [    ] o.a.s.c.c.SolrZkClient makePath: /configs/conf1/mapping-ISOLatin1Accent.txt
   [junit4]   2> 1160422 INFO  (TEST-TestReqParamsAPI.test-seed#[21F9A04D1A9C912D]) [    ] o.a.s.c.AbstractZkTestCase put C:\Users\jenkins\workspace\Lucene-Solr-6.0-Windows\solr\core\src\test-files\solr\collection1\conf\old_synonyms.txt to /configs/conf1/old_synonyms.txt
   [junit4]   2> 1160422 INFO  (TEST-TestReqParamsAPI.test-seed#[21F9A04D1A9C912D]) [    ] o.a.s.c.c.SolrZkClient makePath: /configs/conf1/old_synonyms.txt
   [junit4]   2> 1160424 INFO  (TEST-TestReqParamsAPI.test-seed#[21F9A04D1A9C912D]) [    ] o.a.s.c.AbstractZkTestCase put C:\Users\jenkins\workspace\Lucene-Solr-6.0-Windows\solr\core\src\test-files\solr\collection1\conf\synonyms.txt to /configs/conf1/synonyms.txt
   [junit4]   2> 1160425 INFO  (TEST-TestReqParamsAPI.test-seed#[21F9A04D1A9C912D]) [    ] o.a.s.c.c.SolrZkClient makePath: /configs/conf1/synonyms.txt
   [junit4]   2> 1160895 INFO  (TEST-TestReqParamsAPI.test-seed#[21F9A04D1A9C912D]) [    ] o.a.s.SolrTestCaseJ4 Writing core.properties file to C:\Users\jenkins\workspace\Lucene-Solr-6.0-Windows\solr\build\solr-core\test\J1\temp\solr.handler.TestReqParamsAPI_21F9A04D1A9C912D-001\control-001\cores\collection1
   [junit4]   2> 1160907 INFO  (TEST-TestReqParamsAPI.test-seed#[21F9A04D1A9C912D]) [    ] o.e.j.s.Server jetty-9.3.8.v20160314
   [junit4]   2> 1160908 INFO  (TEST-TestReqParamsAPI.test-seed#[21F9A04D1A9C912D]) [    ] o.e.j.s.h.ContextHandler Started o.e.j.s.ServletContextHandler@4e1844c5{/,null,AVAILABLE}
   [junit4]   2> 1160916 INFO  (TEST-TestReqParamsAPI.test-seed#[21F9A04D1A9C912D]) [    ] o.e.j.s.ServerConnector Started ServerConnector@1dd5e8bd{HTTP/1.1,[http/1.1]}{127.0.0.1:65135}
   [junit4]   2> 1160916 INFO  (TEST-TestReqParamsAPI.test-seed#[21F9A04D1A9C912D]) [    ] o.e.j.s.Server Started @1167323ms
   [junit4]   2> 1160916 INFO  (TEST-TestReqParamsAPI.test-seed#[21F9A04D1A9C912D]) [    ] o.a.s.c.s.e.JettySolrRunner Jetty properties: {solr.data.dir=C:\Users\jenkins\workspace\Lucene-Solr-6.0-Windows\solr\build\solr-core\test\J1\temp\solr.handler.TestReqParamsAPI_21F9A04D1A9C912D-001\tempDir-001/control/data, hostContext=/, hostPort=65135, coreRootDirectory=C:\Users\jenkins\workspace\Lucene-Solr-6.0-Windows\solr\build\solr-core\test\J1\..\..\..\..\..\..\..\..\..\Users\jenkins\workspace\Lucene-Solr-6.0-Windows\solr\build\solr-core\test\J1\temp\solr.handler.TestReqParamsAPI_21F9A04D1A9C912D-001\control-001\cores}
   [junit4]   2> 1160916 INFO  (TEST-TestReqParamsAPI.test-seed#[21F9A04D1A9C912D]) [    ] o.a.s.s.SolrDispatchFilter SolrDispatchFilter.init(): sun.misc.Launcher$AppClassLoader@73d16e93
   [junit4]   2> 1160916 INFO  (TEST-TestReqParamsAPI.test-seed#[21F9A04D1A9C912D]) [    ] o.a.s.c.SolrResourceLoader new SolrResourceLoader for directory: 'C:\Users\jenkins\workspace\Lucene-Solr-6.0-Windows\solr\build\solr-core\test\J1\temp\solr.handler.TestReqParamsAPI_21F9A04D1A9C912D-001\control-001'
   [junit4]   2> 1160916 INFO  (TEST-TestReqParamsAPI.test-seed#[21F9A04D1A9C912D]) [    ] o.a.s.c.SolrResourceLoader JNDI not configured for solr (NoInitialContextEx)
   [junit4]   2> 1160916 INFO  (TEST-TestReqParamsAPI.test-seed#[21F9A04D1A9C912D]) [    ] o.a.s.c.SolrResourceLoader solr home defaulted to 'solr/' (could not find system property or JNDI)
   [junit4]   2> 1160918 INFO  (TEST-TestReqParamsAPI.test-seed#[21F9A04D1A9C912D]) [    ] o.a.s.c.c.SolrZkClient Using default ZkCredentialsProvider
   [junit4]   2> 1160919 INFO  (TEST-TestReqParamsAPI.test-seed#[21F9A04D1A9C912D]) [    ] o.a.s.c.c.ConnectionManager Waiting for client to connect to ZooKeeper
   [junit4]   2> 1160921 INFO  (zkCallback-1394-thread-1) [    ] o.a.s.c.c.ConnectionManager Watcher org.apache.solr.common.cloud.ConnectionManager@5e14d053 name:ZooKeeperConnection Watcher:127.0.0.1:65128/solr got event WatchedEvent state:SyncConnected type:None path:null path:null type:None
   [junit4]   2> 1160921 INFO  (TEST-TestReqParamsAPI.test-seed#[21F9A04D1A9C912D]) [    ] o.a.s.c.c.ConnectionManager Client is connected to ZooKeeper
   [junit4]   2> 1160921 INFO  (TEST-TestReqParamsAPI.test-seed#[21F9A04D1A9C912D]) [    ] o.a.s.c.c.SolrZkClient Using default ZkACLProvider
   [junit4]   2> 1160922 INFO  (TEST-TestReqParamsAPI.test-seed#[21F9A04D1A9C912D]) [    ] o.a.s.s.SolrDispatchFilter Loading solr.xml from SolrHome (not found in ZooKeeper)
   [junit4]   2> 1160922 INFO  (TEST-TestReqParamsAPI.test-seed#[21F9A04D1A9C912D]) [    ] o.a.s.c.SolrXmlConfig Loading container configuration from C:\Users\jenkins\workspace\Lucene-Solr-6.0-Windows\solr\build\solr-core\test\J1\temp\solr.handler.TestReqParamsAPI_21F9A04D1A9C912D-001\control-001\solr.xml
   [junit4]   2> 1160932 INFO  (TEST-TestReqParamsAPI.test-seed#[21F9A04D1A9C912D]) [    ] o.a.s.c.CorePropertiesLocator Config-defined core root directory: C:\Users\jenkins\workspace\Lucene-Solr-6.0-Windows\solr\build\solr-core\test\J1\..\..\..\..\..\..\..\..\..\Users\jenkins\workspace\Lucene-Solr-6.0-Windows\solr\build\solr-core\test\J1\temp\solr.handler.TestReqParamsAPI_21F9A04D1A9C912D-001\control-001\cores
   [junit4]   2> 1160932 INFO  (TEST-TestReqParamsAPI.test-seed#[21F9A04D1A9C912D]) [    ] o.a.s.c.CoreContainer New CoreContainer 463958507
   [junit4]   2> 1160932 INFO  (TEST-TestReqParamsAPI.test-seed#[21F9A04D1A9C912D]) [    ] o.a.s.c.CoreContainer Loading cores into CoreContainer [instanceDir=C:\Users\jenkins\workspace\Lucene-Solr-6.0-Windows\solr\build\solr-core\test\J1\temp\solr.handler.TestReqParamsAPI_21F9A04D1A9C912D-001\control-001]
   [junit4]   2> 1160932 WARN  (TEST-TestReqParamsAPI.test-seed#[21F9A04D1A9C912D]) [    ] o.a.s.c.CoreContainer Couldn't add files from C:\Users\jenkins\workspace\Lucene-Solr-6.0-Windows\solr\build\solr-core\test\J1\temp\solr.handler.TestReqParamsAPI_21F9A04D1A9C912D-001\control-001\lib to classpath: C:\Users\jenkins\workspace\Lucene-Solr-6.0-Windows\solr\build\solr-core\test\J1\temp\solr.handler.TestReqParamsAPI_21F9A04D1A9C912D-001\control-001\lib
   [junit4]   2> 1160932 INFO  (TEST-TestReqParamsAPI.test-seed#[21F9A04D1A9C912D]) [    ] o.a.s.h.c.HttpShardHandlerFactory created with socketTimeout : 90000,urlScheme : ,connTimeout : 15000,maxConnectionsPerHost : 20,maxConnections : 10000,corePoolSize : 0,maximumPoolSize : 2147483647,maxThreadIdleTime : 5,sizeOfQueue : -1,fairnessPolicy : false,useRetries : false,
   [junit4]   2> 1160936 INFO  (TEST-TestReqParamsAPI.test-seed#[21F9A04D1A9C912D]) [    ] o.a.s.u.UpdateShardHandler Creating UpdateShardHandler HTTP client with params: socketTimeout=340000&connTimeout=45000&retry=true
   [junit4]   2> 1160937 INFO  (TEST-TestReqParamsAPI.test-seed#[21F9A04D1A9C912D]) [    ] o.a.s.l.LogWatcher SLF4J impl is org.slf4j.impl.Log4jLoggerFactory
   [junit4]   2> 1160937 INFO  (TEST-TestReqParamsAPI.test-seed#[21F9A04D1A9C912D]) [    ] o.a.s.l.LogWatcher Registering Log Listener [Log4j (org.slf4j.impl.Log4jLoggerFactory)]
   [junit4]   2> 1160937 INFO  (TEST-TestReqParamsAPI.test-seed#[21F9A04D1A9C912D]) [    ] o.a.s.c.ZkContainer Zookeeper client=127.0.0.1:65128/solr
   [junit4]   2> 1160937 INFO  (TEST-TestReqParamsAPI.test-seed#[21F9A04D1A9C912D]) [    ] o.a.s.c.ZkController zkHost includes chroot
   [junit4]   2> 1160937 INFO  (TEST-TestReqParamsAPI.test-seed#[21F9A04D1A9C912D]) [    ] o.a.s.c.c.SolrZkClient Using default ZkCredentialsProvider
   [junit4]   2> 1160938 INFO  (TEST-TestReqParamsAPI.test-seed#[21F9A04D1A9C912D]) [    ] o.a.s.c.c.ConnectionManager Waiting for client to connect to ZooKeeper
   [junit4]   2> 1160940 INFO  (zkCallback-1397-thread-1) [    ] o.a.s.c.c.ConnectionManager Watcher org.apache.solr.common.cloud.ConnectionManager@21280b28 name:ZooKeeperConnection Watcher:127.0.0.1:65128 got event WatchedEvent state:SyncConnected type:None path:null path:null type:None
   [junit4]   2> 1160940 INFO  (TEST-TestReqParamsAPI.test-seed#[21F9A04D1A9C912D]) [    ] o.a.s.c.c.ConnectionManager Client is connected to ZooKeeper
   [junit4]   2> 1160940 INFO  (TEST-TestReqParamsAPI.test-seed#[21F9A04D1A9C912D]) [    ] o.a.s.c.c.SolrZkClient Using default ZkACLProvider
   [junit4]   2> 1160941 INFO  (TEST-TestReqParamsAPI.test-seed#[21F9A04D1A9C912D]) [n:127.0.0.1:65135_    ] o.a.s.c.ZkController Added new OnReconnect listener org.apache.solr.cloud.ZkController$$Lambda$32/447552652@42666212
   [junit4]   2> 1160943 INFO  (TEST-TestReqParamsAPI.test-seed#[21F9A04D1A9C912D]) [n:127.0.0.1:65135_    ] o.a.s.c.c.ConnectionManager Waiting for client to connect to ZooKeeper
   [junit4]   2> 1160944 INFO  (zkCallback-1398-thread-1-processing-n:127.0.0.1:65135_) [n:127.0.0.1:65135_    ] o.a.s.c.c.ConnectionManager Watcher org.apache.solr.common.cloud.ConnectionManager@68e812ba name:ZooKeeperConnection Watcher:127.0.0.1:65128/solr got event WatchedEvent state:SyncConnected type:None path:null path:null type:None
   [junit4]   2> 1160945 INFO  (TEST-TestReqParamsAPI.test-seed#[21F9A04D1A9C912D]) [n:127.0.0.1:65135_    ] o.a.s.c.c.ConnectionManager Client is connected to ZooKeeper
   [junit4]   2> 1160946 INFO  (TEST-TestReqParamsAPI.test-seed#[21F9A04D1A9C912D]) [n:127.0.0.1:65135_    ] o.a.s.c.c.SolrZkClient makePath: /overseer/queue
   [junit4]   2> 1160948 INFO  (TEST-TestReqParamsAPI.test-seed#[21F9A04D1A9C912D]) [n:127.0.0.1:65135_    ] o.a.s.c.c.SolrZkClient makePath: /overseer/collection-queue-work
   [junit4]   2> 1160951 INFO  (TEST-TestReqParamsAPI.test-seed#[21F9A04D1A9C912D]) [n:127.0.0.1:65135_    ] o.a.s.c.c.SolrZkClient makePath: /overseer/collection-map-running
   [junit4]   2> 1160954 INFO  (TEST-TestReqParamsAPI.test-seed#[21F9A04D1A9C912D]) [n:127.0.0.1:65135_    ] o.a.s.c.c.SolrZkClient makePath: /overseer/collection-map-completed
   [junit4]   2> 1160956 INFO  (TEST-TestReqParamsAPI.test-seed#[21F9A04D1A9C912D]) [n:127.0.0.1:65135_    ] o.a.s.c.c.SolrZkClient makePath: /overseer/collection-map-failure
   [junit4]   2> 1160958 INFO  (TEST-TestReqParamsAPI.test-seed#[21F9A04D1A9C912D]) [n:127.0.0.1:65135_    ] o.a.s.c.c.SolrZkClient makePath: /live_nodes
   [junit4]   2> 1160960 INFO  (TEST-TestReqParamsAPI.test-seed#[21F9A04D1A9C912D]) [n:127.0.0.1:65135_    ] o.a.s.c.c.SolrZkClient makePath: /aliases.json
   [junit4]   2> 1160962 INFO  (TEST-TestReqParamsAPI.test-seed#[21F9A04D1A9C912D]) [n:127.0.0.1:65135_    ] o.a.s.c.c.SolrZkClient makePath: /clusterstate.json
   [junit4]   2> 1160964 INFO  (TEST-TestReqParamsAPI.test-seed#[21F9A04D1A9C912D]) [n:127.0.0.1:65135_    ] o.a.s.c.c.SolrZkClient makePath: /security.json
   [junit4]   2> 1160965 INFO  (TEST-TestReqParamsAPI.test-seed#[21F9A04D1A9C912D]) [n:127.0.0.1:65135_    ] o.a.s.c.c.ZkStateReader Updating cluster state from ZooKeeper... 
   [junit4]   2> 1160967 INFO  (TEST-TestReqParamsAPI.test-seed#[21F9A04D1A9C912D]) [n:127.0.0.1:65135_    ] o.a.s.c.c.ZkStateReader Updated live nodes from ZooKeeper... (0) -> (0)
   [junit4]   2> 1160969 INFO  (TEST-TestReqParamsAPI.test-seed#[21F9A04D1A9C912D]) [n:127.0.0.1:65135_    ] o.a.s.c.c.SolrZkClient makePath: /overseer_elect
   [junit4]   2> 1160970 INFO  (TEST-TestReqParamsAPI.test-seed#[21F9A04D1A9C912D]) [n:127.0.0.1:65135_    ] o.a.s.c.c.SolrZkClient makePath: /overseer_elect/election
   [junit4]   2> 1160972 INFO  (TEST-TestReqParamsAPI.test-seed#[21F9A04D1A9C912D]) [n:127.0.0.1:65135_    ] o.a.s.c.Overseer Overseer (id=null) closing
   [junit4]   2> 1160972 INFO  (TEST-TestReqParamsAPI.test-seed#[21F9A04D1A9C912D]) [n:127.0.0.1:65135_    ] o.a.s.c.LeaderElector Joined leadership election with path: /overseer_elect/election/95939638291857412-127.0.0.1:65135_-n_0000000000
   [junit4]   2> 1160973 INFO  (TEST-TestReqParamsAPI.test-seed#[21F9A04D1A9C912D]) [n:127.0.0.1:65135_    ] o.a.s.c.OverseerElectionContext I am going to be the leader 127.0.0.1:65135_
   [junit4]   2> 1160973 INFO  (TEST-TestReqParamsAPI.test-seed#[21F9A04D1A9C912D]) [n:127.0.0.1:65135_    ] o.a.s.c.c.SolrZkClient makePath: /overseer_elect/leader
   [junit4]   2> 1160975 INFO  (TEST-TestReqParamsAPI.test-seed#[21F9A04D1A9C912D]) [n:127.0.0.1:65135_    ] o.a.s.c.Overseer Overseer (id=95939638291857412-127.0.0.1:65135_-n_0000000000) starting
   [junit4]   2> 1160979 INFO  (TEST-TestReqParamsAPI.test-seed#[21F9A04D1A9C912D]) [n:127.0.0.1:65135_    ] o.a.s.c.c.SolrZkClient makePath: /overseer/queue-work
   [junit4]   2> 1160987 INFO  (TEST-TestReqParamsAPI.test-seed#[21F9A04D1A9C912D]) [n:127.0.0.1:65135_    ] o.a.s.c.OverseerAutoReplicaFailoverThread Starting OverseerAutoReplicaFailoverThread autoReplicaFailoverWorkLoopDelay=10000 autoReplicaFailoverWaitAfterExpiration=30000 autoReplicaFailoverBadNodeExpiration=60000
   [junit4]   2> 1160987 INFO  (OverseerCollectionConfigSetProcessor-95939638291857412-127.0.0.1:65135_-n_0000000000) [n:127.0.0.1:65135_    ] o.a.s.c.OverseerTaskProcessor Process current queue of overseer operations
   [junit4]   2> 1160987 INFO  (TEST-TestReqParamsAPI.test-seed#[21F9A04D1A9C912D]) [n:127.0.0.1:65135_    ] o.a.s.c.ZkController Register node as live in ZooKeeper:/live_nodes/127.0.0.1:65135_
   [junit4]   2> 1160988 INFO  (OverseerStateUpdate-95939638291857412-127.0.0.1:65135_-n_0000000000) [n:127.0.0.1:65135_    ] o.a.s.c.Overseer Starting to work on the main queue
   [junit4]   2> 1160988 INFO  (TEST-TestReqParamsAPI.test-seed#[21F9A04D1A9C912D]) [n:127.0.0.1:65135_    ] o.a.s.c.c.SolrZkClient makePath: /live_nodes/127.0.0.1:65135_
   [junit4]   2> 1160993 INFO  (zkCallback-1398-thread-1-processing-n:127.0.0.1:65135_) [n:127.0.0.1:65135_    ] o.a.s.c.c.ZkStateReader A live node change: [WatchedEvent state:SyncConnected type:NodeChildrenChanged path:/live_nodes], has occurred - updating... (live nodes size: [0])
   [junit4]   2> 1160993 INFO  (OverseerStateUpdate-95939638291857412-127.0.0.1:65135_-n_0000000000) [n:127.0.0.1:65135_    ] o.a.s.c.c.ZkStateReader Updated live nodes from ZooKeeper... (0) -> (1)
   [junit4]   2> 1160994 INFO  (zkCallback-1398-thread-1-processing-n:127.0.0.1:65135_) [n:127.0.0.1:65135_    ] o.a.s.c.c.ZkStateReader Updated live nodes from ZooKeeper... (1) -> (1)
   [junit4]   2> 1160999 INFO  (TEST-TestReqParamsAPI.test-seed#[21F9A04D1A9C912D]) [n:127.0.0.1:65135_    ] o.a.s.c.CoreContainer Security conf doesn't exist. Skipping setup for authorization module.
   [junit4]   2> 1161000 INFO  (TEST-TestReqParamsAPI.test-seed#[21F9A04D1A9C912D]) [n:127.0.0.1:65135_    ] o.a.s.c.CoreContainer No authentication plugin used.
   [junit4]   2> 1161002 INFO  (TEST-TestReqParamsAPI.test-seed#[21F9A04D1A9C912D]) [n:127.0.0.1:65135_    ] o.a.s.c.CorePropertiesLocator Looking for core definitions underneath C:\Users\jenkins\workspace\Lucene-Solr-6.0-Windows\solr\build\solr-core\test\J1\..\..\..\..\..\..\..\..\..\Users\jenkins\workspace\Lucene-Solr-6.0-Windows\solr\build\solr-core\test\J1\temp\solr.handler.TestReqParamsAPI_21F9A04D1A9C912D-001\control-001\cores
   [junit4]   2> 1161008 INFO  (TEST-TestReqParamsAPI.test-seed#[21F9A04D1A9C912D]) [n:127.0.0.1:65135_    ] o.a.s.c.CoreDescriptor Created CoreDescriptor: {name=collection1, config=solrconfig.xml, transient=false, schema=schema.xml, loadOnStartup=true, configSetProperties=configsetprops.json, collection=control_collection, coreNodeName=, dataDir=data\, shard=}
   [junit4]   2> 1161008 INFO  (TEST-TestReqParamsAPI.test-seed#[21F9A04D1A9C912D]) [n:127.0.0.1:65135_    ] o.a.s.c.CorePropertiesLocator Found core collection1 in C:\Users\jenkins\workspace\Lucene-Solr-6.0-Windows\solr\build\solr-core\test\J1\..\..\..\..\..\..\..\..\..\Users\jenkins\workspace\Lucene-Solr-6.0-Windows\solr\build\solr-core\test\J1\temp\solr.handler.TestReqParamsAPI_21F9A04D1A9C912D-001\control-001\cores\collection1
   [junit4]   2> 1161009 INFO  (TEST-TestReqParamsAPI.test-seed#[21F9A04D1A9C912D]) [n:127.0.0.1:65135_    ] o.a.s.c.CorePropertiesLocator Found 1 core definitions
   [junit4]   2> 1161011 INFO  (TEST-TestReqParamsAPI.test-seed#[21F9A04D1A9C912D]) [n:127.0.0.1:65135_    ] o.a.s.s.SolrDispatchFilter user.dir=C:\Users\jenkins\workspace\Lucene-Solr-6.0-Windows\solr\build\solr-core\test\J1
   [junit4]   2> 1161011 INFO  (TEST-TestReqParamsAPI.test-seed#[21F9A04D1A9C912D]) [n:127.0.0.1:65135_    ] o.a.s.s.SolrDispatchFilter SolrDispatchFilter.init() done
   [junit4]   2> 1161012 INFO  (coreLoadExecutor-4088-thread-1-processing-n:127.0.0.1:65135_) [n:127.0.0.1:65135_ c:control_collection   x:collection1] o.a.s.c.ZkController publishing state=down
   [junit4]   2> 1161012 INFO  (coreLoadExecutor-4088-thread-1-processing-n:127.0.0.1:65135_) [n:127.0.0.1:65135_ c:control_collection   x:collection1] o.a.s.c.ZkController numShards not found on descriptor - reading it from system property
   [junit4]   2> 1161015 INFO  (coreLoadExecutor-4088-thread-1-processing-n:127.0.0.1:65135_) [n:127.0.0.1:65135_ c:control_collection   x:collection1] o.a.s.c.ZkController Collection control_collection not visible yet, but flagging it so a watch is registered when it becomes visible
   [junit4]   2> 1161015 INFO  (coreLoadExecutor-4088-thread-1-processing-n:127.0.0.1:65135_) [n:127.0.0.1:65135_ c:control_collection   x:collection1] o.a.s.c.c.ZkStateReader addZkWatch [control_collection]
   [junit4]   2> 1161016 INFO  (OverseerStateUpdate-95939638291857412-127.0.0.1:65135_-n_0000000000) [n:127.0.0.1:65135_    ] o.a.s.c.Overseer processMessage: queueSize: 1, message = {
   [junit4]   2>   "core":"collection1",
   [junit4]   2>   "roles":null,
   [junit4]   2>   "base_url":"http://127.0.0.1:65135",
   [junit4]   2>   "node_name":"127.0.0.1:65135_",
   [junit4]   2>   "numShards":"1",
   [junit4]   2>   "state":"down",
   [junit4]   2>   "shard":null,
   [junit4]   2>   "collection":"control_collection",
   [junit4]   2>   "operation":"state"} current state version: 0
   [junit4]   2> 1161016 INFO  (coreLoadExecutor-4088-thread-1-processing-n:127.0.0.1:65135_) [n:127.0.0.1:65135_ c:control_collection   x:collection1] o.a.s.c.c.ZkStateReader Deleting data for [control_collection]
   [junit4]   2> 1161017 INFO  (OverseerStateUpdate-95939638291857412-127.0.0.1:65135_-n_0000000000) [n:127.0.0.1:65135_    ] o.a.s.c.o.ReplicaMutator Update state numShards=1 message={
   [junit4]   2>   "core":"collection1",
   [junit4]   2>   "roles":null,
   [junit4]   2>   "base_url":"http://127.0.0.1:65135",
   [junit4]   2>   "node_name":"127.0.0.1:65135_",
   [junit4]   2>   "numShards":"1",
   [junit4]   2>   "state":"down",
   [junit4]   2>   "shard":null,
   [junit4]   2>   "collection":"control_collection",
   [junit4]   2>   "operation":"state"}
   [junit4]   2> 1161018 INFO  (coreLoadExecutor-4088-thread-1-processing-n:127.0.0.1:65135_) [n:127.0.0.1:65135_ c:control_collection   x:collection1] o.a.s.c.ZkController look for our core node name
   [junit4]   2> 1161018 INFO  (OverseerStateUpdate-95939638291857412-127.0.0.1:65135_-n_0000000000) [n:127.0.0.1:65135_    ] o.a.s.c.o.ClusterStateMutator building a new cName: control_collection
   [junit4]   2> 1161018 INFO  (OverseerStateUpdate-95939638291857412-127.0.0.1:65135_-n_0000000000) [n:127.0.0.1:65135_    ] o.a.s.c.o.ReplicaMutator Assigning new node to shard shard=shard1
   [junit4]   2> 1161020 INFO  (zkCallback-1398-thread-1-processing-n:127.0.0.1:65135_) [n:127.0.0.1:65135_    ] o.a.s.c.c.ZkStateReader A cluster state change: [WatchedEvent state:SyncConnected type:NodeDataChanged path:/clusterstate.json], has occurred - updating... (live nodes size: [1])
   [junit4]   2> 1162019 INFO  (coreLoadExecutor-4088-thread-1-processing-n:127.0.0.1:65135_) [n:127.0.0.1:65135_ c:control_collection   x:collection1] o.a.s.c.ZkController waiting to find shard id in clusterstate for collection1
   [junit4]   2> 1162019 INFO  (coreLoadExecutor-4088-thread-1-processing-n:127.0.0.1:65135_) [n:127.0.0.1:65135_ c:control_collection   x:collection1] o.a.s.c.ZkController Check for collection zkNode:control_collection
   [junit4]   2> 1162019 INFO  (coreLoadExecutor-4088-thread-1-processing-n:127.0.0.1:65135_) [n:127.0.0.1:65135_ c:control_collection   x:collection1] o.a.s.c.ZkController Collection zkNode exists
   [junit4]   2> 1162019 INFO  (coreLoadExecutor-4088-thread-1-processing-n:127.0.0.1:65135_) [n:127.0.0.1:65135_ c:control_collection   x:collection1] o.a.s.c.c.ZkStateReader Load collection config from: [/collections/control_collection]
   [junit4]   2> 1162020 INFO  (coreLoadExecutor-4088-thread-1-processing-n:127.0.0.1:65135_) [n:127.0.0.1:65135_ c:control_collection   x:collection1] o.a.s.c.c.ZkStateReader path=[/collections/control_collection] [configName]=[conf1] specified config exists in ZooKeeper
   [junit4]   2> 1162020 INFO  (coreLoadExecutor-4088-thread-1-processing-n:127.0.0.1:65135_) [n:127.0.0.1:65135_ c:control_collection   x:collection1] o.a.s.c.SolrResourceLoader new SolrResourceLoader for directory: 'C:\Users\jenkins\workspace\Lucene-Solr-6.0-Windows\solr\build\solr-core\test\J1\temp\solr.handler.TestReqParamsAPI_21F9A04D1A9C912D-001\control-001\cores\collection1'
   [junit4]   2> 1162021 INFO  (coreLoadExecutor-4088-thread-1-processing-n:127.0.0.1:65135_) [n:127.0.0.1:65135_ c:control_collection   x:collection1] o.a.s.c.SolrResourceLoader JNDI not configured for solr (NoInitialContextEx)
   [junit4]   2> 1162021 INFO  (coreLoadExecutor-4088-thread-1-processing-n:127.0.0.1:65135_) [n:127.0.0.1:65135_ c:control_collection   x:collection1] o.a.s.c.SolrResourceLoader solr home defaulted to 'solr/' (could not find system property or JNDI)
   [junit4]   2> 1162025 INFO  (coreLoadExecutor-4088-thread-1-processing-n:127.0.0.1:65135_) [n:127.0.0.1:65135_ c:control_collection   x:collection1] o.a.s.c.Config loaded config solrconfig.xml with version 0 
   [junit4]   2> 1162039 INFO  (coreLoadExecutor-4088-thread-1-processing-n:127.0.0.1:65135_) [n:127.0.0.1:65135_ c:control_collection   x:collection1] o.a.s.c.SolrConfig current version of requestparams : -1
   [junit4]   2> 1162042 WARN  (coreLoadExecutor-4088-thread-1-processing-n:127.0.0.1:65135_) [n:127.0.0.1:65135_ c:control_collection   x:collection1] o.a.s.c.Config Beginning with Solr 5.5, <mergePolicy> is deprecated, use <mergePolicyFactory> instead.
   [junit4]   2> 1162043 INFO  (coreLoadExecutor-4088-thread-1-processing-n:127.0.0.1:65135_) [n:127.0.0.1:65135_ c:control_collection   x:collection1] o.a.s.c.SolrConfig Using Lucene MatchVersion: 6.0.1
   [junit4]   2> 1162051 INFO  (coreLoadExecutor-4088-thread-1-processing-n:127.0.0.1:65135_) [n:127.0.0.1:65135_ c:control_collection   x:collection1] o.a.s.c.SolrConfig Loaded SolrConfig: solrconfig.xml
   [junit4]   2> 1162060 INFO  (coreLoadExecutor-4088-thread-1-processing-n:127.0.0.1:65135_) [n:127.0.0.1:65135_ c:control_collection   x:collection1] o.a.s.s.IndexSchema [collection1] Schema name=test
   [junit4]   2> 1162159 INFO  (coreLoadExecutor-4088-thread-1-processing-n:127.0.0.1:65135_) [n:127.0.0.1:65135_ c:control_collection   x:collection1] o.a.s.s.OpenExchangeRatesOrgProvider Initialized with rates=open-exchange-rates.json, refreshInterval=1440.
   [junit4]   2> 1162173 INFO  (coreLoadExecutor-4088-thread-1-processing-n:127.0.0.1:65135_) [n:127.0.0.1:65135_ c:control_collection   x:collection1] o.a.s.s.IndexSchema default search field in schema is text
   [junit4]   2> 1162179 INFO  (coreLoadExecutor-4088-thread-1-processing-n:127.0.0.1:65135_) [n:127.0.0.1:65135_ c:control_collection   x:collection1] o.a.s.s.IndexSchema unique key field: id
   [junit4]   2> 1162194 INFO  (coreLoadExecutor-4088-thread-1-processing-n:127.0.0.1:65135_) [n:127.0.0.1:65135_ c:control_collection   x:collection1] o.a.s.s.FileExchangeRateProvider Reloading exchange rates from file currency.xml
   [junit4]   2> 1162198 INFO  (coreLoadExecutor-4088-thread-1-processing-n:127.0.0.1:65135_) [n:127.0.0.1:65135_ c:control_collection   x:collection1] o.a.s.s.FileExchangeRateProvider Reloading exchange rates from file currency.xml
   [junit4]   2> 1162203 INFO  (coreLoadExecutor-4088-thread-1-processing-n:127.0.0.1:65135_) [n:127.0.0.1:65135_ c:control_collection   x:collection1] o.a.s.s.OpenExchangeRatesOrgProvider Reloading exchange rates from open-exchange-rates.json
   [junit4]   2> 1162205 INFO  (coreLoadExecutor-4088-thread-1-processing-n:127.0.0.1:65135_) [n:127.0.0.1:65135_ c:control_collection   x:collection1] o.a.s.s.OpenExchangeRatesOrgProvider Reloading exchange rates from open-exchange-rates.json
   [junit4]   2> 1162213 INFO  (coreLoadExecutor-4088-thread-1-processing-n:127.0.0.1:65135_) [n:127.0.0.1:65135_ c:control_collection   x:collection1] o.a.s.c.ConfigSetProperties Did not find ConfigSet properties, assuming default properties: Can't find resource 'configsetprops.json' in classpath or '/configs/conf1', cwd=C:\Users\jenkins\workspace\Lucene-Solr-6.0-Windows\solr\build\solr-core\test\J1
   [junit4]   2> 1162214 INFO  (coreLoadExecutor-4088-thread-1-processing-n:127.0.0.1:65135_) [n:127.0.0.1:65135_ c:control_collection   x:collection1] o.a.s.c.CoreContainer Creating SolrCore 'collection1' using configuration from collection control_collection
   [junit4]   2> 1162214 INFO  (coreLoadExecutor-4088-thread-1-processing-n:127.0.0.1:65135_) [n:127.0.0.1:65135_ c:control_collection s:shard1 r:core_node1 x:collection1] o.a.s.c.SolrCore org.apache.solr.core.MockDirectoryFactory
   [junit4]   2> 1162214 INFO  (coreLoadExecutor-4088-thread-1-processing-n:127.0.0.1:65135_) [n:127.0.0.1:65135_ c:control_collection s:shard1 r:core_node1 x:collection1] o.a.s.c.SolrCore [[collection1] ] Opening new SolrCore at [C:\Users\jenkins\workspace\Lucene-Solr-6.0-Windows\solr\build\solr-core\test\J1\temp\solr.handler.TestReqParamsAPI_21F9A04D1A9C912D-001\control-001\cores\collection1], dataDir=[C:\Users\jenkins\workspace\Lucene-Solr-6.0-Windows\solr\build\solr-core\test\J1\..\..\..\..\..\..\..\..\..\Users\jenkins\workspace\Lucene-Solr-6.0-Windows\solr\build\solr-core\test\J1\temp\solr.handler.TestReqParamsAPI_21F9A04D1A9C912D-001\control-001\cores\collection1\data\]
   [junit4]   2> 1162214 INFO  (coreLoadExecutor-4088-thread-1-processing-n:127.0.0.1:65135_) [n:127.0.0.1:65135_ c:control_collection s:shard1 r:core_node1 x:collection1] o.a.s.c.JmxMonitoredMap JMX monitoring is enabled. Adding Solr mbeans to JMX Server: com.sun.jmx.mbeanserver.JmxMBeanServer@7533c3b4
   [junit4]   2> 1162215 INFO  (coreLoadExecutor-4088-thread-1-processing-n:127.0.0.1:65135_) [n:127.0.0.1:65135_ c:control_collection s:shard1 r:core_node1 x:collection1] o.a.s.c.CachingDirectoryFactory return new directory for C:\Users\jenkins\workspace\Lucene-Solr-6.0-Windows\solr\build\solr-core\test\J1\..\..\..\..\..\..\..\..\..\Users\jenkins\workspace\Lucene-Solr-6.0-Windows\solr\build\solr-core\test\J1\temp\solr.handler.TestReqParamsAPI_21F9A04D1A9C912D-001\control-001\cores\collection1\data\
   [junit4]   2> 1162215 INFO  (coreLoadExecutor-4088-thread-1-processing-n:127.0.0.1:65135_) [n:127.0.0.1:65135_ c:control_collection s:shard1 r:core_node1 x:collection1] o.a.s.c.SolrCore New index directory detected: old=null new=C:\Users\jenkins\workspace\Lucene-Solr-6.0-Windows\solr\build\solr-core\test\J1\..\..\..\..\..\..\..\..\..\Users\jenkins\workspace\Lucene-Solr-6.0-Windows\solr\build\solr-core\test\J1\temp\solr.handler.TestReqParamsAPI_21F9A04D1A9C912D-001\control-001\cores\collection1\data\index/
   [junit4]   2> 1162215 WARN  (coreLoadExecutor-4088-thread-1-processing-n:127.0.0.1:65135_) [n:127.0.0.1:65135_ c:control_collection s:shard1 r:core_node1 x:collection1] o.a.s.c.SolrCore [collection1] Solr index directory 'C:\Users\jenkins\workspace\Lucene-Solr-6.0-Windows\solr\build\solr-core\test\J1\..\..\..\..\..\..\..\..\..\Users\jenkins\workspace\Lucene-Solr-6.0-Windows\solr\build\solr-core\test\J1\temp\solr.handler.TestReqParamsAPI_21F9A04D1A9C912D-001\control-001\cores\collection1\data\index' doesn't exist. Creating new index...
   [junit4]   2> 1162215 INFO  (coreLoadExecutor-4088-thread-1-processing-n:127.0.0.1:65135_) [n:127.0.0.1:65135_ c:control_collection s:shard1 r:core_node1 x:collection1] o.a.s.c.CachingDirectoryFactory return new directory for C:\Users\jenkins\workspace\Lucene-Solr-6.0-Windows\solr\build\solr-core\test\J1\..\..\..\..\..\..\..\..\..\Users\jenkins\workspace\Lucene-Solr-6.0-Windows\solr\build\solr-core\test\J1\temp\solr.handler.TestReqParamsAPI_21F9A04D1A9C912D-001\control-001\cores\collection1\data\index
   [junit4]   2> 1162216 INFO  (coreLoadExecutor-4088-thread-1-processing-n:127.0.0.1:65135_) [n:127.0.0.1:65135_ c:control_collection s:shard1 r:core_node1 x:collection1] o.a.s.u.RandomMergePolicy RandomMergePolicy wrapping class org.apache.lucene.index.AlcoholicMergePolicy: [AlcoholicMergePolicy: minMergeSize=0, mergeFactor=10, maxMergeSize=220473655, maxMergeSizeForForcedMerge=9223372036854775807, calibrateSizeByDeletes=true, maxMergeDocs=2147483647, maxCFSSegmentSizeMB=8.796093022207999E12, noCFSRatio=0.1]
   [junit4]   2> 1162218 INFO  (coreLoadExecutor-4088-thread-1-processing-n:127.0.0.1:65135_) [n:127.0.0.1:65135_ c:control_collection s:shard1 r:core_node1 x:collection1] o.a.s.c.SolrDeletionPolicy SolrDeletionPolicy.onCommit: commits: num=1
   [junit4]   2> 	commit{dir=MockDirectoryWrapper(RAMDirectory@3174e7c6 lockFactory=org.apache.lucene.store.SingleInstanceLockFactory@3227c6f6),segFN=segments_1,generation=1}
   [junit4]   2> 1162218 INFO  (coreLoadExecutor-4088-thread-1-processing-n:127.0.0.1:65135_) [n:127.0.0.1:65135_ c:control_collection s:shard1 r:core_node1 x:collection1] o.a.s.c.SolrDeletionPolicy newest commit generation = 1
   [junit4]   2> 1162220 INFO  (OldIndexDirectoryCleanupThreadForCore-collection1) [n:127.0.0.1:65135_ c:control_collection s:shard1 r:core_node1 x:collection1] o.a.s.c.SolrCore Looking for old index directories to cleanup for core collection1 in C:\Users\jenkins\workspace\Lucene-Solr-6.0-Windows\solr\build\solr-core\test\J1\..\..\..\..\..\..\..\..\..\Users\jenkins\workspace\Lucene-Solr-6.0-Windows\solr\build\solr-core\test\J1\temp\solr.handler.TestReqParamsAPI_21F9A04D1A9C912D-001\control-001\cores\collection1\data\
   [junit4]   2> 1162221 WARN  (OldIndexDirectoryCleanupThreadForCore-collection1) [n:127.0.0.1:65135_ c:control_collection s:shard1 r:core_node1 x:collection1] o.a.s.c.DirectoryFactory C:\Users\jenkins\workspace\Lucene-Solr-6.0-Windows\solr\build\solr-core\test\J1\..\..\..\..\..\..\..\..\..\Users\jenkins\workspace\Lucene-Solr-6.0-Windows\solr\build\solr-core\test\J1\temp\solr.handler.TestReqParamsAPI_21F9A04D1A9C912D-001\control-001\cores\collection1\data\ does not point to a valid data directory; skipping clean-up of old index directories.
   [junit4]   2> 1162222 INFO  (coreLoadExecutor-4088-thread-1-processing-n:127.0.0.1:65135_) [n:127.0.0.1:65135_ c:control_collection s:shard1 r:core_node1 x:collection1] o.a.s.u.p.UpdateRequestProcessorChain creating updateRequestProcessorChain "nodistrib"
   [junit4]   2> 1162226 INFO  (coreLoadExecutor-4088-thread-1-processing-n:127.0.0.1:65135_) [n:127.0.0.1:65135_ c:control_collection s:shard1 r:core_node1 x:collection1] o.a.s.u.p.UpdateRequestProcessorChain creating updateRequestProcessorChain "dedupe"
   [junit4]   2> 1162226 INFO  (coreLoadExecutor-4088-thread-1-processing-n:127.0.0.1:65135_) [n:127.0.0.1:65135_ c:control_collection s:shard1 r:core_node1 x:collection1] o.a.s.u.p.UpdateRequestProcessorChain inserting DistributedUpdateProcessorFactory into updateRequestProcessorChain "dedupe"
   [junit4]   2> 1162226 INFO  (coreLoadExecutor-4088-thread-1-processing-n:127.0.0.1:65135_) [n:127.0.0.1:65135_ c:control_collection s:shard1 r:core_node1 x:collection1] o.a.s.u.p.UpdateRequestProcessorChain creating updateRequestProcessorChain "stored_sig"
   [junit4]   2> 1162226 INFO  (coreLoadExecutor-4088-thread-1-processing-n:127.0.0.1:65135_) [n:127.0.0.1:65135_ c:control_collection s:shard1 r:core_node1 x:collection1] o.a.s.u.p.UpdateRequestProcessorChain inserting DistributedUpdateProcessorFactory into updateRequestProcessorChain "stored_sig"
   [junit4]   2> 1162227 INFO  (coreLoadExecutor-4088-thread-1-processing-n:127.0.0.1:65135_) [n:127.0.0.1:65135_ c:control_collection s:shard1 r:core_node1 x:collection1] o.a.s.u.p.UpdateRequestProcessorChain creating updateRequestProcessorChain "distrib-dup-test-chain-explicit"
   [junit4]   2> 1162227 INFO  (coreLoadExecutor-4088-thread-1-processing-n:127.0.0.1:65135_) [n:127.0.0.1:65135_ c:control_collection s:shard1 r:core_node1 x:collection1] o.a.s.u.p.UpdateRequestProcessorChain creating updateRequestProcessorChain "distrib-dup-test-chain-implicit"
   [junit4]   2> 1162227 INFO  (coreLoadExecutor-4088-thread-1-processing-n:127.0.0.1:65135_) [n:127.0.0.1:65135_ c:control_collection s:shard1 r:core_node1 x:collection1] o.a.s.u.p.UpdateRequestProcessorChain inserting DistributedUpdateProcessorFactory into updateRequestProcessorChain "distrib-dup-test-chain-implicit"
   [junit4]   2> 1162227 INFO  (coreLoadExecutor-4088-thread-1-processing-n:127.0.0.1:65135_) [n:127.0.0.1:65135_ c:control_collection s:shard1 r:core_node1 x:collection1] o.a.s.c.SolrCore no updateRequestProcessorChain defined as default, creating implicit default
   [junit4]   2> 1162228 WARN  (coreLoadExecutor-4088-thread-1-processing-n:127.0.0.1:65135_) [n:127.0.0.1:65135_ c:control_collection s:shard1 r:core_node1 x:collection1] o.a.s.c.RequestHandlers INVALID paramSet a in requestHandler {type = requestHandler,name = /dump,class = DumpRequestHandler,args = {defaults={a=A,b=B}}}
   [junit4]   2> 1162255 INFO  (coreLoadExecutor-4088-thread-1-processing-n:127.0.0.1:65135_) [n:127.0.0.1:65135_ c:control_collection s:shard1 r:core_node1 x:collection1] o.a.s.h.l.XMLLoader xsltCacheLifetimeSeconds=60
   [junit4]   2> 1162259 INFO  (coreLoadExecutor-4088-thread-1-processing-n:127.0.0.1:65135_) [n:127.0.0.1:65135_ c:control_collection s:shard1 r:core_node1 x:collection1] o.a.s.h.l.XMLLoader xsltCacheLifetimeSeconds=60
   [junit4]   2> 1162263 INFO  (coreLoadExecutor-4088-thread-1-processing-n:127.0.0.1:65135_) [n:127.0.0.1:65135_ c:control_collection s:shard1 r:core_node1 x:collection1] o.a.s.h.l.XMLLoader xsltCacheLifetimeSeconds=60
   [junit4]   2> 1162268 INFO  (coreLoadExecutor-4088-thread-1-processing-n:127.0.0.1:65135_) [n:127.0.0.1:65135_ c:control_collection s:shard1 r:core_node1 x:collection1] o.a.s.h.l.XMLLoader xsltCacheLifetimeSeconds=60
   [junit4]   2> 1162273 INFO  (coreLoadExecutor-4088-thread-1-processing-n:127.0.0.1:65135_) [n:127.0.0.1:65135_ c:control_collection s:shard1 r:core_node1 x:collection1] o.a.s.c.RequestHandlers Registered paths: /admin/mbeans,standard,/dump,/update/csv,/sql,/update/json/docs,/admin/luke,/export,/admin/segments,/get,/admin/system,/replication,/admin/properties,/config,/stream,/schema,/admin/plugins,/admin/logging,/update/json,/admin/ping,/admin/threads,/update,/admin/file
   [junit4]   2> 1162273 INFO  (coreLoadExecutor-4088-thread-1-processing-n:127.0.0.1:65135_) [n:127.0.0.1:65135_ c:control_collection s:shard1 r:core_node1 x:collection1] o.a.s.c.SolrCore Using default statsCache cache: org.apache.solr.search.stats.LocalStatsCache
   [junit4]   2> 1162276 INFO  (coreLoadExecutor-4088-thread-1-processing-n:127.0.0.1:65135_) [n:127.0.0.1:65135_ c:control_collection s:shard1 r:core_node1 x:collection1] o.a.s.u.UpdateHandler Using UpdateLog implementation: org.apache.solr.update.UpdateLog
   [junit4]   2> 1162276 INFO  (coreLoadExecutor-4088-thread-1-processing-n:127.0.0.1:65135_) [n:127.0.0.1:65135_ c:control_collection s:shard1 r:core_node1 x:collection1] o.a.s.u.UpdateLog Initializing UpdateLog: dataDir= defaultSyncLevel=FLUSH numRecordsToKeep=100 maxNumLogsToKeep=10 numVersionBuckets=65536
   [junit4]   2> 1162279 INFO  (coreLoadExecutor-4088-thread-1-processing-n:127.0.0.1:65135_) [n:127.0.0.1:65135_ c:control_collection s:shard1 r:core_node1 x:collection1] o.a.s.u.CommitTracker Hard AutoCommit: disabled
   [junit4]   2> 1162279 INFO  (coreLoadExecutor-4088-thread-1-processing-n:127.0.0.1:65135_) [n:127.0.0.1:65135_ c:control_collection s:shard1 r:core_node1 x:collection1] o.a.s.u.CommitTracker Soft AutoCommit: disabled
   [junit4]   2> 1162280 INFO  (coreLoadExecutor-4088-thread-1-processing-n:127.0.0.1:65135_) [n:127.0.0.1:65135_ c:control_collection s:shard1 r:core_node1 x:collection1] o.a.s.u.RandomMergePolicy RandomMergePolicy wrapping class org.apache.lucene.index.TieredMergePolicy: [TieredMergePolicy: maxMergeAtOnce=42, maxMergeAtOnceExplicit=16, maxMergedSegmentMB=62.44140625, floorSegmentMB=0.7880859375, forceMergeDeletesPctAllowed=23.58782148966673, segmentsPerTier=46.0, maxCFSSegmentSizeMB=8.796093022207999E12, noCFSRatio=1.0
   [junit4]   2> 1162280 INFO  (coreLoadExecutor-4088-thread-1-processing-n:127.0.0.1:65135_) [n:127.0.0.1:65135_ c:control_collection s:shard1 r:core_node1 x:collection1] o.a.s.c.SolrDeletionPolicy SolrDeletionPolicy.onInit: commits: num=1
   [junit4]   2> 	commit{dir=MockDirectoryWrapper(RAMDirectory@3174e7c6 lockFactory=org.apache.lucene.store.SingleInstanceLockFactory@3227c6f6),segFN=segments_1,generation=1}
   [junit4]   2> 1162280 INFO  (coreLoadExecutor-4088-thread-1-processing-n:127.0.0.1:65135_) [n:127.0.0.1:65135_ c:control_collection s:shard1 r:core_node1 x:collection1] o.a.s.c.SolrDeletionPolicy newest commit generation = 1
   [junit4]   2> 1162281 INFO  (coreLoadExecutor-4088-thread-1-processing-n:127.0.0.1:65135_) [n:127.0.0.1:65135_ c:control_collection s:shard1 r:core_node1 x:collection1] o.a.s.s.SolrIndexSearcher Opening [Searcher@a4eca03[collection1] main]
   [junit4]   2> 1162281 INFO  (coreLoadExecutor-4088-thread-1-processing-n:127.0.0.1:65135_) [n:127.0.0.1:65135_ c:control_collection s:shard1 r:core_node1 x:collection1] o.a.s.c.c.ZkStateReader Load collection config from: [/collections/control_collection]
   [junit4]   2> 1162282 INFO  (coreLoadExecutor-4088-thread-1-processing-n:127.0.0.1:65135_) [n:127.0.0.1:65135_ c:control_collection s:shard1 r:core_node1 x:collection1] o.a.s.c.c.ZkStateReader path=[/collections/control_collection] [configName]=[conf1] specified config exists in ZooKeeper
   [junit4]   2> 1162282 INFO  (coreLoadExecutor-4088-thread-1-processing-n:127.0.0.1:65135_) [n:127.0.0.1:65135_ c:control_collection s:shard1 r:core_node1 x:collection1] o.a.s.r.ManagedResourceStorage Setting up ZooKeeper-based storage for the RestManager with znodeBase: /configs/conf1
   [junit4]   2> 1162283 INFO  (coreLoadExecutor-4088-thread-1-processing-n:127.0.0.1:65135_) [n:127.0.0.1:65135_ c:control_collection s:shard1 r:core_node1 x:collection1] o.a.s.r.ManagedResourceStorage Configured ZooKeeperStorageIO with znodeBase: /configs/conf1
   [junit4]   2> 1162283 INFO  (coreLoadExecutor-4088-thread-1-processing-n:127.0.0.1:65135_) [n:127.0.0.1:65135_ c:control_collection s:shard1 r:core_node1 x:collection1] o.a.s.r.RestManager Initializing RestManager with initArgs: {}
   [junit4]   2> 1162283 INFO  (coreLoadExecutor-4088-thread-1-processing-n:127.0.0.1:65135_) [n:127.0.0.1:65135_ c:control_collection s:shard1 r:core_node1 x:collection1] o.a.s.r.ManagedResourceStorage Reading _rest_managed.json using ZooKeeperStorageIO:path=/configs/conf1
   [junit4]   2> 1162284 INFO  (coreLoadExecutor-4088-thread-1-processing-n:127.0.0.1:65135_) [n:127.0.0.1:65135_ c:control_collection s:shard1 r:core_node1 x:collection1] o.a.s.r.ManagedResourceStorage No data found for znode /configs/conf1/_rest_managed.json
   [junit4]   2> 1162284 INFO  (coreLoadExecutor-4088-thread-1-processing-n:127.0.0.1:65135_) [n:127.0.0.1:65135_ c:control_collection s:shard1 r:core_node1 x:collection1] o.a.s.r.ManagedResourceStorage Loaded null at path _rest_managed.json using ZooKeeperStorageIO:path=/configs/conf1
   [junit4]   2> 1162284 INFO  (coreLoadExecutor-4088-thread-1-processing-n:127.0.0.1:65135_) [n:127.0.0.1:65135_ c:control_collection s:shard1 r:core_node1 x:collection1] o.a.s.r.RestManager Initializing 0 registered ManagedResources
   [junit4]   2> 1162284 INFO  (coreLoadExecutor-4088-thread-1-processing-n:127.0.0.1:65135_) [n:127.0.0.1:65135_ c:control_collection s:shard1 r:core_node1 x:collection1] o.a.s.h.ReplicationHandler Commits will be reserved for  10000
   [junit4]   2> 1162285 INFO  (searcherExecutor-4089-thread-1-processing-n:127.0.0.1:65135_ x:collection1 s:shard1 c:control_collection r:core_node1) [n:127.0.0.1:65135_ c:control_collection s:shard1 r:core_node1 x:collection1] o.a.s.c.SolrCore [collection1] Registered new searcher Searcher@a4eca03[collection1] main{ExitableDirectoryReader(UninvertingDirectoryReader())}
   [junit4]   2> 1162285 INFO  (coreLoadExecutor-4088-thread-1-processing-n:127.0.0.1:65135_) [n:127.0.0.1:65135_ c:control_collection s:shard1 r:core_node1 x:collection1] o.a.s.u.UpdateLog Looking up max value of version field to seed version buckets
   [junit4]   2> 1162286 INFO  (coreLoadExecutor-4088-thread-1-processing-n:127.0.0.1:65135_) [n:127.0.0.1:65135_ c:control_collection s:shard1 r:core_node1 x:collection1] o.a.s.u.VersionInfo Refreshing highest value of _version_ for 65536 version buckets from index
   [junit4]   2> 1162286 INFO  (coreLoadExecutor-4088-thread-1-processing-n:127.0.0.1:65135_) [n:127.0.0.1:65135_ c:control_collection s:shard1 r:core_node1 x:collection1] o.a.s.u.VersionInfo No terms found for _version_, cannot seed version bucket highest value from index
   [junit4]   2> 1162286 INFO  (coreLoadExecutor-4088-thread-1-processing-n:127.0.0.1:65135_) [n:127.0.0.1:65135_ c:control_collection s:shard1 r:core_node1 x:collection1] o.a.s.u.UpdateLog Could not find max version in index or recent updates, using new clock 1535034214766870528
   [junit4]   2> 1162288 INFO  (coreLoadExecutor-4088-thread-1-processing-n:127.0.0.1:65135_) [n:127.0.0.1:65135_ c:control_collection s:shard1 r:core_node1 x:collection1] o.a.s.u.UpdateLog Took 2.0ms to seed version buckets with highest version 1535034214766870528
   [junit4]   2> 1162288 INFO  (coreLoadExecutor-4088-thread-1-processing-n:127.0.0.1:65135_) [n:127.0.0.1:65135_ c:control_collection s:shard1 r:core_node1 x:collection1] o.a.s.c.ZkController watch zkdir /configs/conf1
   [junit4]   2> 1162289 INFO  (coreLoadExecutor-4088-thread-1-processing-n:127.0.0.1:65135_) [n:127.0.0.1:65135_ c:control_collection s:shard1 r:core_node1 x:collection1] o.a.s.c.CoreContainer registering core: collection1
   [junit4]   2> 1162290 INFO  (coreZkRegister-4082-thread-1-processing-n:127.0.0.1:65135_ x:collection1 s:shard1 c:control_collection r:core_node1) [n:127.0.0.1:65135_ c:control_collection s:shard1 r:core_node1 x:collection1] o.a.s.c.ZkController Register replica - core:collection1 address:http://127.0.0.1:65135 collection:control_collection shard:shard1
   [junit4]   2> 1162291 INFO  (coreZkRegister-4082-thread-1-processing-n:127.0.0.1:65135_ x:collection1 s:shard1 c:control_collection r:core_node1) [n:127.0.0.1:65135_ c:control_collection s:shard1 r:core_node1 x:collection1] o.a.s.c.c.SolrZkClient makePath: /collections/control_collection/leader_elect/shard1/election
   [junit4]   2> 1162295 INFO  (coreZkRegister-4082-thread-1-processing-n:127.0.0.1:65135_ x:collection1 s:shard1 c:control_collection r:core_node1) [n:127.0.0.1:65135_ c:control_collection s:shard1 r:core_node1 x:collection1] o.a.s.c.LeaderElector Joined leadership election with path: /collections/control_collection/leader_elect/shard1/election/95939638291857412-core_node1-n_0000000000
   [junit4]   2> 1162296 INFO  (coreZkRegister-4082-thread-1-processing-n:127.0.0.1:65135_ x:collection1 s:shard1 c:control_collection r:core_node1) [n:127.0.0.1:65135_ c:control_collection s:shard1 r:core_node1 x:collection1] o.a.s.c.ShardLeaderElectionContext Running the leader process for shard=shard1 and weAreReplacement=false and leaderVoteWait=10000
   [junit4]   2> 1162298 INFO  (coreZkRegister-4082-thread-1-processing-n:127.0.0.1:65135_ x:collection1 s:shard1 c:control_collection r:core_node1) [n:127.0.0.1:65135_ c:control_collection s:shard1 r:core_node1 x:collection1] o.a.s.c.ShardLeaderElectionContext Enough replicas found to continue.
   [junit4]   2> 1162299 INFO  (coreZkRegister-4082-thread-1-processing-n:127.0.0.1:65135_ x:collection1 s:shard1 c:control_collection r:core_node1) [n:127.0.0.1:65135_ c:control_collection s:shard1 r:core_node1 x:collection1] o.a.s.c.ShardLeaderElectionContext I may be the new leader - try and sync
   [junit4]   2> 1162299 INFO  (coreZkRegister-4082-thread-1-processing-n:127.0.0.1:65135_ x:collection1 s:shard1 c:control_collection r:core_node1) [n:127.0.0.1:65135_ c:control_collection s:shard1 r:core_node1 x:collection1] o.a.s.c.SyncStrategy Sync replicas to http://127.0.0.1:65135/collection1/
   [junit4]   2> 1162299 INFO  (coreZkRegister-4082-thread-1-processing-n:127.0.0.1:65135_ x:collection1 s:shard1 c:control_collection r:core_node1) [n:127.0.0.1:65135_ c:control_collection s:shard1 r:core_node1 x:collection1] o.a.s.c.SyncStrategy Sync Success - now sync replicas to me
   [junit4]   2> 1162299 INFO  (coreZkRegister-4082-thread-1-processing-n:127.0.0.1:65135_ x:collection1 s:shard1 c:control_collection r:core_node1) [n:127.0.0.1:65135_ c:control_collection s:shard1 r:core_node1 x:collection1] o.a.s.c.SyncStrategy http://127.0.0.1:65135/collection1/ has no replicas
   [junit4]   2> 1162299 INFO  (OverseerStateUpdate-95939638291857412-127.0.0.1:65135_-n_0000000000) [n:127.0.0.1:65135_    ] o.a.s.c.Overseer processMessage: queueSize: 1, message = {
   [junit4]   2>   "operation":"leader",
   [junit4]   2>   "shard":"shard1",
   [junit4]   2>   "collection":"control_collection"} current state version: 1
   [junit4]   2> 1162300 INFO  (coreZkRegister-4082-thread-1-processing-n:127.0.0.1:65135_ x:collection1 s:shard1 c:control_collection r:core_node1) [n:127.0.0.1:65135_ c:control_collection s:shard1 r:core_node1 x:collection1] o.a.s.c.c.SolrZkClient makePath: /collections/control_collection/leaders/shard1
   [junit4]   2> 1162303 INFO  (coreZkRegister-4082-thread-1-processing-n:127.0.0.1:65135_ x:collection1 s:shard1 c:control_collection r:core_node1) [n:127.0.0.1:65135_ c:control_collection s:shard1 r:core_node1 x:collection1] o.a.s.c.ShardLeaderElectionContextBase Creating leader registration node /collections/control_collection/leaders/shard1/leader after winning as /collections/control_collection/leader_elect/shard1/election/95939638291857412-core_node1-n_0000000000
   [junit4]   2> 1162306 INFO  (coreZkRegister-4082-thread-1-processing-n:127.0.0.1:65135_ x:collection1 s:shard1 c:control_collection r:core_node1) [n:127.0.0.1:65135_ c:control_collection s:shard1 r:core_node1 x:collection1] o.a.s.c.ShardLeaderElectionContext I am the new leader: http://127.0.0.1:65135/collection1/ shard1
   [junit4]   2> 1162307 INFO  (OverseerStateUpdate-95939638291857412-127.0.0.1:65135_-n_0000000000) [n:127.0.0.1:65135_    ] o.a.s.c.Overseer processMessage: queueSize: 1, message = {
   [junit4]   2>   "operation":"leader",
   [junit4]   2>   "shard":"shard1",
   [junit4]   2>   "collection":"control_collection",
   [junit4]   2>   "base_url":"http://127.0.0.1:65135",
   [junit4]   2>   "core":"collection1",
   [junit4]   2>   "state":"active"} current state version: 1
   [junit4]   2> 1162411 INFO  (zkCallback-1398-thread-1-processing-n:127.0.0.1:65135_) [n:127.0.0.1:65135_    ] o.a.s.c.c.ZkStateReader A cluster state change: [WatchedEvent state:SyncConnected type:NodeDataChanged path:/clusterstate.json], has occurred - updating... (live nodes size: [1])
   [junit4]   2> 1162459 INFO  (coreZkRegister-4082-thread-1-processing-n:127.0.0.1:65135_ x:collection1 s:shard1 c:control_collection r:core_node1) [n:127.0.0.1:65135_ c:control_collection s:shard1 r:core_node1 x:collection1] o.a.s.c.ZkController We are http://127.0.0.1:65135/collection1/ and leader is http://127.0.0.1:65135/collection1/
   [junit4]   2> 1162459 INFO  (coreZkRegister-4082-thread-1-processing-n:127.0.0.1:65135_ x:collection1 s:shard1 c:control_collection r:core_node1) [n:127.0.0.1:65135_ c:control_collection s:shard1 r:core_node1 x:collection1] o.a.s.c.ZkController No LogReplay needed for core=collection1 baseURL=http://127.0.0.1:65135
   [junit4]   2> 1162459 INFO  (coreZkRegister-4082-thread-1-processing-n:127.0.0.1:65135_ x:collection1 s:shard1 c:control_collection r:core_node1) [n:127.0.0.1:65135_ c:control_collection s:shard1 r:core_node1 x:collection1] o.a.s.c.ZkController I am the leader, no recovery necessary
   [junit4]   2> 1162459 INFO  (coreZkRegister-4082-thread-1-processing-n:127.0.0.1:65135_ x:collection1 s:shard1 c:control_collection r:core_node1) [n:127.0.0.1:65135_ c:control_collection s:shard1 r:core_node1 x:collection1] o.a.s.c.ZkController publishing state=active
   [junit4]   2> 1162459 INFO  (coreZkRegister-4082-thread-1-processing-n:127.0.0.1:65135_ x:collection1 s:shard1 c:control_collection r:core_node1) [n:127.0.0.1:65135_ c:control_collection s:shard1 r:core_node1 x:collection1] o.a.s.c.ZkController numShards not found on descriptor - reading it from system property
   [junit4]   2> 1162462 INFO  (OverseerStateUpdate-95939638291857412-127.0.0.1:65135_-n_0000000000) [n:127.0.0.1:65135_    ] o.a.s.c.Overseer processMessage: queueSize: 1, message = {
   [junit4]   2>   "core":"collection1",
   [junit4]   2>   "core_node_name":"core_node1",
   [junit4]   2>   "roles":null,
   [junit4]   2>   "base_url":"http://127.0.0.1:65135",
   [junit4]   2>   "node_name":"127.0.0.1:65135_",
   [junit4]   2>   "numShards":"1",
   [junit4]   2>   "state":"active",
   [junit4]   2>   "shard":"shard1",
   [junit4]   2>   "collection":"control_collection",
   [junit4]   2>   "operation":"state"} current state version: 2
   [junit4]   2> 1162463 INFO  (coreZkRegister-4082-thread-1-processing-n:127.0.0.1:65135_ x:collection1 s:shard1 c:control_collection r:core_node1) [n:127.0.0.1:65135_ c:control_collection s:shard1 r:core_node1 x:collection1] o.a.s.c.c.ZkStateReader Updated live nodes from ZooKeeper... (1) -> (1)
   [junit4]   2> 1162463 INFO  (OverseerStateUpdate-95939638291857412-127.0.0.1:65135_-n_0000000000) [n:127.0.0.1:65135_    ] o.a.s.c.o.ReplicaMutator Update state numShards=1 message={
   [junit4]   2>   "core":"collection1",
   [junit4]   2>   "core_node_name":"core_node1",
   [junit4]   2>   "roles":null,
   [junit4]   2>   "base_url":"http://127.0.0.1:65135",
   [junit4]   2>   "node_name":"127.0.0.1:65135_",
   [junit4]   2>   "numShards":"1",
   [junit4]   2>   "state":"active",
   [junit4]   2>   "shard":"shard1",
   [junit4]   2>   "collection":"control_collection",
   [junit4]   2>   "operation":"state"}
   [junit4]   2> 1162516 INFO  (TEST-TestReqParamsAPI.test-seed#[21F9A04D1A9C912D]) [    ] o.a.s.c.c.SolrZkClient Using default ZkCredentialsProvider
   [junit4]   2> 1162519 INFO  (TEST-TestReqParamsAPI.test-seed#[21F9A04D1A9C912D]) [    ] o.a.s.c.c.ConnectionManager Waiting for client to connect to ZooKeeper
   [junit4]   2> 1162521 INFO  (zkCallback-1400-thread-1) [    ] o.a.s.c.c.ConnectionManager Watcher org.apache.solr.common.cloud.ConnectionManager@690b559e name:ZooKeeperConnection Watcher:127.0.0.1:65128/solr got event WatchedEvent state:SyncConnected type:None path:null path:null type:None
   [junit4]   2> 1162521 INFO  (TEST-TestReqParamsAPI.test-seed#[21F9A04D1A9C912D]) [    ] o.a.s.c.c.ConnectionManager Client is connected to ZooKeeper
   [junit4]   2> 1162521 INFO  (TEST-TestReqParamsAPI.test-seed#[21F9A04D1A9C912D]) [    ] o.a.s.c.c.SolrZkClient Using default ZkACLProvider
   [junit4]   2> 1162521 INFO  (TEST-TestReqParamsAPI.test-seed#[21F9A04D1A9C912D]) [    ] o.a.s.c.c.ZkStateReader Updating cluster state from ZooKeeper... 
   [junit4]   2> 1162524 INFO  (TEST-TestReqParamsAPI.test-seed#[21F9A04D1A9C912D]) [    ] o.a.s.c.c.ZkStateReader Updated live nodes from ZooKeeper... (0) -> (1)
   [junit4]   2> 1162525 INFO  (TEST-TestReqParamsAPI.test-seed#[21F9A04D1A9C912D]) [    ] o.a.s.c.ChaosMonkey monkey: init - expire sessions:false cause connection loss:false
   [junit4]   2> 1162525 INFO  (TEST-TestReqParamsAPI.test-seed#[21F9A04D1A9C912D]) [    ] o.a.s.c.AbstractFullDistribZkTestBase Creating collection1 with stateFormat=2
   [junit4]   2> 1162525 INFO  (TEST-TestReqParamsAPI.test-seed#[21F9A04D1A9C912D]) [    ] o.a.s.c.c.SolrZkClient Using default ZkCredentialsProvider
   [junit4]   2> 1162526 INFO  (TEST-TestReqParamsAPI.test-seed#[21F9A04D1A9C912D]) [    ] o.a.s.c.c.ConnectionManager Waiting for client to connect to ZooKeeper
   [junit4]   2> 1162534 INFO  (zkCallback-1401-thread-1) [    ] o.a.s.c.c.ConnectionManager Watcher org.apache.solr.common.cloud.ConnectionManager@693d9d2e name:ZooKeeperConnection Watcher:127.0.0.1:65128/solr got event WatchedEvent state:SyncConnected type:None path:null path:null type:None
   [junit4]   2> 1162535 INFO  (TEST-TestReqParamsAPI.test-seed#[21F9A04D1A9C912D]) [    ] o.a.s.c.c.ConnectionManager Client is connected to ZooKeeper
   [junit4]   2> 1162535 INFO  (TEST-TestReqParamsAPI.test-seed#[21F9A04D1A9C912D]) [    ] o.a.s.c.c.SolrZkClient Using default ZkACLProvider
   [junit4]   2> 1162538 WARN  (NIOServerCxn.Factory:0.0.0.0/0.0.0.0:0) [    ] o.a.z.s.NIOServerCnxn caught end of stream exception
   [junit4]   2> EndOfStreamException: Unable to read additional data from client sessionid 0x154d897bc440006, likely client has closed socket
   [junit4]   2> 	at org.apache.zookeeper.server.NIOServerCnxn.doIO(NIOServerCnxn.java:228)
   [junit4]   2> 	at org.apache.zookeeper.server.NIOServerCnxnFactory.run(NIOServerCnxnFactory.java:208)
   [junit4]   2> 	at java.lang.Thread.run(Thread.java:745)
   [junit4]   2> 1162538 INFO  (OverseerStateUpdate-95939638291857412-127.0.0.1:65135_-n_0000000000) [n:127.0.0.1:65135_    ] o.a.s.c.Overseer processMessage: queueSize: 1, message = {
   [junit4]   2>   "operation":"create",
   [junit4]   2>   "name":"collection1",
   [junit4]   2>   "numShards":"2",
   [junit4]   2>   "stateFormat":"2"} current state version: 2
   [junit4]   2> 1162538 INFO  (OverseerStateUpdate-95939638291857412-127.0.0.1:65135_-n_0000000000) [n:127.0.0.1:65135_    ] o.a.s.c.o.ClusterStateMutator building a new cName: collection1
   [junit4]   2> 1162540 INFO  (zkCallback-1398-thread-1-processing-n:127.0.0.1:65135_) [n:127.0.0.1:65135_    ] o.a.s.c.c.ZkStateReader A cluster state change: [WatchedEvent state:SyncConnected type:NodeDataChanged path:/clusterstate.json], has occurred - updating... (live nodes size: [1])
   [junit4]   2> 1162540 INFO  (zkCallback-1400-thread-1) [    ] o.a.s.c.c.ZkStateReader A cluster state change: [WatchedEvent state:SyncConnected type:NodeDataChanged path:/clusterstate.json], has occurred - updating... (live nodes size: [1])
   [junit4]   2> 1162656 INFO  (OverseerStateUpdate-95939638291857412-127.0.0.1:65135_-n_0000000000) [n:127.0.0.1:65135_    ] o.a.s.c.o.ZkStateWriter going to create_collection /collections/collection1/state.json
   [junit4]   2> 1163164 INFO  (TEST-TestReqParamsAPI.test-seed#[21F9A04D1A9C912D]) [    ] o.a.s.SolrTestCaseJ4 Writing core.properties file to C:\Users\jenkins\workspace\Lucene-Solr-6.0-Windows\solr\build\solr-core\test\J1\temp\solr.handler.TestReqParamsAPI_21F9A04D1A9C912D-001\shard-1-001\cores\collection1
   [junit4]   2> 1163167 INFO  (TEST-TestReqParamsAPI.test-seed#[21F9A04D1A9C912D]) [    ] o.a.s.c.AbstractFullDistribZkTestBase create jetty 1 in directory C:\Users\jenkins\workspace\Lucene-Solr-6.0-Windows\solr\build\solr-core\test\J1\temp\solr.handler.TestReqParamsAPI_21F9A04D1A9C912D-001\shard-1-001
   [junit4]   2> 1163167 INFO  (TEST-TestReqParamsAPI.test-seed#[21F9A04D1A9C912D]) [    ] o.e.j.s.Server jetty-9.3.8.v20160314
   [junit4]   2> 1163168 INFO  (TEST-TestReqParamsAPI.test-seed#[21F9A04D1A9C912D]) [    ] o.e.j.s.h.ContextHandler Started o.e.j.s.ServletContextHandler@523de2c5{/,null,AVAILABLE}
   [junit4]   2> 1163170 INFO  (TEST-TestReqParamsAPI.test-seed#[21F9A04D1A9C912D]) [    ] o.e.j.s.ServerConnector Started ServerConnector@19d8f9db{HTTP/1.1,[http/1.1]}{127.0.0.1:65158}
   [junit4]   2> 1163170 INFO  (TEST-TestReqParamsAPI.test-seed#[21F9A04D1A9C912D]) [    ] o.e.j.s.Server Started @1169577ms
   [junit4]   2> 1163170 INFO  (TEST-TestReqParamsAPI.test-seed#[21F9A04D1A9C912D]) [    ] o.a.s.c.s.e.JettySolrRunner Jetty properties: {solr.data.dir=C:\Users\jenkins\workspace\Lucene-Solr-6.0-Windows\solr\build\solr-core\test\J1\temp\solr.handler.TestReqParamsAPI_21F9A04D1A9C912D-001\tempDir-001/jetty1, solrconfig=solrconfig.xml, hostContext=/, hostPort=65158, coreRootDirectory=C:\Users\jenkins\workspace\Lucene-Solr-6.0-Windows\solr\build\solr-core\test\J1\temp\solr.handler.TestReqParamsAPI_21F9A04D1A9C912D-001\shard-1-001\cores}
   [junit4]   2> 1163171 INFO  (TEST-TestReqParamsAPI.test-seed#[21F9A04D1A9C912D]) [    ] o.a.s.s.SolrDispatchFilter SolrDispatchFilter.init(): sun.misc.Launcher$AppClassLoader@73d16e93
   [junit4]   2> 1163171 INFO  (TEST-TestReqParamsAPI.test-seed#[21F9A04D1A9C912D]) [    ] o.a.s.c.SolrResourceLoader new SolrResourceLoader for directory: 'C:\Users\jenkins\workspace\Lucene-Solr-6.0-Windows\solr\build\solr-core\test\J1\temp\solr.handler.TestReqParamsAPI_21F9A04D1A9C912D-001\shard-1-001'
   [junit4]   2> 1163171 INFO  (TEST-TestReqParamsAPI.test-seed#[21F9A04D1A9C912D]) [    ] o.a.s.c.SolrResourceLoader JNDI not configured for solr (NoInitialContextEx)
   [junit4]   2> 1163171 INFO  (TEST-TestReqParamsAPI.test-seed#[21F9A04D1A9C912D]) [    ] o.a.s.c.SolrResourceLoader solr home defaulted to 'solr/' (could not find system property or JNDI)
   [junit4]   2> 1163172 INFO  (TEST-TestReqParamsAPI.test-seed#[21F9A04D1A9C912D]) [    ] o.a.s.c.c.SolrZkClient Using default ZkCredentialsProvider
   [junit4]   2> 1163172 INFO  (TEST-TestReqParamsAPI.test-seed#[21F9A04D1A9C912D]) [    ] o.a.s.c.c.ConnectionManager Waiting for client to connect to ZooKeeper
   [junit4]   2> 1163174 INFO  (zkCallback-1402-thread-1) [    ] o.a.s.c.c.ConnectionManager Watcher org.apache.solr.common.cloud.ConnectionManager@2c2e3ca0 name:ZooKeeperConnection Watcher:127.0.0.1:65128/solr got event WatchedEvent state:SyncConnected type:None path:null path:null type:None
   [junit4]   2> 1163174 INFO  (TEST-TestReqParamsAPI.test-seed#[21F9A04D1A9C912D]) [    ] o.a.s.c.c.ConnectionManager Client is connected to ZooKeeper
   [junit4]   2> 1163174 INFO  (TEST-TestReqParamsAPI.test-seed#[21F9A04D1A9C912D]) [    ] o.a.s.c.c.SolrZkClient Using default ZkACLProvider
   [junit4]   2> 1163175 WARN  (NIOServerCxn.Factory:0.0.0.0/0.0.0.0:0) [    ] o.a.z.s.NIOServerCnxn caught end of stream exception
   [junit4]   2> EndOfStreamException: Unable to read additional data from client sessionid 0x154d897bc440007, likely client has closed socket
   [junit4]   2> 	at org.apache.zookeeper.server.NIOServerCnxn.doIO(NIOServerCnxn.java:228)
   [junit4]   2> 	at org.apache.zookeeper.server.NIOServerCnxnFactory.run(NIOServerCnxnFactory.java:208)
   [junit4]   2> 	at java.lang.Thread.run(Thread.java:745)
   [junit4]   2> 1163177 INFO  (TEST-TestReqParamsAPI.test-seed#[21F9A04D1A9C912D]) [    ] o.a.s.s.SolrDispatchFilter Loading solr.xml from SolrHome (not found in ZooKeeper)
   [junit4]   2> 1163177 INFO  (TEST-TestReqParamsAPI.test-seed#[21F9A04D1A9C912D]) [    ] o.a.s.c.SolrXmlConfig Loading container configuration from C:\Users\jenkins\workspace\Lucene-Solr-6.0-Windows\solr\build\solr-core\test\J1\temp\solr.handler.TestReqParamsAPI_21F9A04D1A9C912D-001\shard-1-001\solr.xml
   [junit4]   2> 1163186 INFO  (TEST-TestReqParamsAPI.test-seed#[21F9A04D1A9C912D]) [    ] o.a.s.c.CorePropertiesLocator Config-defined core root directory: C:\Users\jenkins\workspace\Lucene-Solr-6.0-Windows\solr\build\solr-core\test\J1\temp\solr.handler.TestReqParamsAPI_21F9A04D1A9C912D-001\shard-1-001\cores
   [junit4]   2> 1163186 INFO  (TEST-TestReqParamsAPI.test-seed#[21F9A04D1A9C912D]) [    ] o.a.s.c.CoreContainer New CoreContainer 1674405702
   [junit4]   2> 1163186 INFO  (TEST-TestReqParamsAPI.test-seed#[21F9A04D1A9C912D]) [    ] o.a.s.c.CoreContainer Loading cores into CoreContainer [instanceDir=C:\Users\jenkins\workspace\Lucene-Solr-6.0-Windows\solr\build\solr-core\test\J1\temp\solr.handler.TestReqParamsAPI_21F9A04D1A9C912D-001\shard-1-001]
   [junit4]   2> 1163186 WARN  (TEST-TestReqParamsAPI.test-seed#[21F9A04D1A9C912D]) [    ] o.a.s.c.CoreContainer Couldn't add files from C:\Users\jenkins\workspace\Lucene-Solr-6.0-Windows\solr\build\solr-core\test\J1\temp\solr.handler.TestReqParamsAPI_21F9A04D1A9C912D-001\shard-1-001\lib to classpath: C:\Users\jenkins\workspace\Lucene-Solr-6.0-Windows\solr\build\solr-core\test\J1\temp\solr.handler.TestReqParamsAPI_21F9A04D1A9C912D-001\shard-1-001\lib
   [junit4]   2> 1163187 INFO  (TEST-TestReqParamsAPI.test-seed#[21F9A04D1A9C912D]) [    ] o.a.s.h.c.HttpShardHandlerFactory created with socketTimeout : 90000,urlScheme : ,connTimeout : 15000,maxConnectionsPerHost : 20,maxConnections : 10000,corePoolSize : 0,maximumPoolSize : 2147483647,maxThreadIdleTime : 5,sizeOfQueue : -1,fairnessPolicy : false,useRetries : false,
   [junit4]   2> 1163190 INFO  (TEST-TestReqParamsAPI.test-seed#[21F9A04D1A9C912D]) [    ] o.a.s.u.UpdateShardHandler Creating UpdateShardHandler HTTP client with params: socketTimeout=340000&connTimeout=45000&retry=true
   [junit4]   2> 1163191 INFO  (TEST-TestReqParamsAPI.test-seed#[21F9A04D1A9C912D]) [    ] o.a.s.l.LogWatcher SLF4J impl is org.slf4j.impl.Log4jLoggerFactory
   [junit4]   2> 1163191 INFO  (TEST-TestReqParamsAPI.test-seed#[21F9A04D1A9C912D]) [    ] o.a.s.l.LogWatcher Registering Log Listener [Log4j (org.slf4j.impl.Log4jLoggerFactory)]
   [junit4]   2> 1163191 INFO  (TEST-TestReqParamsAPI.test-seed#[21F9A04D1A9C912D]) [    ] o.a.s.c.ZkContainer Zookeeper client=127.0.0.1:65128/solr
   [junit4]   2> 1163191 INFO  (TEST-TestReqParamsAPI.test-seed#[21F9A04D1A9C912D]) [    ] o.a.s.c.ZkController zkHost includes chroot
   [junit4]   2> 1163191 INFO  (TEST-TestReqParamsAPI.test-seed#[21F9A04D1A9C912D]) [    ] o.a.s.c.c.SolrZkClient Using default ZkCredentialsProvider
   [junit4]   2> 1163192 INFO  (TEST-TestReqParamsAPI.test-seed#[21F9A04D1A9C912D]) [    ] o.a.s.c.c.ConnectionManager Waiting for client to connect to ZooKeeper
   [junit4]   2> 1163194 INFO  (zkCallback-1405-thread-1) [    ] o.a.s.c.c.ConnectionManager Watcher org.apache.solr.common.cloud.ConnectionManager@33dd2e0e name:ZooKeeperConnection Watcher:127.0.0.1:65128 got event WatchedEvent state:SyncConnected type:None path:null path:null type:None
   [junit4]   2> 1163194 INFO  (TEST-TestReqParamsAPI.test-seed#[21F9A04D1A9C912D]) [    ] o.a.s.c.c.ConnectionManager Client is connected to ZooKeeper
   [junit4]   2> 1163194 INFO  (TEST-TestReqParamsAPI.test-seed#[21F9A04D1A9C912D]) [    ] o.a.s.c.c.SolrZkClient Using default ZkACLProvider
   [junit4]   2> 1163197 INFO  (TEST-TestReqParamsAPI.test-seed#[21F9A04D1A9C912D]) [n:127.0.0.1:65158_    ] o.a.s.c.ZkController Added new OnReconnect listener org.apache.solr.cloud.ZkController$$Lambda$32/447552652@20bde230
   [junit4]   2> 1163199 INFO  (TEST-TestReqParamsAPI.test-seed#[21F9A04D1A9C912D]) [n:127.0.0.1:65158_    ] o.a.s.c.c.ConnectionManager Waiting for client to connect to ZooKeeper
   [junit4]   2> 1163200 INFO  (zkCallback-1406-thread-1-processing-n:127.0.0.1:65158_) [n:127.0.0.1:65158_    ] o.a.s.c.c.ConnectionManager Watcher org.apache.solr.common.cloud.ConnectionManager@1e9f9997 name:ZooKeeperConnection Watcher:127.0.0.1:65128/solr got event WatchedEvent state:SyncConnected type:None path:null path:null type:None
   [junit4]   2> 1163200 INFO  (TEST-TestReqParamsAPI.test-seed#[21F9A04D1A9C912D]) [n:127.0.0.1:65158_    ] o.a.s.c.c.ConnectionManager Client is connected to ZooKeeper
   [junit4]   2> 1163211 INFO  (TEST-TestReqParamsAPI.test-seed#[21F9A04D1A9C912D]) [n:127.0.0.1:65158_    ] o.a.s.c.c.ZkStateReader Updating cluster state from ZooKeeper... 
   [junit4]   2> 1163214 INFO  (TEST-TestReqParamsAPI.test-seed#[21F9A04D1A9C912D]) [n:127.0.0.1:65158_    ] o.a.s.c.c.ZkStateReader Updated live nodes from ZooKeeper... (0) -> (1)
   [junit4]   2> 1163217 INFO  (TEST-TestReqParamsAPI.test-seed#[21F9A04D1A9C912D]) [n:127.0.0.1:65158_    ] o.a.s.c.Overseer Overseer (id=null) closing
   [junit4]   2> 1163218 INFO  (TEST-TestReqParamsAPI.test-seed#[21F9A04D1A9C912D]) [n:127.0.0.1:65158_    ] o.a.s.c.LeaderElector Joined leadership election with path: /overseer_elect/election/95939638291857417-127.0.0.1:65158_-n_0000000001
   [junit4]   2> 1163219 INFO  (TEST-TestReqParamsAPI.test-seed#[21F9A04D1A9C912D]) [n:127.0.0.1:65158_    ] o.a.s.c.LeaderElector Watching path /overseer_elect/election/95939638291857412-127.0.0.1:65135_-n_0000000000 to know if I could be the leader
   [junit4]   2> 1163219 INFO  (TEST-TestReqParamsAPI.test-seed#[21F9A04D1A9C912D]) [n:127.0.0.1:65158_    ] o.a.s.c.ZkController Publish node=127.0.0.1:65158_ as DOWN
   [junit4]   2> 1163223 INFO  (OverseerStateUpdate-95939638291857412-127.0.0.1:65135_-n_0000000000) [n:127.0.0.1:65135_    ] o.a.s.c.Overseer processMessage: queueSize: 1, message = {
   [junit4]   2>   "operation":"downnode",
   [junit4]   2>   "node_name":"127.0.0.1:65158_"} current state version: 3
   [junit4]   2> 1163223 INFO  (OverseerStateUpdate-95939638291857412-127.0.0.1:65135_-n_0000000000) [n:127.0.0.1:65135_    ] o.a.s.c.o.NodeMutator DownNode state invoked for node: 127.0.0.1:65158_
   [junit4]   2> 1163223 INFO  (OverseerStateUpdate-95939638291857412-127.0.0.1:65135_-n_0000000000) [n:127.0.0.1:65135_    ] o.a.s.c.o.ZkStateWriter going to update_collection /collections/collection1/state.json version: 0
   [junit4]   2> 1163331 INFO  (zkCallback-1398-thread-1-processing-n:127.0.0.1:65135_) [n:127.0.0.1:65135_    ] o.a.s.c.c.ZkStateReader A cluster state change: [WatchedEvent state:SyncConnected type:NodeDataChanged path:/clusterstate.json], has occurred - updating... (live nodes size: [1])
   [junit4]   2> 1163331 INFO  (zkCallback-1400-thread-1) [    ] o.a.s.c.c.ZkStateReader A cluster state change: [WatchedEvent state:SyncConnected type:NodeDataChanged path:/clusterstate.json], has occurred - updating... (live nodes size: [1])
   [junit4]   2> 1163331 INFO  (zkCallback-1406-thread-1-processing-n:127.0.0.1:65158_) [n:127.0.0.1:65158_    ] o.a.s.c.c.ZkStateReader A cluster state change: [WatchedEvent state:SyncConnected type:NodeDataChanged path:/clusterstate.json], has occurred - updating... (live nodes size: [1])
   [junit4]   2> 1164224 INFO  (TEST-TestReqParamsAPI.test-seed#[21F9A04D1A9C912D]) [n:127.0.0.1:65158_    ] o.a.s.c.ZkController Register node as live in ZooKeeper:/live_nodes/127.0.0.1:65158_
   [junit4]   2> 1164224 INFO  (TEST-TestReqParamsAPI.test-seed#[21F9A04D1A9C912D]) [n:127.0.0.1:65158_    ] o.a.s.c.c.SolrZkClient makePath: /live_nodes/127.0.0.1:65158_
   [junit4]   2> 1164226 INFO  (zkCallback-1398-thread-1-processing-n:127.0.0.1:65135_) [n:127.0.0.1:65135_    ] o.a.s.c.c.ZkStateReader A live node change: [WatchedEvent state:SyncConnected type:NodeChildrenChanged path:/live_nodes], has occurred - updating... (live nodes size: [1])
   [junit4]   2> 1164226 INFO  (zkCallback-1406-thread-1-processing-n:127.0.0.1:65158_) [n:127.0.0.1:65158_    ] o.a.s.c.c.ZkStateReader A live node change: [WatchedEvent state:SyncConnected type:NodeChildrenChanged path:/live_nodes], has occurred - updating... (live nodes size: [1])
   [junit4]   2> 1164226 INFO  (zkCallback-1400-thread-1) [    ] o.a.s.c.c.ZkStateReader A live node change: [WatchedEvent state:SyncConnected type:NodeChildrenChanged path:/live_nodes], has occurred - updating... (live nodes size: [1])
   [junit4]   2> 1164226 INFO  (zkCallback-1398-thread-1-processing-n:127.0.0.1:65135_) [n:127.0.0.1:65135_    ] o.a.s.c.c.ZkStateReader Updated live nodes from ZooKeeper... (1) -> (2)
   [junit4]   2> 1164226 INFO  (zkCallback-1406-thread-1-processing-n:127.0.0.1:65158_) [n:127.0.0.1:65158_    ] o.a.s.c.c.ZkStateReader Updated live nodes from ZooKeeper... (1) -> (2)
   [junit4]   2> 1164226 INFO  (zkCallback-1400-thread-1) [    ] o.a.s.c.c.ZkStateReader Updated live nodes from ZooKeeper... (1) -> (2)
   [junit4]   2> 1164236 INFO  (TEST-TestReqParamsAPI.test-seed#[21F9A04D1A9C912D]) [n:127.0.0.1:65158_    ] o.a.s.c.CoreContainer Security conf doesn't exist. Skipping setup for authorization module.
   [junit4]   2> 1164236 INFO  (TEST-TestReqParamsAPI.test-seed#[21F9A04D1A9C912D]) [n:127.0.0.1:65158_    ] o.a.s.c.CoreContainer No authentication plugin used.
   [junit4]   2> 1164236 INFO  (TEST-TestReqParamsAPI.test-seed#[21F9A04D1A9C912D]) [n:127.0.0.1:65158_    ] o.a.s.c.CorePropertiesLocator Looking for core definitions underneath C:\Users\jenkins\workspace\Lucene-Solr-6.0-Windows\solr\build\solr-core\test\J1\temp\solr.handler.TestReqParamsAPI_21F9A04D1A9C912D-001\shard-1-001\cores
   [junit4]   2> 1164238 INFO  (TEST-TestReqParamsAPI.test-seed#[21F9A04D1A9C912D]) [n:127.0.0.1:65158_    ] o.a.s.c.CoreDescriptor Created CoreDescriptor: {name=collection1, config=solrconfig.xml, transient=false, schema=schema.xml, loadOnStartup=true, configSetProperties=configsetprops.json, collection=collection1, coreNodeName=, dataDir=data\, shard=}
   [junit4]   2> 1164238 INFO  (TEST-TestReqParamsAPI.test-seed#[21F9A04D1A9C912D]) [n:127.0.0.1:65158_    ] o.a.s.c.CorePropertiesLocator Found core collection1 in C:\Users\jenkins\workspace\Lucene-Solr-6.0-Windows\solr\build\solr-core\test\J1\temp\solr.handler.TestReqParamsAPI_21F9A04D1A9C912D-001\shard-1-001\cores\collection1
   [junit4]   2> 1164238 INFO  (TEST-TestReqParamsAPI.test-seed#[21F9A04D1A9C912D]) [n:127.0.0.1:65158_    ] o.a.s.c.CorePropertiesLocator Found 1 core definitions
   [junit4]   2> 1164239 INFO  (TEST-TestReqParamsAPI.test-seed#[21F9A04D1A9C912D]) [n:127.0.0.1:65158_    ] o.a.s.s.SolrDispatchFilter user.dir=C:\Users\jenkins\workspace\Lucene-Solr-6.0-Windows\solr\build\solr-core\test\J1
   [junit4]   2> 1164239 INFO  (TEST-TestReqParamsAPI.test-seed#[21F9A04D1A9C912D]) [n:127.0.0.1:65158_    ] o.a.s.s.SolrDispatchFilter SolrDispatchFilter.init() done
   [junit4]   2> 1164240 INFO  (coreLoadExecutor-4099-thread-1-processing-n:127.0.0.1:65158_) [n:127.0.0.1:65158_ c:collection1   x:collection1] o.a.s.c.ZkController publishing state=down
   [junit4]   2> 1164240 INFO  (coreLoadExecutor-4099-thread-1-processing-n:127.0.0.1:65158_) [n:127.0.0.1:65158_ c:collection1   x:collection1] o.a.s.c.ZkController numShards not found on descriptor - reading it from system property
   [junit4]   2> 1164242 INFO  (coreLoadExecutor-4099-thread-1-processing-n:127.0.0.1:65158_) [n:127.0.0.1:65158_ c:collection1   x:collection1] o.a.s.c.ZkController Registering watch for collection collection1
   [junit4]   2> 1164242 INFO  (OverseerStateUpdate-95939638291857412-127.0.0.1:65135_-n_0000000000) [n:127.0.0.1:65135_    ] o.a.s.c.Overseer processMessage: queueSize: 1, message = {
   [junit4]   2>   "core":"collection1",
   [junit4]   2>   "roles":null,
   [junit4]   2>   "base_url":"http://127.0.0.1:65158",
   [junit4]   2>   "node_name":"127.0.0.1:65158_",
   [junit4]   2>   "numShards":"2",
   [junit4]   2>   "state":"down",
   [junit4]   2>   "shard":null,
   [junit4]   2>   "collection":"collection1",
   [junit4]   2>   "operation":"state"} current state version: 4
   [junit4]   2> 1164242 INFO  (coreLoadExecutor-4099-thread-1-processing-n:127.0.0.1:65158_) [n:127.0.0.1:65158_ c:collection1   x:collection1] o.a.s.c.c.ZkStateReader addZkWatch [collection1]
   [junit4]   2> 1164242 INFO  (coreLoadExecutor-4099-thread-1-processing-n:127.0.0.1:65158_) [n:127.0.0.1:65158_ c:collection1   x:collection1] o.a.s.c.c.ZkStateReader Add data for [collection1] ver [1]
   [junit4]   2> 1164242 INFO  (coreLoadExecutor-4099-thread-1-processing-n:127.0.0.1:65158_) [n:127.0.0.1:65158_ c:collection1   x:collection1] o.a.s.c.ZkController look for our core node name
   [junit4]   2> 1164243 INFO  (OverseerStateUpdate-95939638291857412-127.0.0.1:65135_-n_0000000000) [n:127.0.0.1:65135_    ] o.a.s.c.o.ReplicaMutator Update state numShards=2 message={
   [junit4]   2>   "core":"collection1",
   [junit4]   2>   "roles":null,
   [junit4]   2>   "base_url":"http://127.0.0.1:65158",
   [junit4]   2>   "node_name":"127.0.0.1:65158_",
   [junit4]   2>   "numShards":"2",
   [junit4]   2>   "state":"down",
   [junit4]   2>   "shard":null,
   [junit4]   2>   "collection":"collection1",
   [junit4]   2>   "operation":"state"}
   [junit4]   2> 1164243 INFO  (OverseerStateUpdate-95939638291857412-127.0.0.1:65135_-n_0000000000) [n:127.0.0.1:65135_    ] o.a.s.c.o.ReplicaMutator Collection already exists with numShards=2
   [junit4]   2> 1164243 INFO  (OverseerStateUpdate-95939638291857412-127.0.0.1:65135_-n_0000000000) [n:127.0.0.1:65135_    ] o.a.s.c.o.ReplicaMutator Assigning new node to shard shard=shard2
   [junit4]   2> 1164347 INFO  (OverseerStateUpdate-95939638291857412-127.0.0.1:65135_-n_0000000000) [n:127.0.0.1:65135_    ] o.a.s.c.o.ZkStateWriter going to update_collection /collections/collection1/state.json version: 1
   [junit4]   2> 1164348 INFO  (zkCallback-1406-thread-1-processing-n:127.0.0.1:65158_) [n:127.0.0.1:65158_    ] o.a.s.c.c.ZkStateReader A cluster state change: [WatchedEvent state:SyncConnected type:NodeDataChanged path:/collections/collection1/state.json] for collection [collection1] has occurred - updating... (live nodes size: [2])
   [junit4]   2> 1164348 INFO  (zkCallback-1406-thread-1-processing-n:127.0.0.1:65158_) [n:127.0.0.1:65158_    ] o.a.s.c.c.ZkStateReader Updating data for [collection1] from [1] to [2]
   [junit4]   2> 1165244 INFO  (coreLoadExecutor-4099-thread-1-processing-n:127.0.0.1:65158_) [n:127.0.0.1:65158_ c:collection1   x:collection1] o.a.s.c.ZkController waiting to find shard id in clusterstate for collection1
   [junit4]   2> 1165244 INFO  (coreLoadExecutor-4099-thread-1-processing-n:127.0.0.1:65158_) [n:127.0.0.1:65158_ c:collection1   x:collection1] o.a.s.c.ZkController Check for collection zkNode:collection1
   [junit4]   2> 1165244 INFO  (coreLoadExecutor-4099-thread-1-processing-n:127.0.0.1:65158_) [n:127.0.0.1:65158_ c:collection1   x:collection1] o.a.s.c.ZkController Collection zkNode exists
   [junit4]   2> 1165244 INFO  (coreLoadExecutor-4099-thread-1-processing-n:127.0.0.1:65158_) [n:127.0.0.1:65158_ c:collection1   x:collection1] o.a.s.c.c.ZkStateReader Load collection config from: [/collections/collection1]
   [junit4]   2> 1165245 INFO  (coreLoadExecutor-4099-thread-1-processing-n:127.0.0.1:65158_) [n:127.0.0.1:65158_ c:collection1   x:collection1] o.a.s.c.c.ZkStateReader path=[/collections/collection1] [configName]=[conf1] specified config exists in ZooKeeper
   [junit4]   2> 1165245 INFO  (coreLoadExecutor-4099-thread-1-processing-n:127.0.0.1:65158_) [n:127.0.0.1:65158_ c:collection1   x:collection1] o.a.s.c.SolrResourceLoader new SolrResourceLoader for directory: 'C:\Users\jenkins\workspace\Lucene-Solr-6.0-Windows\solr\build\solr-core\test\J1\temp\solr.handler.TestReqParamsAPI_21F9A04D1A9C912D-001\shard-1-001\cores\collection1'
   [junit4]   2> 1165245 INFO  (coreLoadExecutor-4099-thread-1-processing-n:127.0.0.1:65158_) [n:127.0.0.1:65158_ c:collection1   x:collection1] o.a.s.c.SolrResourceLoader JNDI not configured for solr (NoInitialContextEx)
   [junit4]   2> 1165245 INFO  (coreLoadExecutor-4099-thread-1-processing-n:127.0.0.1:65158_) [n:127.0.0.1:65158_ c:collection1   x:collection1] o.a.s.c.SolrResourceLoader solr home defaulted to 'solr/' (could not find system property or JNDI)
   [junit4]   2> 1165247 INFO  (coreLoadExecutor-4099-thread-1-processing-n:127.0.0.1:65158_) [n:127.0.0.1:65158_ c:collection1   x:collection1] o.a.s.c.Config loaded config solrconfig.xml with version 0 
   [junit4]   2> 1165255 INFO  (coreLoadExecutor-4099-thread-1-processing-n:127.0.0.1:65158_) [n:127.0.0.1:65158_ c:collection1   x:collection1] o.a.s.c.SolrConfig current version of requestparams : -1
   [junit4]   2> 1165257 WARN  (coreLoadExecutor-4099-thread-1-processing-n:127.0.0.1:65158_) [n:127.0.0.1:65158_ c:collection1   x:collection1] o.a.s.c.Config Beginning with Solr 5.5, <mergePolicy> is deprecated, use <mergePolicyFactory> instead.
   [junit4]   2> 1165258 INFO  (coreLoadExecutor-4099-thread-1-processing-n:127.0.0.1:65158_) [n:127.0.0.1:65158_ c:collection1   x:collection1] o.a.s.c.SolrConfig Using Lucene MatchVersion: 6.0.1
   [junit4]   2> 1165265 INFO  (coreLoadExecutor-4099-thread-1-processing-n:127.0.0.1:65158_) [n:127.0.0.1:65158_ c:collection1   x:collection1] o.a.s.c.SolrConfig Loaded SolrConfig: solrconfig.xml
   [junit4]   2> 1165271 INFO  (coreLoadExecutor-4099-thread-1-processing-n:127.0.0.1:65158_) [n:127.0.0.1:65158_ c:collection1   x:collection1] o.a.s.s.IndexSchema [collection1] Schema name=test
   [junit4]   2> 1165351 INFO  (coreLoadExecutor-4099-thread-1-processing-n:127.0.0.1:65158_) [n:127

[...truncated too long message...]

4]   2> 	at org.apache.solr.common.cloud.SolrZkClient.delete(SolrZkClient.java:241)
   [junit4]   2> 	at org.apache.solr.cloud.ElectionContext.cancelElection(ElectionContext.java:86)
   [junit4]   2> 	at org.apache.solr.cloud.ShardLeaderElectionContextBase.cancelElection(ElectionContext.java:143)
   [junit4]   2> 	at org.apache.solr.cloud.ShardLeaderElectionContext.cancelElection(ElectionContext.java:279)
   [junit4]   2> 	at org.apache.solr.cloud.ShardLeaderElectionContext.runLeaderProcess(ElectionContext.java:455)
   [junit4]   2> 	at org.apache.solr.cloud.LeaderElector.runIamLeaderProcess(LeaderElector.java:170)
   [junit4]   2> 	at org.apache.solr.cloud.LeaderElector.checkIfIamLeader(LeaderElector.java:135)
   [junit4]   2> 	at org.apache.solr.cloud.LeaderElector.access$200(LeaderElector.java:56)
   [junit4]   2> 	at org.apache.solr.cloud.LeaderElector$ElectionWatcher.process(LeaderElector.java:348)
   [junit4]   2> 	at org.apache.solr.common.cloud.SolrZkClient$3.lambda$process$0(SolrZkClient.java:266)
   [junit4]   2> 	at java.util.concurrent.Executors$RunnableAdapter.call(Executors.java:511)
   [junit4]   2> 	at java.util.concurrent.FutureTask.run(FutureTask.java:266)
   [junit4]   2> 	at org.apache.solr.common.util.ExecutorUtil$MDCAwareThreadPoolExecutor.lambda$execute$0(ExecutorUtil.java:229)
   [junit4]   2> 	at java.util.concurrent.ThreadPoolExecutor.runWorker(ThreadPoolExecutor.java:1142)
   [junit4]   2> 	at java.util.concurrent.ThreadPoolExecutor$Worker.run(ThreadPoolExecutor.java:617)
   [junit4]   2> 	at java.lang.Thread.run(Thread.java:745)
   [junit4]   2> 1194691 INFO  (TEST-TestReqParamsAPI.test-seed#[21F9A04D1A9C912D]) [    ] o.e.j.s.ServerConnector Stopped ServerConnector@6ff46460{HTTP/1.1,[http/1.1]}{127.0.0.1:0}
   [junit4]   2> 1194691 INFO  (TEST-TestReqParamsAPI.test-seed#[21F9A04D1A9C912D]) [    ] o.e.j.s.h.ContextHandler Stopped o.e.j.s.ServletContextHandler@5b27bbc{/,null,UNAVAILABLE}
   [junit4]   2> 1194700 INFO  (TEST-TestReqParamsAPI.test-seed#[21F9A04D1A9C912D]) [    ] o.a.s.c.ZkTestServer connecting to 127.0.0.1:65128 65128
   [junit4]   2> 1194703 INFO  (Thread-2933) [    ] o.a.s.c.ZkTestServer connecting to 127.0.0.1:65128 65128
   [junit4]   2> 1194704 WARN  (Thread-2933) [    ] o.a.s.c.ZkTestServer Watch limit violations: 
   [junit4]   2> Maximum concurrent create/delete watches above limit:
   [junit4]   2> 
   [junit4]   2> 	45	/solr/configs/conf1
   [junit4]   2> 	6	/solr/aliases.json
   [junit4]   2> 	5	/solr/security.json
   [junit4]   2> 
   [junit4]   2> Maximum concurrent data watches above limit:
   [junit4]   2> 
   [junit4]   2> 	6	/solr/clusterstate.json
   [junit4]   2> 	4	/solr/collections/collection1/state.json
   [junit4]   2> 
   [junit4]   2> Maximum concurrent children watches above limit:
   [junit4]   2> 
   [junit4]   2> 	6	/solr/live_nodes
   [junit4]   2> 	6	/solr/collections
   [junit4]   2> 	4	/solr/overseer/queue
   [junit4]   2> 	4	/solr/overseer/collection-queue-work
   [junit4]   2> 
   [junit4]   2> NOTE: reproduce with: ant test  -Dtestcase=TestReqParamsAPI -Dtests.method=test -Dtests.seed=21F9A04D1A9C912D -Dtests.slow=true -Dtests.locale=en-GB -Dtests.timezone=America/Port-au-Prince -Dtests.asserts=true -Dtests.file.encoding=Cp1252
   [junit4] FAILURE 34.4s J1 | TestReqParamsAPI.test <<<
   [junit4]    > Throwable #1: java.lang.AssertionError: Could not get expected value  'null' for path 'response/params/y/p' full output: {
   [junit4]    >   "responseHeader":{
   [junit4]    >     "status":0,
   [junit4]    >     "QTime":0},
   [junit4]    >   "response":{
   [junit4]    >     "znodeVersion":3,
   [junit4]    >     "params":{
   [junit4]    >       "x":{
   [junit4]    >         "a":"A val",
   [junit4]    >         "b":"B val",
   [junit4]    >         "":{"v":0}},
   [junit4]    >       "y":{
   [junit4]    >         "p":"P val",
   [junit4]    >         "q":"Q val",
   [junit4]    >         "":{"v":2}}}}}
   [junit4]    > 	at __randomizedtesting.SeedInfo.seed([21F9A04D1A9C912D:A9AD9F97B460FCD5]:0)
   [junit4]    > 	at org.apache.solr.core.TestSolrConfigHandler.testForResponseElement(TestSolrConfigHandler.java:458)
   [junit4]    > 	at org.apache.solr.handler.TestReqParamsAPI.testReqParams(TestReqParamsAPI.java:264)
   [junit4]    > 	at org.apache.solr.handler.TestReqParamsAPI.test(TestReqParamsAPI.java:67)
   [junit4]    > 	at org.apache.solr.BaseDistributedSearchTestCase$ShardsRepeatRule$ShardsFixedStatement.callStatement(BaseDistributedSearchTestCase.java:992)
   [junit4]    > 	at org.apache.solr.BaseDistributedSearchTestCase$ShardsRepeatRule$ShardsStatement.evaluate(BaseDistributedSearchTestCase.java:967)
   [junit4]    > 	at java.lang.Thread.run(Thread.java:745)
   [junit4]   2> 1194708 INFO  (SUITE-TestReqParamsAPI-seed#[21F9A04D1A9C912D]-worker) [    ] o.a.s.SolrTestCaseJ4 ###deleteCore
   [junit4]   2> NOTE: leaving temporary files on disk at: C:\Users\jenkins\workspace\Lucene-Solr-6.0-Windows\solr\build\solr-core\test\J1\temp\solr.handler.TestReqParamsAPI_21F9A04D1A9C912D-001
   [junit4]   2> May 22, 2016 1:12:17 PM com.carrotsearch.randomizedtesting.ThreadLeakControl checkThreadLeaks
   [junit4]   2> WARNING: Will linger awaiting termination of 1 leaked thread(s).
   [junit4]   2> NOTE: test params are: codec=HighCompressionCompressingStoredFields(storedFieldsFormat=CompressingStoredFieldsFormat(compressionMode=HIGH_COMPRESSION, chunkSize=5405, maxDocsPerChunk=10, blockSize=1), termVectorsFormat=CompressingTermVectorsFormat(compressionMode=HIGH_COMPRESSION, chunkSize=5405, blockSize=1)), sim=ClassicSimilarity, locale=en-GB, timezone=America/Port-au-Prince
   [junit4]   2> NOTE: Windows 10 10.0 amd64/Oracle Corporation 1.8.0_92 (64-bit)/cpus=3,threads=1,free=174229640,total=292155392
   [junit4]   2> NOTE: All tests run in this JVM: [DistributedQueryComponentCustomSortTest, PluginInfoTest, DistributedTermsComponentTest, DefaultValueUpdateProcessorTest, TermVectorComponentDistributedTest, HdfsCollectionsAPIDistributedZkTest, TestHighFrequencyDictionaryFactory, TestSSLRandomization, PreAnalyzedUpdateProcessorTest, TestManagedSchemaAPI, TestRebalanceLeaders, TestSolrQueryParser, DeleteStatusTest, QueryParsingTest, BadCopyFieldTest, CdcrVersionReplicationTest, FullHLLTest, DateMathParserTest, TestSizeLimitedDistributedMap, TestCSVResponseWriter, TestDynamicFieldCollectionResource, DistributedFacetPivotLongTailTest, TestUtils, TestCollapseQParserPlugin, ShowFileRequestHandlerTest, TestConfigSetsAPIExclusivity, TestReload, BlockDirectoryTest, RemoteQueryErrorTest, TestBinaryField, TestZkChroot, TestDFISimilarityFactory, TestSolrCoreProperties, TestSimpleTrackingShardHandler, TestDynamicLoading, SSLMigrationTest, TestCopyFieldCollectionResource, AsyncCallRequestStatusResponseTest, BinaryUpdateRequestHandlerTest, TestStressUserVersions, SuggesterTest, ResponseHeaderTest, CdcrReplicationHandlerTest, TestFilteredDocIdSet, TestSolrDeletionPolicy2, TestMinMaxOnMultiValuedField, TestRTGBase, TestCoreDiscovery, TermVectorComponentTest, DateRangeFieldTest, CollectionsAPISolrJTest, ChaosMonkeySafeLeaderTest, AddBlockUpdateTest, TestBadConfig, TestManagedStopFilterFactory, TestBM25SimilarityFactory, TestCryptoKeys, HdfsDirectoryFactoryTest, AnalyticsMergeStrategyTest, TestSolrIndexConfig, RestartWhileUpdatingTest, TestReversedWildcardFilterFactory, SynonymTokenizerTest, HdfsRecoverLeaseTest, HdfsChaosMonkeyNothingIsSafeTest, CSVRequestHandlerTest, TestDistributedMissingSort, TestExpandComponent, TestStressRecovery, TestLMJelinekMercerSimilarityFactory, TestMacros, TestValueSourceCache, LoggingHandlerTest, CopyFieldTest, TestSolrConfigHandlerConcurrent, TestFoldingMultitermQuery, TestPerFieldSimilarity, TestCollectionAPI, CoreAdminHandlerTest, EchoParamsTest, TestConfigOverlay, InfoHandlerTest, TestJettySolrRunner, BadIndexSchemaTest, LeaderElectionIntegrationTest, BigEndianAscendingWordDeserializerTest, TestSortingResponseWriter, TestFieldTypeCollectionResource, OverriddenZkACLAndCredentialsProvidersTest, TestCollationFieldDocValues, TestConfigSetProperties, BaseCdcrDistributedZkTest, OverseerRolesTest, FieldMutatingUpdateProcessorTest, DistributedExpandComponentTest, TestRuleBasedAuthorizationPlugin, TestUseDocValuesAsStored, ZkNodePropsTest, RequestLoggingTest, SortByFunctionTest, OpenCloseCoreStressTest, BasicDistributedZk2Test, CollectionTooManyReplicasTest, TestIndexSearcher, SpellCheckCollatorTest, FieldAnalysisRequestHandlerTest, LeaderFailoverAfterPartitionTest, DistributedIntervalFacetingTest, TestReqParamsAPI]
   [junit4] Completed [224/584 (1!)] on J1 in 34.75s, 1 test, 1 failure <<< FAILURES!

[...truncated 1147 lines...]
BUILD FAILED
C:\Users\jenkins\workspace\Lucene-Solr-6.0-Windows\build.xml:740: The following error occurred while executing this line:
C:\Users\jenkins\workspace\Lucene-Solr-6.0-Windows\build.xml:684: The following error occurred while executing this line:
C:\Users\jenkins\workspace\Lucene-Solr-6.0-Windows\build.xml:59: The following error occurred while executing this line:
C:\Users\jenkins\workspace\Lucene-Solr-6.0-Windows\solr\build.xml:233: The following error occurred while executing this line:
C:\Users\jenkins\workspace\Lucene-Solr-6.0-Windows\solr\common-build.xml:527: The following error occurred while executing this line:
C:\Users\jenkins\workspace\Lucene-Solr-6.0-Windows\lucene\common-build.xml:1457: The following error occurred while executing this line:
C:\Users\jenkins\workspace\Lucene-Solr-6.0-Windows\lucene\common-build.xml:1014: There were test failures: 584 suites (10 ignored), 2340 tests, 1 failure, 125 ignored (81 assumptions) [seed: 21F9A04D1A9C912D]

Total time: 79 minutes 37 seconds
Build step 'Invoke Ant' marked build as failure
Archiving artifacts
[WARNINGS] Skipping publisher since build result is FAILURE
Recording test results
Email was triggered for: Failure - Any
Sending email for trigger: Failure - Any