You are viewing a plain text version of this content. The canonical link for it is here.
Posted to commits@tomee.apache.org by Apache Jenkins Server <je...@builds.apache.org> on 2023/07/09 15:36:24 UTC
Build failed in Jenkins: TomEE » tomee-8.x-build-full-java8 #123
See <https://ci-builds.apache.org/job/Tomee/job/tomee-8.x-build-full-java8/123/display/redirect>
Changes:
------------------------------------------
[...truncated 11.50 MB...]
[INFO] TomEE :: Utils :: Core Hibernate 8.0.16-SNAPSHOT ... SUCCESS [ 1.428 s]
[INFO] TomEE :: Examples :: JPA with Hibernate 8.0.16-SNAPSHOT SUCCESS [ 6.172 s]
[INFO] TomEE :: Examples :: JPA with Hibernate and arquillian 8.0.16-SNAPSHOT SKIPPED
[INFO] TomEE :: Examples :: JPA @Enumerated 8.0.16-SNAPSHOT SUCCESS [ 5.690 s]
[INFO] TomEE :: Web Examples :: JSF - ManangedBean and EJB 8.0.16-SNAPSHOT SKIPPED
[INFO] TomEE :: Web Examples :: JSF - CDI and EJB 8.0.16-SNAPSHOT SUCCESS [ 1.956 s]
[INFO] TomEE :: Examples :: JUnit 5 :: Application Composer 8.0.16-SNAPSHOT SUCCESS [ 7.873 s]
[INFO] TomEE :: Examples :: JUnit 5 :: Multiple TomEE with Arquillian 8.0.16-SNAPSHOT SKIPPED
[INFO] TomEE :: Examples :: JUnit 5 :: Simple Websockets with Arquillian 8.0.16-SNAPSHOT SKIPPED
[INFO] TomEE :: Examples :: @EJB Lookup 8.0.16-SNAPSHOT ... SUCCESS [ 2.497 s]
[INFO] TomEE :: Examples :: EJB Lookup with descriptor 8.0.16-SNAPSHOT SUCCESS [ 2.405 s]
[INFO] TomEE :: Examples :: Movies Complete (Meta) 8.0.16-SNAPSHOT SUCCESS [ 4.980 s]
[INFO] TomEE :: Examples :: Movies Complete 8.0.16-SNAPSHOT SUCCESS [ 5.730 s]
[INFO] MicroProfile :: Examples :: Config 8.0.16-SNAPSHOT . SKIPPED
[INFO] MicroProfile :: Examples :: Config Source Database 8.0.16-SNAPSHOT SKIPPED
[INFO] TomEE :: Examples :: Microprofile Fault Tolerance :: Fallback 8.0.16-SNAPSHOT SKIPPED
[INFO] TomEE :: Examples :: Microprofile Fault Tolerance :: Retry 8.0.16-SNAPSHOT SKIPPED
[INFO] TomEE :: Examples :: Microprofile JSONB Configuration 8.0.16-SNAPSHOT SKIPPED
[INFO] Apache TomEE + MicroProfile JWT Bean Validation 8.0.16-SNAPSHOT SKIPPED
[INFO] Apache TomEE + MicroProfile JWT Bean Validation, Strongly-typed Annotations 8.0.16-SNAPSHOT SKIPPED
[INFO] TomEE :: Examples :: Microprofile Metrics Counted 8.0.16-SNAPSHOT SKIPPED
[INFO] TomEE :: Examples :: Microprofile Metrics Histogram 8.0.16-SNAPSHOT SKIPPED
[INFO] TomEE :: Examples :: Microprofile Metrics Timed 8.0.16-SNAPSHOT SKIPPED
[INFO] mp-metrics-gauge 8.0.16-SNAPSHOT ................... SKIPPED
[INFO] mp-metrics-metered 8.0.16-SNAPSHOT ................. SKIPPED
[INFO] mp-opentracing.traced 8.0.16-SNAPSHOT .............. SKIPPED
[INFO] TomEE :: Examples :: MP REST JWT 8.0.16-SNAPSHOT ... SKIPPED
[INFO] TomEE :: Examples :: MP REST JWT JWK 8.0.16-SNAPSHOT SKIPPED
[INFO] TomEE :: Examples :: MP REST JWT PRINCIPAL 8.0.16-SNAPSHOT SKIPPED
[INFO] TomEE :: Examples :: MP REST JWT Public Key 8.0.16-SNAPSHOT SKIPPED
[INFO] TomEE :: Utils :: Mockito 8.0.16-SNAPSHOT .......... SUCCESS [ 10.527 s]
[INFO] TomEE :: Examples :: MTOM 8.0.16-SNAPSHOT .......... SKIPPED
[INFO] TomEE :: Examples :: Multiple JPA providers 8.0.16-SNAPSHOT SKIPPED
[INFO] TomEE :: Examples :: Multiple Arquillian Adapters 8.0.16-SNAPSHOT SKIPPED
[INFO] TomEE :: Examples :: Multiple TomEE with Arquillian 8.0.16-SNAPSHOT SKIPPED
[INFO] TomEE :: Examples :: JSF2/CDI/BV/JPA/CODI 8.0.16-SNAPSHOT SKIPPED
[INFO] TomEE :: Examples :: Persistence Fragment 8.0.16-SNAPSHOT SUCCESS [ 3.157 s]
[INFO] TomEE :: Web Examples :: Pojo WS 8.0.16-SNAPSHOT ... SKIPPED
[INFO] TomEE :: Examples :: Polling 8.0.16-SNAPSHOT ....... SUCCESS [ 0.246 s]
[INFO] TomEE :: Examples :: Polling :: Domain 8.0.16-SNAPSHOT SUCCESS [ 4.803 s]
[INFO] TomEE :: Examples :: Polling :: Core 8.0.16-SNAPSHOT SKIPPED
[INFO] TomEE :: Examples :: Polling :: Web 8.0.16-SNAPSHOT SKIPPED
[INFO] TomEE :: Examples :: Polling :: Client 8.0.16-SNAPSHOT SKIPPED
[INFO] TomEE :: Examples :: DeltaSpike ProjectStage 8.0.16-SNAPSHOT SKIPPED
[INFO] TomEE :: Examples :: Quartz 8.0.16-SNAPSHOT ........ SUCCESS [ 0.132 s]
[INFO] TomEE :: Examples :: Quartz :: Quartz Resource Adapter 8.0.16-SNAPSHOT SKIPPED
[INFO] TomEE :: Examples :: Quartz :: Quartz Beans 8.0.16-SNAPSHOT SKIPPED
[INFO] TomEE :: Examples :: DataSource Realm 8.0.16-SNAPSHOT SKIPPED
[INFO] TomEE :: Examples :: Reloadable Persistence Unit Properties 8.0.16-SNAPSHOT SUCCESS [ 5.413 s]
[INFO] TomEE :: Web Examples :: Resource Declared In A Webapp 8.0.16-SNAPSHOT SUCCESS [ 0.695 s]
[INFO] TomEE :: Examples :: REST, Mockito and Application Composer 8.0.16-SNAPSHOT SKIPPED
[INFO] TomEE :: Examples :: REST and Application Composer 8.0.16-SNAPSHOT SKIPPED
[INFO] TomEE :: Examples :: REST CDI 8.0.16-SNAPSHOT ...... SKIPPED
[INFO] TomEE :: Examples :: JAXRS and JAAS 8.0.16-SNAPSHOT SKIPPED
[INFO] TomEE :: Examples :: REST and EJB 8.0.16-SNAPSHOT .. SKIPPED
[INFO] TomEE :: Web Examples :: REST Example 8.0.16-SNAPSHOT SKIPPED
[INFO] TomEE :: Web Examples :: REST Example With Application 8.0.16-SNAPSHOT SUCCESS [ 5.665 s]
[INFO] TomEE :: Web Examples :: REST SSE Example 8.0.16-SNAPSHOT SKIPPED
[INFO] TomEE :: Examples :: REST XML JSON 8.0.16-SNAPSHOT . SKIPPED
[INFO] TomEE :: Examples :: Basic Scala 8.0.16-SNAPSHOT ... SUCCESS [ 25.322 s]
[INFO] TomEE :: Examples :: ScheduleExpression 8.0.16-SNAPSHOT SUCCESS [ 7.549 s]
[INFO] TomEE :: Examples :: @Schedule Events 8.0.16-SNAPSHOT SUCCESS [ 13.257 s]
[INFO] TomEE :: Examples :: @Schedule Methods (Meta) 8.0.16-SNAPSHOT SUCCESS [ 7.525 s]
[INFO] TomEE :: Examples :: @Schedule Methods 8.0.16-SNAPSHOT SUCCESS [ 7.454 s]
[INFO] TomEE :: Examples :: Server Events 8.0.16-SNAPSHOT . SKIPPED
[INFO] TomEE :: Examples :: Serverless Apache TomEE WebProfile 8.0.16-SNAPSHOT SKIPPED
[INFO] TomEE :: Examples :: Serverless Apache TomEE WebProfile 8.0.16-SNAPSHOT SKIPPED
[INFO] TomEE :: Examples :: Serverless Apache TomEE MicroProfile 8.0.16-SNAPSHOT SKIPPED
[INFO] TomEE :: Examples :: Serverless Apache TomEE Plume 8.0.16-SNAPSHOT SKIPPED
[INFO] TomEE :: Examples :: Serverless Apache TomEE Plus 8.0.16-SNAPSHOT SKIPPED
[INFO] TomEE :: Examples :: Singleton startup ordering 8.0.16-SNAPSHOT SKIPPED
[INFO] TomEE :: Examples :: Simple CDI Interceptor 8.0.16-SNAPSHOT SUCCESS [ 2.765 s]
[INFO] TomEE :: Examples :: Simple EAR 8.0.16-SNAPSHOT .... SUCCESS [ 0.108 s]
[INFO] TomEE :: Examples :: Simple EAR :: Business Model 8.0.16-SNAPSHOT SUCCESS [ 0.402 s]
[INFO] TomEE :: Examples :: Simple EAR :: Business Logic 8.0.16-SNAPSHOT SUCCESS [ 4.707 s]
[INFO] TomEE :: Examples :: Simple EAR :: Webapp 8.0.16-SNAPSHOT SUCCESS [ 1.606 s]
[INFO] TomEE :: Examples :: Simple EAR :: EAR Packaging 8.0.16-SNAPSHOT SUCCESS [ 0.184 s]
[INFO] TomEE :: Examples :: Simple EAR :: Functional Tests 8.0.16-SNAPSHOT SKIPPED
[INFO] TomEE :: Examples :: Simple CMP2 Entity 8.0.16-SNAPSHOT SUCCESS [ 5.880 s]
[INFO] TomEE :: Examples :: Simple JMS 8.0.16-SNAPSHOT .... SKIPPED
[INFO] TomEE :: Examples :: Simple JMS Context 8.0.16-SNAPSHOT SKIPPED
[INFO] TomEE :: Examples :: Simple MDB With a CDI Injection 8.0.16-SNAPSHOT SKIPPED
[INFO] TomEE :: Examples :: Simple MDB Example 8.0.16-SNAPSHOT SKIPPED
[INFO] TomEE :: Examples :: Simple MDB Using Deployment Descriptor Example 8.0.16-SNAPSHOT SKIPPED
[INFO] TomEE :: Examples :: Simple Remote tomcat-users.xml 8.0.16-SNAPSHOT SKIPPED
[INFO] TomEE :: Examples :: Simple REST 8.0.16-SNAPSHOT ... SKIPPED
[INFO] TomEE :: Examples :: Simple Singleton 8.0.16-SNAPSHOT SUCCESS [ 2.501 s]
[INFO] TomEE :: Examples :: Simple Stateful Pojo 8.0.16-SNAPSHOT SUCCESS [ 2.333 s]
[INFO] TomEE :: Examples :: Simple Stateful Pojo Callbacks 8.0.16-SNAPSHOT FAILURE [ 6.352 s]
[INFO] TomEE :: Examples :: Simple Stateless Pojo 8.0.16-SNAPSHOT SUCCESS [ 2.473 s]
[INFO] TomEE :: Examples :: Simple Stateless Pojo Callbacks 8.0.16-SNAPSHOT SUCCESS [ 2.395 s]
[INFO] TomEE :: Examples :: Simple Stateless With Deployment Descriptor 8.0.16-SNAPSHOT SUCCESS [ 1.912 s]
[INFO] TomEE :: Examples :: Simple Webservice 8.0.16-SNAPSHOT SKIPPED
[INFO] TomEE :: Examples :: Simple Webservice Without Interface 8.0.16-SNAPSHOT SKIPPED
[INFO] OpenEJB :: Examples :: Async Servlet 8.0.16-SNAPSHOT SKIPPED
[INFO] TomEE :: Examples :: Spring Data 8.0.16-SNAPSHOT ... SUCCESS [ 8.545 s]
[INFO] TomEE :: Examples :: Spring Data Meta 8.0.16-SNAPSHOT SUCCESS [ 5.823 s]
[INFO] TomEE :: Web Examples :: Struts 8.0.16-SNAPSHOT .... SUCCESS [ 2.653 s]
[INFO] TomEE :: Examples :: Telephone Stateful Pojo 8.0.16-SNAPSHOT SUCCESS [ 3.517 s]
[INFO] TomEE :: Examples :: TestCase Injection 8.0.16-SNAPSHOT SUCCESS [ 4.816 s]
[INFO] TomEE :: Examples :: Testing Security (Meta) 8.0.16-SNAPSHOT SUCCESS [ 5.240 s]
[INFO] TomEE :: Examples :: Testing Security 8.0.16-SNAPSHOT SUCCESS [ 5.832 s]
[INFO] TomEE :: Examples :: Testing Security 8.0.16-SNAPSHOT SUCCESS [ 6.072 s]
[INFO] TomEE :: Examples :: Testing Security Service Provider 8.0.16-SNAPSHOT SUCCESS [ 6.185 s]
[INFO] TomEE :: Examples :: Testing Security Script Service Provider 8.0.16-SNAPSHOT SUCCESS [ 8.848 s]
[INFO] TomEE :: Examples :: Testing Transactions 8.0.16-SNAPSHOT SUCCESS [ 4.953 s]
[INFO] TomEE :: Examples :: Testing Transactions BMT 8.0.16-SNAPSHOT SUCCESS [ 5.012 s]
[INFO] TomEE :: Examples :: TomEE, Jersey, Eclipselink 8.0.16-SNAPSHOT SKIPPED
[INFO] TomEE :: TomEE :: IBM MQ AMQ Portability Examples :: MDB Example 1.0 SUCCESS [ 1.408 s]
[INFO] TomEE :: Examples :: Transaction Rollback 8.0.16-SNAPSHOT SUCCESS [ 7.017 s]
[INFO] TomEE :: Examples :: Troubleshooting 8.0.16-SNAPSHOT SUCCESS [ 4.989 s]
[INFO] TomEE :: Examples :: Webservice Attachments 8.0.16-SNAPSHOT SUCCESS [ 6.673 s]
[INFO] TomEE :: Examples :: Webservice Inheritance 8.0.16-SNAPSHOT SKIPPED
[INFO] TomEE :: Web Examples :: EJB WebService with Security 8.0.16-SNAPSHOT SKIPPED
[INFO] TomEE :: Web Examples :: EJB WebService with SSL Client Certificate 8.0.16-SNAPSHOT SKIPPED
[INFO] TomEE :: Web Examples :: EJB WebService with WS-Security 8.0.16-SNAPSHOT SKIPPED
[INFO] TomEE :: Web Examples :: EJB WebService WS Security with resources.xml 8.0.16-SNAPSHOT SKIPPED
[INFO] TomEE :: Examples :: Web Service Handlers 8.0.16-SNAPSHOT SKIPPED
[INFO] TomEE :: Examples :: @WebService Holder 8.0.16-SNAPSHOT SKIPPED
[INFO] TomEE :: Web Examples :: Moviefun 8.0.16-SNAPSHOT .. SKIPPED
[INFO] TomEE :: Web Examples :: Moviefun Rest 8.0.16-SNAPSHOT SKIPPED
[INFO] TomEE :: Utils :: Provisionning 8.0.16-SNAPSHOT .... SUCCESS [ 3.528 s]
[INFO] TomEE :: Examples :: Resources/JMX Example 8.0.16-SNAPSHOT SUCCESS [ 0.202 s]
[INFO] TomEE :: Examples :: Resources/JMX Example :: EJB Module 8.0.16-SNAPSHOT SKIPPED
[INFO] TomEE :: Examples :: Resources/JMX Example :: EAR Module 8.0.16-SNAPSHOT SKIPPED
[INFO] TomEE :: Examples :: WebSocket with tls and basic auth Example 8.0.16-SNAPSHOT SKIPPED
[INFO] TomEE :: Examples :: Concurrency utilities example 8.0.16-SNAPSHOT SKIPPED
[INFO] TomEE :: Examples :: MVC (CXF-based) 8.0.16-SNAPSHOT SKIPPED
[INFO] TomEE :: Examples :: MVC (CXF-based) with Hibernate 8.0.16-SNAPSHOT SKIPPED
[INFO] TomEE :: Examples :: Microprofile REST Client 8.0.16-SNAPSHOT SKIPPED
[INFO] TomEE :: Examples :: MVC (RestEasy-based) 8.0.16-SNAPSHOT SKIPPED
[INFO] TomEE :: Examples :: Custom HealthCheck 8.0.16-SNAPSHOT SKIPPED
[INFO] TomEE :: Examples :: Microprofile JSONB Configuration 8.0.16-SNAPSHOT SKIPPED
[INFO] TomEE :: Examples :: Microprofile JSONB Custom Serializer/Deserializer 8.0.16-SNAPSHOT SKIPPED
[INFO] TomEE :: Examples :: Vaadin LTS V08 8.0.16-SNAPSHOT SKIPPED
[INFO] TomEE :: Examples :: Vaadin LTS V10 8.0.16-SNAPSHOT SKIPPED
[INFO] TomEE :: Examples :: Vaadin LATEST 8.0.16-SNAPSHOT . SKIPPED
[INFO] TomEE :: Examples :: Azure deployment example 8.0.16-SNAPSHOT SKIPPED
[INFO] TomEE :: Examples :: Microprofile Fault Tolerance :: Timeout 8.0.16-SNAPSHOT SKIPPED
[INFO] TomEE :: Examples :: XA Datasource configuration and usage 8.0.16-SNAPSHOT SKIPPED
[INFO] TomEE :: Examples :: Websocket JMS 8.0.16-SNAPSHOT . SKIPPED
[INFO] TomEE :: Examples :: Properties Provider 8.0.16-SNAPSHOT SUCCESS [ 0.113 s]
[INFO] TomEE :: Examples :: Properties Provider :: Implementation 8.0.16-SNAPSHOT SUCCESS [ 0.175 s]
[INFO] TomEE :: Examples :: Properties Provider :: Sample Webapp 8.0.16-SNAPSHOT SKIPPED
[INFO] TomEE :: Examples :: Jakarta Security tomcat-user.xml Identity Store 8.0.16-SNAPSHOT SKIPPED
[INFO] TomEE :: Examples :: Jakarta Security custom Identity Store 8.0.16-SNAPSHOT SKIPPED
[INFO] TomEE :: Examples 8.0.16-SNAPSHOT .................. SUCCESS [ 0.710 s]
[INFO] TomEE :: Assembly :: All In One EJB Lite jar 8.0.16-SNAPSHOT SUCCESS [ 31.613 s]
[INFO] TomEE :: Utils :: TomEE Webapps-based Deployer EJB 8.0.16-SNAPSHOT SUCCESS [ 1.086 s]
[INFO] TomEE :: TCK 8.0.16-SNAPSHOT ....................... SUCCESS [ 0.122 s]
[INFO] TomEE :: TCK :: Common 8.0.16-SNAPSHOT ............. SUCCESS [ 1.683 s]
[INFO] TomEE :: TCK :: CDI Embedded 8.0.16-SNAPSHOT ....... SKIPPED
[INFO] TomEE :: TCK :: CDI TomEE 8.0.16-SNAPSHOT .......... SKIPPED
[INFO] TomEE :: TCK :: CDI TCK Signature Tests 8.0.16-SNAPSHOT SUCCESS [ 9.408 s]
[INFO] TomEE :: TCK :: Bean Validation Embedded 8.0.16-SNAPSHOT SKIPPED
[INFO] TomEE :: TCK :: Bean Validation TomEE 8.0.16-SNAPSHOT SKIPPED
[INFO] TomEE :: TCK :: Bean Validation TCK Signature tests 8.0.16-SNAPSHOT SUCCESS [ 4.603 s]
[INFO] TomEE :: TCK :: MicroProfile 8.0.16-SNAPSHOT ....... SUCCESS [ 0.103 s]
[INFO] TomEE :: TCK :: MicroProfile Config TCK 8.0.16-SNAPSHOT SKIPPED
[INFO] TomEE :: TCK :: MicroProfile JWT TCK 8.0.16-SNAPSHOT SKIPPED
[INFO] TomEE :: TCK :: MicroProfile Fault Tolerance TCK 8.0.16-SNAPSHOT SKIPPED
[INFO] TomEE :: TCK :: MicroProfile Health TCK 8.0.16-SNAPSHOT SKIPPED
[INFO] TomEE :: TCK :: MicroProfile Metrics TCK 8.0.16-SNAPSHOT SKIPPED
[INFO] TomEE :: TCK :: MicroProfile Rest Client TCK 8.0.16-SNAPSHOT SKIPPED
[INFO] TomEE :: TCK :: MicroProfile Open API TCK 8.0.16-SNAPSHOT SKIPPED
[INFO] TomEE :: TCK :: MicroProfile Open Tracing TCK 8.0.16-SNAPSHOT SKIPPED
[INFO] TomEE :: Arquillian Adaptors Parent :: Webapp Remote 8.0.16-SNAPSHOT SUCCESS [01:09 min]
[INFO] TomEE :: Arquillian Adaptors Parent :: Tests 8.0.16-SNAPSHOT SKIPPED
[INFO] TomEE :: Arquillian Adaptors Parent :: Tests :: Web Profile 8.0.16-SNAPSHOT SKIPPED
[INFO] TomEE :: Arquillian Adaptors Parent :: Tests :: JAXRS 8.0.16-SNAPSHOT SKIPPED
[INFO] TomEE :: Arquillian Adaptors Parent :: Tests :: JAXWS 8.0.16-SNAPSHOT SKIPPED
[INFO] TomEE :: Arquillian Adaptors Parent :: Tests :: JMS 8.0.16-SNAPSHOT SKIPPED
[INFO] TomEE :: Arquillian Adaptors Parent :: Tests :: CODI 8.0.16-SNAPSHOT SKIPPED
[INFO] TomEE :: Arquillian Adaptors Parent :: Tests :: Configuration Tests 8.0.16-SNAPSHOT SKIPPED
[INFO] TomEE :: Arquillian Adaptors Parent :: Sample :: Moviefun 8.0.16-SNAPSHOT SKIPPED
[INFO] TomEE :: Arquillian Adaptors Parent :: Arquillian TCK 8.0.16-SNAPSHOT SKIPPED
[INFO] TomEE :: Utils :: Log4j2 8.0.16-SNAPSHOT ........... SUCCESS [ 1.330 s]
[INFO] TomEE :: TomEE :: webaccess 8.0.16-SNAPSHOT ........ SKIPPED
[INFO] TomEE :: TomEE :: Overlay Runner 8.0.16-SNAPSHOT ... SUCCESS [ 0.961 s]
[INFO] ------------------------------------------------------------------------
[INFO] BUILD FAILURE
[INFO] ------------------------------------------------------------------------
[INFO] Total time: 58:45 min
[INFO] Finished at: 2023-07-09T15:36:17Z
[INFO] ------------------------------------------------------------------------
[ERROR] Failed to execute goal org.apache.maven.plugins:maven-surefire-plugin:3.0.0-M5:test (default-test) on project openejb-cxf-rs: There are test failures.
[ERROR]
[ERROR] Please refer to <https://ci-builds.apache.org/job/Tomee/job/tomee-8.x-build-full-java8/ws/server/openejb-cxf-rs/target/surefire-reports> for the individual test results.
[ERROR] Please refer to dump files (if any exist) [date].dump, [date]-jvmRun[N].dump and [date].dumpstream.
[ERROR] -> [Help 1]
[ERROR] Failed to execute goal org.apache.maven.plugins:maven-surefire-plugin:2.12.4:test (default-test) on project simple-stateful-callbacks: There are test failures.
[ERROR]
[ERROR] Please refer to <https://ci-builds.apache.org/job/Tomee/job/tomee-8.x-build-full-java8/ws/examples/simple-stateful-callbacks/target/surefire-reports> for the individual test results.
[ERROR] -> [Help 1]
[ERROR]
[ERROR] To see the full stack trace of the errors, re-run Maven with the -e switch.
[ERROR] Re-run Maven using the -X switch to enable full debug logging.
[ERROR]
[ERROR] For more information about the errors and possible solutions, please read the following articles:
[ERROR] [Help 1] http://cwiki.apache.org/confluence/display/MAVEN/MojoFailureException
[ERROR]
[ERROR] After correcting the problems, you can resume the build with the command
[ERROR] mvn <args> -rf :openejb-cxf-rs
Build step 'Invoke top-level Maven targets' marked build as failure
INFO: Processing JUnit
INFO: [JUnit] - 795 test report file(s) were found with the pattern '**/target/surefire-reports/TEST-*.xml' relative to '<https://ci-builds.apache.org/job/Tomee/job/tomee-8.x-build-full-java8/ws/'> for the testing framework 'JUnit'.
WARNING: The file '<https://ci-builds.apache.org/job/Tomee/job/tomee-8.x-build-full-java8/ws/examples/scala-basic/target/surefire-reports/TEST-org.scalatest.tools.DiscoverySuite-4286b372-906a-48ae-8272-7ba1d3eec628.xml'> is an invalid file.
WARNING: At line 8 of <https://ci-builds.apache.org/job/Tomee/job/tomee-8.x-build-full-java8/ws/examples/scala-basic/target/surefire-reports/TEST-org.scalatest.tools.DiscoverySuite-4286b372-906a-48ae-8272-7ba1d3eec628.xml>:cvc-complex-type.2.1: Element 'property' must have no character or element information item [children], because the type's content type is empty.
WARNING: At line 13 of <https://ci-builds.apache.org/job/Tomee/job/tomee-8.x-build-full-java8/ws/examples/scala-basic/target/surefire-reports/TEST-org.scalatest.tools.DiscoverySuite-4286b372-906a-48ae-8272-7ba1d3eec628.xml>:cvc-complex-type.2.1: Element 'property' must have no character or element information item [children], because the type's content type is empty.
WARNING: At line 24 of <https://ci-builds.apache.org/job/Tomee/job/tomee-8.x-build-full-java8/ws/examples/scala-basic/target/surefire-reports/TEST-org.scalatest.tools.DiscoverySuite-4286b372-906a-48ae-8272-7ba1d3eec628.xml>:cvc-complex-type.2.1: Element 'property' must have no character or element information item [children], because the type's content type is empty.
WARNING: At line 27 of <https://ci-builds.apache.org/job/Tomee/job/tomee-8.x-build-full-java8/ws/examples/scala-basic/target/surefire-reports/TEST-org.scalatest.tools.DiscoverySuite-4286b372-906a-48ae-8272-7ba1d3eec628.xml>:cvc-complex-type.2.1: Element 'property' must have no character or element information item [children], because the type's content type is empty.
WARNING: At line 31 of <https://ci-builds.apache.org/job/Tomee/job/tomee-8.x-build-full-java8/ws/examples/scala-basic/target/surefire-reports/TEST-org.scalatest.tools.DiscoverySuite-4286b372-906a-48ae-8272-7ba1d3eec628.xml>:cvc-complex-type.2.1: Element 'property' must have no character or element information item [children], because the type's content type is empty.
WARNING: At line 34 of <https://ci-builds.apache.org/job/Tomee/job/tomee-8.x-build-full-java8/ws/examples/scala-basic/target/surefire-reports/TEST-org.scalatest.tools.DiscoverySuite-4286b372-906a-48ae-8272-7ba1d3eec628.xml>:cvc-complex-type.2.1: Element 'property' must have no character or element information item [children], because the type's content type is empty.
WARNING: At line 42 of <https://ci-builds.apache.org/job/Tomee/job/tomee-8.x-build-full-java8/ws/examples/scala-basic/target/surefire-reports/TEST-org.scalatest.tools.DiscoverySuite-4286b372-906a-48ae-8272-7ba1d3eec628.xml>:cvc-complex-type.2.1: Element 'property' must have no character or element information item [children], because the type's content type is empty.
WARNING: At line 46 of <https://ci-builds.apache.org/job/Tomee/job/tomee-8.x-build-full-java8/ws/examples/scala-basic/target/surefire-reports/TEST-org.scalatest.tools.DiscoverySuite-4286b372-906a-48ae-8272-7ba1d3eec628.xml>:cvc-complex-type.2.1: Element 'property' must have no character or element information item [children], because the type's content type is empty.
WARNING: At line 49 of <https://ci-builds.apache.org/job/Tomee/job/tomee-8.x-build-full-java8/ws/examples/scala-basic/target/surefire-reports/TEST-org.scalatest.tools.DiscoverySuite-4286b372-906a-48ae-8272-7ba1d3eec628.xml>:cvc-complex-type.2.1: Element 'property' must have no character or element information item [children], because the type's content type is empty.
WARNING: At line 52 of <https://ci-builds.apache.org/job/Tomee/job/tomee-8.x-build-full-java8/ws/examples/scala-basic/target/surefire-reports/TEST-org.scalatest.tools.DiscoverySuite-4286b372-906a-48ae-8272-7ba1d3eec628.xml>:cvc-complex-type.2.1: Element 'property' must have no character or element information item [children], because the type's content type is empty.
WARNING: At line 56 of <https://ci-builds.apache.org/job/Tomee/job/tomee-8.x-build-full-java8/ws/examples/scala-basic/target/surefire-reports/TEST-org.scalatest.tools.DiscoverySuite-4286b372-906a-48ae-8272-7ba1d3eec628.xml>:cvc-complex-type.2.1: Element 'property' must have no character or element information item [children], because the type's content type is empty.
WARNING: At line 60 of <https://ci-builds.apache.org/job/Tomee/job/tomee-8.x-build-full-java8/ws/examples/scala-basic/target/surefire-reports/TEST-org.scalatest.tools.DiscoverySuite-4286b372-906a-48ae-8272-7ba1d3eec628.xml>:cvc-complex-type.2.1: Element 'property' must have no character or element information item [children], because the type's content type is empty.
WARNING: At line 69 of <https://ci-builds.apache.org/job/Tomee/job/tomee-8.x-build-full-java8/ws/examples/scala-basic/target/surefire-reports/TEST-org.scalatest.tools.DiscoverySuite-4286b372-906a-48ae-8272-7ba1d3eec628.xml>:cvc-complex-type.2.1: Element 'property' must have no character or element information item [children], because the type's content type is empty.
WARNING: At line 74 of <https://ci-builds.apache.org/job/Tomee/job/tomee-8.x-build-full-java8/ws/examples/scala-basic/target/surefire-reports/TEST-org.scalatest.tools.DiscoverySuite-4286b372-906a-48ae-8272-7ba1d3eec628.xml>:cvc-complex-type.2.1: Element 'property' must have no character or element information item [children], because the type's content type is empty.
WARNING: At line 77 of <https://ci-builds.apache.org/job/Tomee/job/tomee-8.x-build-full-java8/ws/examples/scala-basic/target/surefire-reports/TEST-org.scalatest.tools.DiscoverySuite-4286b372-906a-48ae-8272-7ba1d3eec628.xml>:cvc-complex-type.2.1: Element 'property' must have no character or element information item [children], because the type's content type is empty.
WARNING: At line 85 of <https://ci-builds.apache.org/job/Tomee/job/tomee-8.x-build-full-java8/ws/examples/scala-basic/target/surefire-reports/TEST-org.scalatest.tools.DiscoverySuite-4286b372-906a-48ae-8272-7ba1d3eec628.xml>:cvc-complex-type.2.1: Element 'property' must have no character or element information item [children], because the type's content type is empty.
WARNING: At line 89 of <https://ci-builds.apache.org/job/Tomee/job/tomee-8.x-build-full-java8/ws/examples/scala-basic/target/surefire-reports/TEST-org.scalatest.tools.DiscoverySuite-4286b372-906a-48ae-8272-7ba1d3eec628.xml>:cvc-complex-type.2.1: Element 'property' must have no character or element information item [children], because the type's content type is empty.
WARNING: At line 94 of <https://ci-builds.apache.org/job/Tomee/job/tomee-8.x-build-full-java8/ws/examples/scala-basic/target/surefire-reports/TEST-org.scalatest.tools.DiscoverySuite-4286b372-906a-48ae-8272-7ba1d3eec628.xml>:cvc-complex-type.2.1: Element 'property' must have no character or element information item [children], because the type's content type is empty.
WARNING: At line 98 of <https://ci-builds.apache.org/job/Tomee/job/tomee-8.x-build-full-java8/ws/examples/scala-basic/target/surefire-reports/TEST-org.scalatest.tools.DiscoverySuite-4286b372-906a-48ae-8272-7ba1d3eec628.xml>:cvc-complex-type.2.1: Element 'property' must have no character or element information item [children], because the type's content type is empty.
WARNING: The result file '<https://ci-builds.apache.org/job/Tomee/job/tomee-8.x-build-full-java8/ws/examples/scala-basic/target/surefire-reports/TEST-org.scalatest.tools.DiscoverySuite-4286b372-906a-48ae-8272-7ba1d3eec628.xml'> for the metric 'JUnit' is not valid. The result file has been skipped.
WARNING: The file '<https://ci-builds.apache.org/job/Tomee/job/tomee-8.x-build-full-java8/ws/examples/scala-basic/target/surefire-reports/TEST-org.superbiz.GreetingServiceTest.xml'> is an invalid file.
WARNING: At line 8 of <https://ci-builds.apache.org/job/Tomee/job/tomee-8.x-build-full-java8/ws/examples/scala-basic/target/surefire-reports/TEST-org.superbiz.GreetingServiceTest.xml>:cvc-complex-type.2.1: Element 'property' must have no character or element information item [children], because the type's content type is empty.
WARNING: At line 13 of <https://ci-builds.apache.org/job/Tomee/job/tomee-8.x-build-full-java8/ws/examples/scala-basic/target/surefire-reports/TEST-org.superbiz.GreetingServiceTest.xml>:cvc-complex-type.2.1: Element 'property' must have no character or element information item [children], because the type's content type is empty.
WARNING: At line 24 of <https://ci-builds.apache.org/job/Tomee/job/tomee-8.x-build-full-java8/ws/examples/scala-basic/target/surefire-reports/TEST-org.superbiz.GreetingServiceTest.xml>:cvc-complex-type.2.1: Element 'property' must have no character or element information item [children], because the type's content type is empty.
WARNING: At line 27 of <https://ci-builds.apache.org/job/Tomee/job/tomee-8.x-build-full-java8/ws/examples/scala-basic/target/surefire-reports/TEST-org.superbiz.GreetingServiceTest.xml>:cvc-complex-type.2.1: Element 'property' must have no character or element information item [children], because the type's content type is empty.
WARNING: At line 31 of <https://ci-builds.apache.org/job/Tomee/job/tomee-8.x-build-full-java8/ws/examples/scala-basic/target/surefire-reports/TEST-org.superbiz.GreetingServiceTest.xml>:cvc-complex-type.2.1: Element 'property' must have no character or element information item [children], because the type's content type is empty.
WARNING: At line 34 of <https://ci-builds.apache.org/job/Tomee/job/tomee-8.x-build-full-java8/ws/examples/scala-basic/target/surefire-reports/TEST-org.superbiz.GreetingServiceTest.xml>:cvc-complex-type.2.1: Element 'property' must have no character or element information item [children], because the type's content type is empty.
WARNING: At line 42 of <https://ci-builds.apache.org/job/Tomee/job/tomee-8.x-build-full-java8/ws/examples/scala-basic/target/surefire-reports/TEST-org.superbiz.GreetingServiceTest.xml>:cvc-complex-type.2.1: Element 'property' must have no character or element information item [children], because the type's content type is empty.
WARNING: At line 46 of <https://ci-builds.apache.org/job/Tomee/job/tomee-8.x-build-full-java8/ws/examples/scala-basic/target/surefire-reports/TEST-org.superbiz.GreetingServiceTest.xml>:cvc-complex-type.2.1: Element 'property' must have no character or element information item [children], because the type's content type is empty.
WARNING: At line 49 of <https://ci-builds.apache.org/job/Tomee/job/tomee-8.x-build-full-java8/ws/examples/scala-basic/target/surefire-reports/TEST-org.superbiz.GreetingServiceTest.xml>:cvc-complex-type.2.1: Element 'property' must have no character or element information item [children], because the type's content type is empty.
WARNING: At line 52 of <https://ci-builds.apache.org/job/Tomee/job/tomee-8.x-build-full-java8/ws/examples/scala-basic/target/surefire-reports/TEST-org.superbiz.GreetingServiceTest.xml>:cvc-complex-type.2.1: Element 'property' must have no character or element information item [children], because the type's content type is empty.
WARNING: At line 56 of <https://ci-builds.apache.org/job/Tomee/job/tomee-8.x-build-full-java8/ws/examples/scala-basic/target/surefire-reports/TEST-org.superbiz.GreetingServiceTest.xml>:cvc-complex-type.2.1: Element 'property' must have no character or element information item [children], because the type's content type is empty.
WARNING: At line 60 of <https://ci-builds.apache.org/job/Tomee/job/tomee-8.x-build-full-java8/ws/examples/scala-basic/target/surefire-reports/TEST-org.superbiz.GreetingServiceTest.xml>:cvc-complex-type.2.1: Element 'property' must have no character or element information item [children], because the type's content type is empty.
WARNING: At line 69 of <https://ci-builds.apache.org/job/Tomee/job/tomee-8.x-build-full-java8/ws/examples/scala-basic/target/surefire-reports/TEST-org.superbiz.GreetingServiceTest.xml>:cvc-complex-type.2.1: Element 'property' must have no character or element information item [children], because the type's content type is empty.
WARNING: At line 74 of <https://ci-builds.apache.org/job/Tomee/job/tomee-8.x-build-full-java8/ws/examples/scala-basic/target/surefire-reports/TEST-org.superbiz.GreetingServiceTest.xml>:cvc-complex-type.2.1: Element 'property' must have no character or element information item [children], because the type's content type is empty.
WARNING: At line 77 of <https://ci-builds.apache.org/job/Tomee/job/tomee-8.x-build-full-java8/ws/examples/scala-basic/target/surefire-reports/TEST-org.superbiz.GreetingServiceTest.xml>:cvc-complex-type.2.1: Element 'property' must have no character or element information item [children], because the type's content type is empty.
WARNING: At line 85 of <https://ci-builds.apache.org/job/Tomee/job/tomee-8.x-build-full-java8/ws/examples/scala-basic/target/surefire-reports/TEST-org.superbiz.GreetingServiceTest.xml>:cvc-complex-type.2.1: Element 'property' must have no character or element information item [children], because the type's content type is empty.
WARNING: At line 89 of <https://ci-builds.apache.org/job/Tomee/job/tomee-8.x-build-full-java8/ws/examples/scala-basic/target/surefire-reports/TEST-org.superbiz.GreetingServiceTest.xml>:cvc-complex-type.2.1: Element 'property' must have no character or element information item [children], because the type's content type is empty.
WARNING: At line 94 of <https://ci-builds.apache.org/job/Tomee/job/tomee-8.x-build-full-java8/ws/examples/scala-basic/target/surefire-reports/TEST-org.superbiz.GreetingServiceTest.xml>:cvc-complex-type.2.1: Element 'property' must have no character or element information item [children], because the type's content type is empty.
WARNING: At line 98 of <https://ci-builds.apache.org/job/Tomee/job/tomee-8.x-build-full-java8/ws/examples/scala-basic/target/surefire-reports/TEST-org.superbiz.GreetingServiceTest.xml>:cvc-complex-type.2.1: Element 'property' must have no character or element information item [children], because the type's content type is empty.
WARNING: The result file '<https://ci-builds.apache.org/job/Tomee/job/tomee-8.x-build-full-java8/ws/examples/scala-basic/target/surefire-reports/TEST-org.superbiz.GreetingServiceTest.xml'> for the metric 'JUnit' is not valid. The result file has been skipped.
INFO: Setting the build status to org.jenkinsci.plugins.xunit.XUnitProcessorResult@492bda78
Jenkins build is back to normal : TomEE » tomee-8.x-build-full-java8 #125
Posted by Apache Jenkins Server <je...@builds.apache.org>.
See <https://ci-builds.apache.org/job/Tomee/job/tomee-8.x-build-full-java8/125/display/redirect>
Build failed in Jenkins: TomEE » tomee-8.x-build-full-java8 #124
Posted by Apache Jenkins Server <je...@builds.apache.org>.
See <https://ci-builds.apache.org/job/Tomee/job/tomee-8.x-build-full-java8/124/display/redirect>
Changes:
------------------------------------------
[...truncated 68.43 MB...]
[INFO] TomEE :: Examples :: JUnit 5 :: Application Composer 8.0.16-SNAPSHOT SUCCESS [ 8.545 s]
[INFO] TomEE :: Examples :: JUnit 5 :: Multiple TomEE with Arquillian 8.0.16-SNAPSHOT SUCCESS [ 12.486 s]
[INFO] TomEE :: Examples :: JUnit 5 :: Simple Websockets with Arquillian 8.0.16-SNAPSHOT SUCCESS [ 10.539 s]
[INFO] TomEE :: Examples :: @EJB Lookup 8.0.16-SNAPSHOT ... SUCCESS [ 2.433 s]
[INFO] TomEE :: Examples :: EJB Lookup with descriptor 8.0.16-SNAPSHOT SUCCESS [ 2.626 s]
[INFO] TomEE :: Examples :: Movies Complete (Meta) 8.0.16-SNAPSHOT SUCCESS [ 5.384 s]
[INFO] TomEE :: Examples :: Movies Complete 8.0.16-SNAPSHOT SUCCESS [ 5.125 s]
[INFO] MicroProfile :: Examples :: Config 8.0.16-SNAPSHOT . SUCCESS [ 15.570 s]
[INFO] MicroProfile :: Examples :: Config Source Database 8.0.16-SNAPSHOT SUCCESS [ 15.728 s]
[INFO] TomEE :: Examples :: Microprofile Fault Tolerance :: Fallback 8.0.16-SNAPSHOT SUCCESS [ 13.579 s]
[INFO] TomEE :: Examples :: Microprofile Fault Tolerance :: Retry 8.0.16-SNAPSHOT SUCCESS [ 15.998 s]
[INFO] TomEE :: Examples :: Microprofile JSONB Configuration 8.0.16-SNAPSHOT SUCCESS [ 4.979 s]
[INFO] Apache TomEE + MicroProfile JWT Bean Validation 8.0.16-SNAPSHOT SUCCESS [ 15.814 s]
[INFO] Apache TomEE + MicroProfile JWT Bean Validation, Strongly-typed Annotations 8.0.16-SNAPSHOT SUCCESS [ 15.267 s]
[INFO] TomEE :: Examples :: Microprofile Metrics Counted 8.0.16-SNAPSHOT SUCCESS [ 13.938 s]
[INFO] TomEE :: Examples :: Microprofile Metrics Histogram 8.0.16-SNAPSHOT SUCCESS [ 12.520 s]
[INFO] TomEE :: Examples :: Microprofile Metrics Timed 8.0.16-SNAPSHOT SUCCESS [ 11.446 s]
[INFO] mp-metrics-gauge 8.0.16-SNAPSHOT ................... SUCCESS [ 13.637 s]
[INFO] mp-metrics-metered 8.0.16-SNAPSHOT ................. SUCCESS [ 1.014 s]
[INFO] mp-opentracing.traced 8.0.16-SNAPSHOT .............. SUCCESS [ 0.243 s]
[INFO] TomEE :: Examples :: MP REST JWT 8.0.16-SNAPSHOT ... SUCCESS [ 14.398 s]
[INFO] TomEE :: Examples :: MP REST JWT JWK 8.0.16-SNAPSHOT SUCCESS [ 17.074 s]
[INFO] TomEE :: Examples :: MP REST JWT PRINCIPAL 8.0.16-SNAPSHOT SUCCESS [ 18.265 s]
[INFO] TomEE :: Examples :: MP REST JWT Public Key 8.0.16-SNAPSHOT SUCCESS [ 12.868 s]
[INFO] TomEE :: Utils :: Mockito 8.0.16-SNAPSHOT .......... SUCCESS [ 7.188 s]
[INFO] TomEE :: Examples :: MTOM 8.0.16-SNAPSHOT .......... SUCCESS [ 16.263 s]
[INFO] TomEE :: Examples :: Multiple JPA providers 8.0.16-SNAPSHOT SUCCESS [ 18.765 s]
[INFO] TomEE :: Examples :: Multiple Arquillian Adapters 8.0.16-SNAPSHOT SUCCESS [ 29.915 s]
[INFO] TomEE :: Examples :: Multiple TomEE with Arquillian 8.0.16-SNAPSHOT FAILURE [ 9.228 s]
[INFO] TomEE :: Examples :: JSF2/CDI/BV/JPA/CODI 8.0.16-SNAPSHOT SUCCESS [ 1.937 s]
[INFO] TomEE :: Examples :: Persistence Fragment 8.0.16-SNAPSHOT SUCCESS [ 3.284 s]
[INFO] TomEE :: Web Examples :: Pojo WS 8.0.16-SNAPSHOT ... SUCCESS [ 0.198 s]
[INFO] TomEE :: Examples :: Polling 8.0.16-SNAPSHOT ....... SUCCESS [ 0.077 s]
[INFO] TomEE :: Examples :: Polling :: Domain 8.0.16-SNAPSHOT SUCCESS [ 1.216 s]
[INFO] TomEE :: Examples :: Polling :: Core 8.0.16-SNAPSHOT SUCCESS [ 7.959 s]
[INFO] TomEE :: Examples :: Polling :: Web 8.0.16-SNAPSHOT SUCCESS [ 23.305 s]
[INFO] TomEE :: Examples :: Polling :: Client 8.0.16-SNAPSHOT SUCCESS [ 0.652 s]
[INFO] TomEE :: Examples :: DeltaSpike ProjectStage 8.0.16-SNAPSHOT SUCCESS [ 20.154 s]
[INFO] TomEE :: Examples :: Quartz 8.0.16-SNAPSHOT ........ SUCCESS [ 0.038 s]
[INFO] TomEE :: Examples :: Quartz :: Quartz Resource Adapter 8.0.16-SNAPSHOT SUCCESS [ 0.153 s]
[INFO] TomEE :: Examples :: Quartz :: Quartz Beans 8.0.16-SNAPSHOT SUCCESS [ 10.128 s]
[INFO] TomEE :: Examples :: DataSource Realm 8.0.16-SNAPSHOT SUCCESS [ 0.075 s]
[INFO] TomEE :: Examples :: Reloadable Persistence Unit Properties 8.0.16-SNAPSHOT SUCCESS [ 5.723 s]
[INFO] TomEE :: Web Examples :: Resource Declared In A Webapp 8.0.16-SNAPSHOT SUCCESS [ 0.098 s]
[INFO] TomEE :: Examples :: REST, Mockito and Application Composer 8.0.16-SNAPSHOT SUCCESS [ 4.721 s]
[INFO] TomEE :: Examples :: REST and Application Composer 8.0.16-SNAPSHOT SUCCESS [ 4.335 s]
[INFO] TomEE :: Examples :: REST CDI 8.0.16-SNAPSHOT ...... SUCCESS [ 6.537 s]
[INFO] TomEE :: Examples :: JAXRS and JAAS 8.0.16-SNAPSHOT SUCCESS [ 0.099 s]
[INFO] TomEE :: Examples :: REST and EJB 8.0.16-SNAPSHOT .. SUCCESS [ 9.466 s]
[INFO] TomEE :: Web Examples :: REST Example 8.0.16-SNAPSHOT SUCCESS [ 20.091 s]
[INFO] TomEE :: Web Examples :: REST Example With Application 8.0.16-SNAPSHOT SUCCESS [ 0.675 s]
[INFO] TomEE :: Web Examples :: REST SSE Example 8.0.16-SNAPSHOT SUCCESS [ 0.352 s]
[INFO] TomEE :: Examples :: REST XML JSON 8.0.16-SNAPSHOT . SUCCESS [ 5.195 s]
[INFO] TomEE :: Examples :: Basic Scala 8.0.16-SNAPSHOT ... SUCCESS [ 24.472 s]
[INFO] TomEE :: Examples :: ScheduleExpression 8.0.16-SNAPSHOT SUCCESS [ 7.491 s]
[INFO] TomEE :: Examples :: @Schedule Events 8.0.16-SNAPSHOT SUCCESS [ 15.631 s]
[INFO] TomEE :: Examples :: @Schedule Methods (Meta) 8.0.16-SNAPSHOT SUCCESS [ 7.867 s]
[INFO] TomEE :: Examples :: @Schedule Methods 8.0.16-SNAPSHOT SUCCESS [ 7.960 s]
[INFO] TomEE :: Examples :: Server Events 8.0.16-SNAPSHOT . SUCCESS [ 3.341 s]
[INFO] TomEE :: Examples :: Serverless Apache TomEE WebProfile 8.0.16-SNAPSHOT SUCCESS [ 6.565 s]
[INFO] TomEE :: Examples :: Serverless Apache TomEE WebProfile 8.0.16-SNAPSHOT SUCCESS [ 6.826 s]
[INFO] TomEE :: Examples :: Serverless Apache TomEE MicroProfile 8.0.16-SNAPSHOT SUCCESS [ 8.966 s]
[INFO] TomEE :: Examples :: Serverless Apache TomEE Plume 8.0.16-SNAPSHOT SUCCESS [ 7.060 s]
[INFO] TomEE :: Examples :: Serverless Apache TomEE Plus 8.0.16-SNAPSHOT SUCCESS [ 9.624 s]
[INFO] TomEE :: Examples :: Singleton startup ordering 8.0.16-SNAPSHOT SUCCESS [ 12.806 s]
[INFO] TomEE :: Examples :: Simple CDI Interceptor 8.0.16-SNAPSHOT SUCCESS [ 3.171 s]
[INFO] TomEE :: Examples :: Simple EAR 8.0.16-SNAPSHOT .... SUCCESS [ 0.031 s]
[INFO] TomEE :: Examples :: Simple EAR :: Business Model 8.0.16-SNAPSHOT SUCCESS [ 1.511 s]
[INFO] TomEE :: Examples :: Simple EAR :: Business Logic 8.0.16-SNAPSHOT SUCCESS [ 6.377 s]
[INFO] TomEE :: Examples :: Simple EAR :: Webapp 8.0.16-SNAPSHOT SUCCESS [ 0.843 s]
[INFO] TomEE :: Examples :: Simple EAR :: EAR Packaging 8.0.16-SNAPSHOT SUCCESS [ 0.225 s]
[INFO] TomEE :: Examples :: Simple EAR :: Functional Tests 8.0.16-SNAPSHOT SUCCESS [ 22.598 s]
[INFO] TomEE :: Examples :: Simple CMP2 Entity 8.0.16-SNAPSHOT SUCCESS [ 4.773 s]
[INFO] TomEE :: Examples :: Simple JMS 8.0.16-SNAPSHOT .... SUCCESS [ 19.712 s]
[INFO] TomEE :: Examples :: Simple JMS Context 8.0.16-SNAPSHOT SUCCESS [ 18.385 s]
[INFO] TomEE :: Examples :: Simple MDB With a CDI Injection 8.0.16-SNAPSHOT SUCCESS [ 7.853 s]
[INFO] TomEE :: Examples :: Simple MDB Example 8.0.16-SNAPSHOT SUCCESS [ 7.422 s]
[INFO] TomEE :: Examples :: Simple MDB Using Deployment Descriptor Example 8.0.16-SNAPSHOT SUCCESS [ 8.109 s]
[INFO] TomEE :: Examples :: Simple Remote tomcat-users.xml 8.0.16-SNAPSHOT SUCCESS [ 9.420 s]
[INFO] TomEE :: Examples :: Simple REST 8.0.16-SNAPSHOT ... SUCCESS [ 3.746 s]
[INFO] TomEE :: Examples :: Simple Singleton 8.0.16-SNAPSHOT SUCCESS [ 2.503 s]
[INFO] TomEE :: Examples :: Simple Stateful Pojo 8.0.16-SNAPSHOT SUCCESS [ 2.276 s]
[INFO] TomEE :: Examples :: Simple Stateful Pojo Callbacks 8.0.16-SNAPSHOT SUCCESS [ 6.393 s]
[INFO] TomEE :: Examples :: Simple Stateless Pojo 8.0.16-SNAPSHOT SUCCESS [ 2.790 s]
[INFO] TomEE :: Examples :: Simple Stateless Pojo Callbacks 8.0.16-SNAPSHOT SUCCESS [ 3.486 s]
[INFO] TomEE :: Examples :: Simple Stateless With Deployment Descriptor 8.0.16-SNAPSHOT SUCCESS [ 2.450 s]
[INFO] TomEE :: Examples :: Simple Webservice 8.0.16-SNAPSHOT SUCCESS [ 8.070 s]
[INFO] TomEE :: Examples :: Simple Webservice Without Interface 8.0.16-SNAPSHOT SUCCESS [ 7.303 s]
[INFO] OpenEJB :: Examples :: Async Servlet 8.0.16-SNAPSHOT SUCCESS [ 26.154 s]
[INFO] TomEE :: Examples :: Spring Data 8.0.16-SNAPSHOT ... SUCCESS [ 8.077 s]
[INFO] TomEE :: Examples :: Spring Data Meta 8.0.16-SNAPSHOT SUCCESS [ 5.745 s]
[INFO] TomEE :: Web Examples :: Struts 8.0.16-SNAPSHOT .... SUCCESS [ 1.035 s]
[INFO] TomEE :: Examples :: Telephone Stateful Pojo 8.0.16-SNAPSHOT SUCCESS [ 3.709 s]
[INFO] TomEE :: Examples :: TestCase Injection 8.0.16-SNAPSHOT SUCCESS [ 5.340 s]
[INFO] TomEE :: Examples :: Testing Security (Meta) 8.0.16-SNAPSHOT SUCCESS [ 5.454 s]
[INFO] TomEE :: Examples :: Testing Security 8.0.16-SNAPSHOT SUCCESS [ 7.978 s]
[INFO] TomEE :: Examples :: Testing Security 8.0.16-SNAPSHOT SUCCESS [ 8.161 s]
[INFO] TomEE :: Examples :: Testing Security Service Provider 8.0.16-SNAPSHOT SUCCESS [ 7.778 s]
[INFO] TomEE :: Examples :: Testing Security Script Service Provider 8.0.16-SNAPSHOT SUCCESS [ 7.416 s]
[INFO] TomEE :: Examples :: Testing Transactions 8.0.16-SNAPSHOT SUCCESS [ 5.766 s]
[INFO] TomEE :: Examples :: Testing Transactions BMT 8.0.16-SNAPSHOT SUCCESS [ 5.457 s]
[INFO] TomEE :: Examples :: TomEE, Jersey, Eclipselink 8.0.16-SNAPSHOT SUCCESS [ 14.369 s]
[INFO] TomEE :: TomEE :: IBM MQ AMQ Portability Examples :: MDB Example 1.0 SUCCESS [ 1.160 s]
[INFO] TomEE :: Examples :: Transaction Rollback 8.0.16-SNAPSHOT SUCCESS [ 6.929 s]
[INFO] TomEE :: Examples :: Troubleshooting 8.0.16-SNAPSHOT SUCCESS [ 5.182 s]
[INFO] TomEE :: Examples :: Webservice Attachments 8.0.16-SNAPSHOT SUCCESS [ 5.896 s]
[INFO] TomEE :: Examples :: Webservice Inheritance 8.0.16-SNAPSHOT SUCCESS [ 10.431 s]
[INFO] TomEE :: Web Examples :: EJB WebService with Security 8.0.16-SNAPSHOT SUCCESS [ 6.901 s]
[INFO] TomEE :: Web Examples :: EJB WebService with SSL Client Certificate 8.0.16-SNAPSHOT SUCCESS [ 23.417 s]
[INFO] TomEE :: Web Examples :: EJB WebService with WS-Security 8.0.16-SNAPSHOT SUCCESS [ 16.786 s]
[INFO] TomEE :: Web Examples :: EJB WebService WS Security with resources.xml 8.0.16-SNAPSHOT SUCCESS [ 7.951 s]
[INFO] TomEE :: Examples :: Web Service Handlers 8.0.16-SNAPSHOT SUCCESS [ 7.367 s]
[INFO] TomEE :: Examples :: @WebService Holder 8.0.16-SNAPSHOT SUCCESS [ 7.625 s]
[INFO] TomEE :: Web Examples :: Moviefun 8.0.16-SNAPSHOT .. SUCCESS [ 58.212 s]
[INFO] TomEE :: Web Examples :: Moviefun Rest 8.0.16-SNAPSHOT SUCCESS [ 32.214 s]
[INFO] TomEE :: Utils :: Provisionning 8.0.16-SNAPSHOT .... SUCCESS [ 4.414 s]
[INFO] TomEE :: Examples :: Resources/JMX Example 8.0.16-SNAPSHOT SUCCESS [ 0.076 s]
[INFO] TomEE :: Examples :: Resources/JMX Example :: EJB Module 8.0.16-SNAPSHOT SUCCESS [ 17.395 s]
[INFO] TomEE :: Examples :: Resources/JMX Example :: EAR Module 8.0.16-SNAPSHOT SUCCESS [ 0.296 s]
[INFO] TomEE :: Examples :: WebSocket with tls and basic auth Example 8.0.16-SNAPSHOT SUCCESS [ 10.789 s]
[INFO] TomEE :: Examples :: Concurrency utilities example 8.0.16-SNAPSHOT SUCCESS [ 15.657 s]
[INFO] TomEE :: Examples :: MVC (CXF-based) 8.0.16-SNAPSHOT SUCCESS [01:12 min]
[INFO] TomEE :: Examples :: MVC (CXF-based) with Hibernate 8.0.16-SNAPSHOT SUCCESS [ 40.940 s]
[INFO] TomEE :: Examples :: Microprofile REST Client 8.0.16-SNAPSHOT SUCCESS [ 14.889 s]
[INFO] TomEE :: Examples :: MVC (RestEasy-based) 8.0.16-SNAPSHOT SUCCESS [ 24.642 s]
[INFO] TomEE :: Examples :: Custom HealthCheck 8.0.16-SNAPSHOT SUCCESS [ 12.613 s]
[INFO] TomEE :: Examples :: Microprofile JSONB Configuration 8.0.16-SNAPSHOT SUCCESS [ 3.752 s]
[INFO] TomEE :: Examples :: Microprofile JSONB Custom Serializer/Deserializer 8.0.16-SNAPSHOT SUCCESS [ 4.291 s]
[INFO] TomEE :: Examples :: Vaadin LTS V08 8.0.16-SNAPSHOT SUCCESS [ 4.859 s]
[INFO] TomEE :: Examples :: Vaadin LTS V10 8.0.16-SNAPSHOT SUCCESS [ 9.679 s]
[INFO] TomEE :: Examples :: Vaadin LATEST 8.0.16-SNAPSHOT . SUCCESS [ 11.449 s]
[INFO] TomEE :: Examples :: Azure deployment example 8.0.16-SNAPSHOT SUCCESS [ 9.880 s]
[INFO] TomEE :: Examples :: Microprofile Fault Tolerance :: Timeout 8.0.16-SNAPSHOT SUCCESS [ 16.585 s]
[INFO] TomEE :: Examples :: XA Datasource configuration and usage 8.0.16-SNAPSHOT SUCCESS [01:37 min]
[INFO] TomEE :: Examples :: Websocket JMS 8.0.16-SNAPSHOT . SUCCESS [ 10.033 s]
[INFO] TomEE :: Examples :: Properties Provider 8.0.16-SNAPSHOT SUCCESS [ 0.007 s]
[INFO] TomEE :: Examples :: Properties Provider :: Implementation 8.0.16-SNAPSHOT SUCCESS [ 0.146 s]
[INFO] TomEE :: Examples :: Properties Provider :: Sample Webapp 8.0.16-SNAPSHOT SUCCESS [ 8.112 s]
[INFO] TomEE :: Examples :: Jakarta Security tomcat-user.xml Identity Store 8.0.16-SNAPSHOT SUCCESS [ 12.480 s]
[INFO] TomEE :: Examples :: Jakarta Security custom Identity Store 8.0.16-SNAPSHOT SUCCESS [ 13.652 s]
[INFO] TomEE :: Examples 8.0.16-SNAPSHOT .................. SUCCESS [ 0.540 s]
[INFO] TomEE :: Assembly :: All In One EJB Lite jar 8.0.16-SNAPSHOT SUCCESS [ 40.073 s]
[INFO] TomEE :: Utils :: TomEE Webapps-based Deployer EJB 8.0.16-SNAPSHOT SUCCESS [ 0.833 s]
[INFO] TomEE :: TCK 8.0.16-SNAPSHOT ....................... SUCCESS [ 0.019 s]
[INFO] TomEE :: TCK :: Common 8.0.16-SNAPSHOT ............. SUCCESS [ 1.381 s]
[INFO] TomEE :: TCK :: CDI Embedded 8.0.16-SNAPSHOT ....... SUCCESS [05:40 min]
[INFO] TomEE :: TCK :: CDI TomEE 8.0.16-SNAPSHOT .......... SUCCESS [51:51 min]
[INFO] TomEE :: TCK :: CDI TCK Signature Tests 8.0.16-SNAPSHOT SUCCESS [ 3.180 s]
[INFO] TomEE :: TCK :: Bean Validation Embedded 8.0.16-SNAPSHOT SUCCESS [01:17 min]
[INFO] TomEE :: TCK :: Bean Validation TomEE 8.0.16-SNAPSHOT SUCCESS [08:04 min]
[INFO] TomEE :: TCK :: Bean Validation TCK Signature tests 8.0.16-SNAPSHOT SUCCESS [ 1.829 s]
[INFO] TomEE :: TCK :: MicroProfile 8.0.16-SNAPSHOT ....... SUCCESS [ 0.028 s]
[INFO] TomEE :: TCK :: MicroProfile Config TCK 8.0.16-SNAPSHOT SUCCESS [03:21 min]
[INFO] TomEE :: TCK :: MicroProfile JWT TCK 8.0.16-SNAPSHOT SUCCESS [01:31 min]
[INFO] TomEE :: TCK :: MicroProfile Fault Tolerance TCK 8.0.16-SNAPSHOT FAILURE [11:08 min]
[INFO] TomEE :: TCK :: MicroProfile Health TCK 8.0.16-SNAPSHOT SUCCESS [01:25 min]
[INFO] TomEE :: TCK :: MicroProfile Metrics TCK 8.0.16-SNAPSHOT SUCCESS [09:42 min]
[INFO] TomEE :: TCK :: MicroProfile Rest Client TCK 8.0.16-SNAPSHOT SUCCESS [11:44 min]
[INFO] TomEE :: TCK :: MicroProfile Open API TCK 8.0.16-SNAPSHOT SUCCESS [06:51 min]
[INFO] TomEE :: TCK :: MicroProfile Open Tracing TCK 8.0.16-SNAPSHOT SUCCESS [ 39.369 s]
[INFO] TomEE :: Arquillian Adaptors Parent :: Webapp Remote 8.0.16-SNAPSHOT SUCCESS [01:02 min]
[INFO] TomEE :: Arquillian Adaptors Parent :: Tests 8.0.16-SNAPSHOT SUCCESS [ 3.989 s]
[INFO] TomEE :: Arquillian Adaptors Parent :: Tests :: Web Profile 8.0.16-SNAPSHOT SUCCESS [10:42 min]
[INFO] TomEE :: Arquillian Adaptors Parent :: Tests :: JAXRS 8.0.16-SNAPSHOT SUCCESS [04:38 min]
[INFO] TomEE :: Arquillian Adaptors Parent :: Tests :: JAXWS 8.0.16-SNAPSHOT SUCCESS [01:32 min]
[INFO] TomEE :: Arquillian Adaptors Parent :: Tests :: JMS 8.0.16-SNAPSHOT SUCCESS [ 50.619 s]
[INFO] TomEE :: Arquillian Adaptors Parent :: Tests :: CODI 8.0.16-SNAPSHOT SUCCESS [01:15 min]
[INFO] TomEE :: Arquillian Adaptors Parent :: Tests :: Configuration Tests 8.0.16-SNAPSHOT SUCCESS [01:10 min]
[INFO] TomEE :: Arquillian Adaptors Parent :: Sample :: Moviefun 8.0.16-SNAPSHOT SUCCESS [ 48.975 s]
[INFO] TomEE :: Arquillian Adaptors Parent :: Arquillian TCK 8.0.16-SNAPSHOT SUCCESS [ 1.512 s]
[INFO] TomEE :: Utils :: Log4j2 8.0.16-SNAPSHOT ........... SUCCESS [ 1.141 s]
[INFO] TomEE :: TomEE :: webaccess 8.0.16-SNAPSHOT ........ SUCCESS [ 17.966 s]
[INFO] TomEE :: TomEE :: Overlay Runner 8.0.16-SNAPSHOT ... SUCCESS [ 0.717 s]
[INFO] ------------------------------------------------------------------------
[INFO] BUILD FAILURE
[INFO] ------------------------------------------------------------------------
[INFO] Total time: 04:04 h
[INFO] Finished at: 2023-07-10T18:45:13Z
[INFO] ------------------------------------------------------------------------
[ERROR] Failed to execute goal org.apache.maven.plugins:maven-surefire-plugin:2.18.1:test (default-test) on project multiple-tomee-arquillian: There are test failures.
[ERROR]
[ERROR] Please refer to <https://ci-builds.apache.org/job/Tomee/job/tomee-8.x-build-full-java8/ws/examples/multiple-tomee-arquillian/target/surefire-reports> for the individual test results.
[ERROR] -> [Help 1]
[ERROR] Failed to execute goal org.apache.maven.plugins:maven-surefire-plugin:3.0.0-M1:test (default-test) on project microprofile-fault-tolerance-tck: There are test failures.
[ERROR]
[ERROR] Please refer to <https://ci-builds.apache.org/job/Tomee/job/tomee-8.x-build-full-java8/ws/tck/microprofile-tck/fault-tolerance/target/surefire-reports> for the individual test results.
[ERROR] Please refer to dump files (if any exist) [date].dump, [date]-jvmRun[N].dump and [date].dumpstream.
[ERROR] -> [Help 1]
[ERROR]
[ERROR] To see the full stack trace of the errors, re-run Maven with the -e switch.
[ERROR] Re-run Maven using the -X switch to enable full debug logging.
[ERROR]
[ERROR] For more information about the errors and possible solutions, please read the following articles:
[ERROR] [Help 1] http://cwiki.apache.org/confluence/display/MAVEN/MojoFailureException
[ERROR]
[ERROR] After correcting the problems, you can resume the build with the command
[ERROR] mvn <args> -rf :multiple-tomee-arquillian
Build step 'Invoke top-level Maven targets' marked build as failure
INFO: Processing JUnit
INFO: [JUnit] - 1,351 test report file(s) were found with the pattern '**/target/surefire-reports/TEST-*.xml' relative to '<https://ci-builds.apache.org/job/Tomee/job/tomee-8.x-build-full-java8/ws/'> for the testing framework 'JUnit'.
WARNING: The file '<https://ci-builds.apache.org/job/Tomee/job/tomee-8.x-build-full-java8/ws/examples/scala-basic/target/surefire-reports/TEST-org.scalatest.tools.DiscoverySuite-ad66bde5-c9fd-45c0-99a7-00c83e095811.xml'> is an invalid file.
WARNING: At line 8 of <https://ci-builds.apache.org/job/Tomee/job/tomee-8.x-build-full-java8/ws/examples/scala-basic/target/surefire-reports/TEST-org.scalatest.tools.DiscoverySuite-ad66bde5-c9fd-45c0-99a7-00c83e095811.xml>:cvc-complex-type.2.1: Element 'property' must have no character or element information item [children], because the type's content type is empty.
WARNING: At line 14 of <https://ci-builds.apache.org/job/Tomee/job/tomee-8.x-build-full-java8/ws/examples/scala-basic/target/surefire-reports/TEST-org.scalatest.tools.DiscoverySuite-ad66bde5-c9fd-45c0-99a7-00c83e095811.xml>:cvc-complex-type.2.1: Element 'property' must have no character or element information item [children], because the type's content type is empty.
WARNING: At line 25 of <https://ci-builds.apache.org/job/Tomee/job/tomee-8.x-build-full-java8/ws/examples/scala-basic/target/surefire-reports/TEST-org.scalatest.tools.DiscoverySuite-ad66bde5-c9fd-45c0-99a7-00c83e095811.xml>:cvc-complex-type.2.1: Element 'property' must have no character or element information item [children], because the type's content type is empty.
WARNING: At line 28 of <https://ci-builds.apache.org/job/Tomee/job/tomee-8.x-build-full-java8/ws/examples/scala-basic/target/surefire-reports/TEST-org.scalatest.tools.DiscoverySuite-ad66bde5-c9fd-45c0-99a7-00c83e095811.xml>:cvc-complex-type.2.1: Element 'property' must have no character or element information item [children], because the type's content type is empty.
WARNING: At line 33 of <https://ci-builds.apache.org/job/Tomee/job/tomee-8.x-build-full-java8/ws/examples/scala-basic/target/surefire-reports/TEST-org.scalatest.tools.DiscoverySuite-ad66bde5-c9fd-45c0-99a7-00c83e095811.xml>:cvc-complex-type.2.1: Element 'property' must have no character or element information item [children], because the type's content type is empty.
WARNING: At line 36 of <https://ci-builds.apache.org/job/Tomee/job/tomee-8.x-build-full-java8/ws/examples/scala-basic/target/surefire-reports/TEST-org.scalatest.tools.DiscoverySuite-ad66bde5-c9fd-45c0-99a7-00c83e095811.xml>:cvc-complex-type.2.1: Element 'property' must have no character or element information item [children], because the type's content type is empty.
WARNING: At line 39 of <https://ci-builds.apache.org/job/Tomee/job/tomee-8.x-build-full-java8/ws/examples/scala-basic/target/surefire-reports/TEST-org.scalatest.tools.DiscoverySuite-ad66bde5-c9fd-45c0-99a7-00c83e095811.xml>:cvc-complex-type.2.1: Element 'property' must have no character or element information item [children], because the type's content type is empty.
WARNING: At line 47 of <https://ci-builds.apache.org/job/Tomee/job/tomee-8.x-build-full-java8/ws/examples/scala-basic/target/surefire-reports/TEST-org.scalatest.tools.DiscoverySuite-ad66bde5-c9fd-45c0-99a7-00c83e095811.xml>:cvc-complex-type.2.1: Element 'property' must have no character or element information item [children], because the type's content type is empty.
WARNING: At line 51 of <https://ci-builds.apache.org/job/Tomee/job/tomee-8.x-build-full-java8/ws/examples/scala-basic/target/surefire-reports/TEST-org.scalatest.tools.DiscoverySuite-ad66bde5-c9fd-45c0-99a7-00c83e095811.xml>:cvc-complex-type.2.1: Element 'property' must have no character or element information item [children], because the type's content type is empty.
WARNING: At line 55 of <https://ci-builds.apache.org/job/Tomee/job/tomee-8.x-build-full-java8/ws/examples/scala-basic/target/surefire-reports/TEST-org.scalatest.tools.DiscoverySuite-ad66bde5-c9fd-45c0-99a7-00c83e095811.xml>:cvc-complex-type.2.1: Element 'property' must have no character or element information item [children], because the type's content type is empty.
WARNING: At line 58 of <https://ci-builds.apache.org/job/Tomee/job/tomee-8.x-build-full-java8/ws/examples/scala-basic/target/surefire-reports/TEST-org.scalatest.tools.DiscoverySuite-ad66bde5-c9fd-45c0-99a7-00c83e095811.xml>:cvc-complex-type.2.1: Element 'property' must have no character or element information item [children], because the type's content type is empty.
WARNING: At line 62 of <https://ci-builds.apache.org/job/Tomee/job/tomee-8.x-build-full-java8/ws/examples/scala-basic/target/surefire-reports/TEST-org.scalatest.tools.DiscoverySuite-ad66bde5-c9fd-45c0-99a7-00c83e095811.xml>:cvc-complex-type.2.1: Element 'property' must have no character or element information item [children], because the type's content type is empty.
WARNING: At line 66 of <https://ci-builds.apache.org/job/Tomee/job/tomee-8.x-build-full-java8/ws/examples/scala-basic/target/surefire-reports/TEST-org.scalatest.tools.DiscoverySuite-ad66bde5-c9fd-45c0-99a7-00c83e095811.xml>:cvc-complex-type.2.1: Element 'property' must have no character or element information item [children], because the type's content type is empty.
WARNING: At line 74 of <https://ci-builds.apache.org/job/Tomee/job/tomee-8.x-build-full-java8/ws/examples/scala-basic/target/surefire-reports/TEST-org.scalatest.tools.DiscoverySuite-ad66bde5-c9fd-45c0-99a7-00c83e095811.xml>:cvc-complex-type.2.1: Element 'property' must have no character or element information item [children], because the type's content type is empty.
WARNING: At line 78 of <https://ci-builds.apache.org/job/Tomee/job/tomee-8.x-build-full-java8/ws/examples/scala-basic/target/surefire-reports/TEST-org.scalatest.tools.DiscoverySuite-ad66bde5-c9fd-45c0-99a7-00c83e095811.xml>:cvc-complex-type.2.1: Element 'property' must have no character or element information item [children], because the type's content type is empty.
WARNING: At line 83 of <https://ci-builds.apache.org/job/Tomee/job/tomee-8.x-build-full-java8/ws/examples/scala-basic/target/surefire-reports/TEST-org.scalatest.tools.DiscoverySuite-ad66bde5-c9fd-45c0-99a7-00c83e095811.xml>:cvc-complex-type.2.1: Element 'property' must have no character or element information item [children], because the type's content type is empty.
WARNING: At line 86 of <https://ci-builds.apache.org/job/Tomee/job/tomee-8.x-build-full-java8/ws/examples/scala-basic/target/surefire-reports/TEST-org.scalatest.tools.DiscoverySuite-ad66bde5-c9fd-45c0-99a7-00c83e095811.xml>:cvc-complex-type.2.1: Element 'property' must have no character or element information item [children], because the type's content type is empty.
WARNING: At line 94 of <https://ci-builds.apache.org/job/Tomee/job/tomee-8.x-build-full-java8/ws/examples/scala-basic/target/surefire-reports/TEST-org.scalatest.tools.DiscoverySuite-ad66bde5-c9fd-45c0-99a7-00c83e095811.xml>:cvc-complex-type.2.1: Element 'property' must have no character or element information item [children], because the type's content type is empty.
WARNING: At line 98 of <https://ci-builds.apache.org/job/Tomee/job/tomee-8.x-build-full-java8/ws/examples/scala-basic/target/surefire-reports/TEST-org.scalatest.tools.DiscoverySuite-ad66bde5-c9fd-45c0-99a7-00c83e095811.xml>:cvc-complex-type.2.1: Element 'property' must have no character or element information item [children], because the type's content type is empty.
WARNING: At line 103 of <https://ci-builds.apache.org/job/Tomee/job/tomee-8.x-build-full-java8/ws/examples/scala-basic/target/surefire-reports/TEST-org.scalatest.tools.DiscoverySuite-ad66bde5-c9fd-45c0-99a7-00c83e095811.xml>:cvc-complex-type.2.1: Element 'property' must have no character or element information item [children], because the type's content type is empty.
WARNING: At line 106 of <https://ci-builds.apache.org/job/Tomee/job/tomee-8.x-build-full-java8/ws/examples/scala-basic/target/surefire-reports/TEST-org.scalatest.tools.DiscoverySuite-ad66bde5-c9fd-45c0-99a7-00c83e095811.xml>:cvc-complex-type.2.1: Element 'property' must have no character or element information item [children], because the type's content type is empty.
WARNING: At line 110 of <https://ci-builds.apache.org/job/Tomee/job/tomee-8.x-build-full-java8/ws/examples/scala-basic/target/surefire-reports/TEST-org.scalatest.tools.DiscoverySuite-ad66bde5-c9fd-45c0-99a7-00c83e095811.xml>:cvc-complex-type.2.1: Element 'property' must have no character or element information item [children], because the type's content type is empty.
WARNING: The result file '<https://ci-builds.apache.org/job/Tomee/job/tomee-8.x-build-full-java8/ws/examples/scala-basic/target/surefire-reports/TEST-org.scalatest.tools.DiscoverySuite-ad66bde5-c9fd-45c0-99a7-00c83e095811.xml'> for the metric 'JUnit' is not valid. The result file has been skipped.
WARNING: The file '<https://ci-builds.apache.org/job/Tomee/job/tomee-8.x-build-full-java8/ws/examples/scala-basic/target/surefire-reports/TEST-org.superbiz.GreetingServiceTest.xml'> is an invalid file.
WARNING: At line 8 of <https://ci-builds.apache.org/job/Tomee/job/tomee-8.x-build-full-java8/ws/examples/scala-basic/target/surefire-reports/TEST-org.superbiz.GreetingServiceTest.xml>:cvc-complex-type.2.1: Element 'property' must have no character or element information item [children], because the type's content type is empty.
WARNING: At line 14 of <https://ci-builds.apache.org/job/Tomee/job/tomee-8.x-build-full-java8/ws/examples/scala-basic/target/surefire-reports/TEST-org.superbiz.GreetingServiceTest.xml>:cvc-complex-type.2.1: Element 'property' must have no character or element information item [children], because the type's content type is empty.
WARNING: At line 25 of <https://ci-builds.apache.org/job/Tomee/job/tomee-8.x-build-full-java8/ws/examples/scala-basic/target/surefire-reports/TEST-org.superbiz.GreetingServiceTest.xml>:cvc-complex-type.2.1: Element 'property' must have no character or element information item [children], because the type's content type is empty.
WARNING: At line 28 of <https://ci-builds.apache.org/job/Tomee/job/tomee-8.x-build-full-java8/ws/examples/scala-basic/target/surefire-reports/TEST-org.superbiz.GreetingServiceTest.xml>:cvc-complex-type.2.1: Element 'property' must have no character or element information item [children], because the type's content type is empty.
WARNING: At line 33 of <https://ci-builds.apache.org/job/Tomee/job/tomee-8.x-build-full-java8/ws/examples/scala-basic/target/surefire-reports/TEST-org.superbiz.GreetingServiceTest.xml>:cvc-complex-type.2.1: Element 'property' must have no character or element information item [children], because the type's content type is empty.
WARNING: At line 36 of <https://ci-builds.apache.org/job/Tomee/job/tomee-8.x-build-full-java8/ws/examples/scala-basic/target/surefire-reports/TEST-org.superbiz.GreetingServiceTest.xml>:cvc-complex-type.2.1: Element 'property' must have no character or element information item [children], because the type's content type is empty.
WARNING: At line 39 of <https://ci-builds.apache.org/job/Tomee/job/tomee-8.x-build-full-java8/ws/examples/scala-basic/target/surefire-reports/TEST-org.superbiz.GreetingServiceTest.xml>:cvc-complex-type.2.1: Element 'property' must have no character or element information item [children], because the type's content type is empty.
WARNING: At line 47 of <https://ci-builds.apache.org/job/Tomee/job/tomee-8.x-build-full-java8/ws/examples/scala-basic/target/surefire-reports/TEST-org.superbiz.GreetingServiceTest.xml>:cvc-complex-type.2.1: Element 'property' must have no character or element information item [children], because the type's content type is empty.
WARNING: At line 51 of <https://ci-builds.apache.org/job/Tomee/job/tomee-8.x-build-full-java8/ws/examples/scala-basic/target/surefire-reports/TEST-org.superbiz.GreetingServiceTest.xml>:cvc-complex-type.2.1: Element 'property' must have no character or element information item [children], because the type's content type is empty.
WARNING: At line 55 of <https://ci-builds.apache.org/job/Tomee/job/tomee-8.x-build-full-java8/ws/examples/scala-basic/target/surefire-reports/TEST-org.superbiz.GreetingServiceTest.xml>:cvc-complex-type.2.1: Element 'property' must have no character or element information item [children], because the type's content type is empty.
WARNING: At line 58 of <https://ci-builds.apache.org/job/Tomee/job/tomee-8.x-build-full-java8/ws/examples/scala-basic/target/surefire-reports/TEST-org.superbiz.GreetingServiceTest.xml>:cvc-complex-type.2.1: Element 'property' must have no character or element information item [children], because the type's content type is empty.
WARNING: At line 62 of <https://ci-builds.apache.org/job/Tomee/job/tomee-8.x-build-full-java8/ws/examples/scala-basic/target/surefire-reports/TEST-org.superbiz.GreetingServiceTest.xml>:cvc-complex-type.2.1: Element 'property' must have no character or element information item [children], because the type's content type is empty.
WARNING: At line 66 of <https://ci-builds.apache.org/job/Tomee/job/tomee-8.x-build-full-java8/ws/examples/scala-basic/target/surefire-reports/TEST-org.superbiz.GreetingServiceTest.xml>:cvc-complex-type.2.1: Element 'property' must have no character or element information item [children], because the type's content type is empty.
WARNING: At line 74 of <https://ci-builds.apache.org/job/Tomee/job/tomee-8.x-build-full-java8/ws/examples/scala-basic/target/surefire-reports/TEST-org.superbiz.GreetingServiceTest.xml>:cvc-complex-type.2.1: Element 'property' must have no character or element information item [children], because the type's content type is empty.
WARNING: At line 78 of <https://ci-builds.apache.org/job/Tomee/job/tomee-8.x-build-full-java8/ws/examples/scala-basic/target/surefire-reports/TEST-org.superbiz.GreetingServiceTest.xml>:cvc-complex-type.2.1: Element 'property' must have no character or element information item [children], because the type's content type is empty.
WARNING: At line 83 of <https://ci-builds.apache.org/job/Tomee/job/tomee-8.x-build-full-java8/ws/examples/scala-basic/target/surefire-reports/TEST-org.superbiz.GreetingServiceTest.xml>:cvc-complex-type.2.1: Element 'property' must have no character or element information item [children], because the type's content type is empty.
WARNING: At line 86 of <https://ci-builds.apache.org/job/Tomee/job/tomee-8.x-build-full-java8/ws/examples/scala-basic/target/surefire-reports/TEST-org.superbiz.GreetingServiceTest.xml>:cvc-complex-type.2.1: Element 'property' must have no character or element information item [children], because the type's content type is empty.
WARNING: At line 94 of <https://ci-builds.apache.org/job/Tomee/job/tomee-8.x-build-full-java8/ws/examples/scala-basic/target/surefire-reports/TEST-org.superbiz.GreetingServiceTest.xml>:cvc-complex-type.2.1: Element 'property' must have no character or element information item [children], because the type's content type is empty.
WARNING: At line 98 of <https://ci-builds.apache.org/job/Tomee/job/tomee-8.x-build-full-java8/ws/examples/scala-basic/target/surefire-reports/TEST-org.superbiz.GreetingServiceTest.xml>:cvc-complex-type.2.1: Element 'property' must have no character or element information item [children], because the type's content type is empty.
WARNING: At line 103 of <https://ci-builds.apache.org/job/Tomee/job/tomee-8.x-build-full-java8/ws/examples/scala-basic/target/surefire-reports/TEST-org.superbiz.GreetingServiceTest.xml>:cvc-complex-type.2.1: Element 'property' must have no character or element information item [children], because the type's content type is empty.
WARNING: At line 106 of <https://ci-builds.apache.org/job/Tomee/job/tomee-8.x-build-full-java8/ws/examples/scala-basic/target/surefire-reports/TEST-org.superbiz.GreetingServiceTest.xml>:cvc-complex-type.2.1: Element 'property' must have no character or element information item [children], because the type's content type is empty.
WARNING: At line 110 of <https://ci-builds.apache.org/job/Tomee/job/tomee-8.x-build-full-java8/ws/examples/scala-basic/target/surefire-reports/TEST-org.superbiz.GreetingServiceTest.xml>:cvc-complex-type.2.1: Element 'property' must have no character or element information item [children], because the type's content type is empty.
WARNING: The result file '<https://ci-builds.apache.org/job/Tomee/job/tomee-8.x-build-full-java8/ws/examples/scala-basic/target/surefire-reports/TEST-org.superbiz.GreetingServiceTest.xml'> for the metric 'JUnit' is not valid. The result file has been skipped.
INFO: Setting the build status to org.jenkinsci.plugins.xunit.XUnitProcessorResult@3a678eb1