You are viewing a plain text version of this content. The canonical link for it is here.
Posted to builds@lucene.apache.org by Policeman Jenkins Server via builds <bu...@lucene.apache.org> on 2026/05/04 13:42:01 UTC
[JENKINS-EA] Lucene-main-Linux (64bit/hotspot/jdk-27-ea+14) - Build # 64478 - Unstable!
Build: https://jenkins.thetaphi.de/job/Lucene-main-Linux/64478/
Java: 64bit/hotspot/jdk-27-ea+14 -XX:-UseCompressedOops -XX:+UseG1GC
1 tests failed.
FAILED: org.apache.lucene.search.TestLRUQueryCache.testUnifiedCacheEntryCallbacks
Error Message:
java.lang.AssertionError: Expected exactly 1 segment expected:<1> but was:<2>
Stack Trace:
java.lang.AssertionError: Expected exactly 1 segment expected:<1> but was:<2>
at __randomizedtesting.SeedInfo.seed([E705FD8C6719F8B1:93DAEB3832679CD0]:0)
at org.junit.Assert.fail(Assert.java:89)
at org.junit.Assert.failNotEquals(Assert.java:835)
at org.junit.Assert.assertEquals(Assert.java:647)
at org.apache.lucene.search.TestLRUQueryCache.testUnifiedCacheEntryCallbacks(TestLRUQueryCache.java:2658)