You are viewing a plain text version of this content. The canonical link for it is here.
Posted to mapreduce-dev@hadoop.apache.org by Apache Jenkins Server <je...@builds.apache.org> on 2015/11/10 00:32:06 UTC
Hadoop-Mapreduce-trunk - Build # 2588 - Still Failing
See https://builds.apache.org/job/Hadoop-Mapreduce-trunk/2588/
###################################################################################
########################## LAST 60 LINES OF THE CONSOLE ###########################
[...truncated 32800 lines...]
Tests run: 3, Failures: 0, Errors: 0, Skipped: 0, Time elapsed: 183.142 sec - in org.apache.hadoop.mapreduce.TestMRJobClient
Running org.apache.hadoop.mapreduce.TestMapCollection
Tests run: 11, Failures: 0, Errors: 0, Skipped: 0, Time elapsed: 14.087 sec - in org.apache.hadoop.mapreduce.TestMapCollection
Running org.apache.hadoop.conf.TestNoDefaultsJobConf
Tests run: 1, Failures: 0, Errors: 0, Skipped: 0, Time elapsed: 23.593 sec - in org.apache.hadoop.conf.TestNoDefaultsJobConf
Running org.apache.hadoop.util.TestMRCJCReflectionUtils
Tests run: 1, Failures: 0, Errors: 0, Skipped: 0, Time elapsed: 0.666 sec - in org.apache.hadoop.util.TestMRCJCReflectionUtils
Running org.apache.hadoop.util.TestMRCJCRunJar
Tests run: 1, Failures: 0, Errors: 0, Skipped: 0, Time elapsed: 0.275 sec - in org.apache.hadoop.util.TestMRCJCRunJar
Results :
Tests in error:
TestMRTimelineEventHandling.testMRTimelineEventHandling:99 » IO Job didn't fin...
TestMRTimelineEventHandling.testMapreduceJobTimelineServiceEnabled:162 » IO Jo...
Tests run: 523, Failures: 0, Errors: 2, Skipped: 11
[INFO] ------------------------------------------------------------------------
[INFO] Reactor Summary:
[INFO]
[INFO] Apache Hadoop MapReduce Client .................... SUCCESS [ 2.731 s]
[INFO] Apache Hadoop MapReduce Core ...................... SUCCESS [01:41 min]
[INFO] Apache Hadoop MapReduce Common .................... SUCCESS [ 29.064 s]
[INFO] Apache Hadoop MapReduce Shuffle ................... SUCCESS [ 5.992 s]
[INFO] Apache Hadoop MapReduce App ....................... SUCCESS [09:20 min]
[INFO] Apache Hadoop MapReduce HistoryServer ............. SUCCESS [05:38 min]
[INFO] Apache Hadoop MapReduce JobClient ................. FAILURE [ 01:45 h]
[INFO] Apache Hadoop MapReduce HistoryServer Plugins ..... SKIPPED
[INFO] Apache Hadoop MapReduce NativeTask ................ SKIPPED
[INFO] Apache Hadoop MapReduce Examples .................. SKIPPED
[INFO] Apache Hadoop MapReduce ........................... SKIPPED
[INFO] ------------------------------------------------------------------------
[INFO] BUILD FAILURE
[INFO] ------------------------------------------------------------------------
[INFO] Total time: 02:03 h
[INFO] Finished at: 2015-11-09T23:32:06+00:00
[INFO] Final Memory: 34M/750M
[INFO] ------------------------------------------------------------------------
[ERROR] Failed to execute goal org.apache.maven.plugins:maven-surefire-plugin:2.17:test (default-test) on project hadoop-mapreduce-client-jobclient: There are test failures.
[ERROR]
[ERROR] Please refer to /home/jenkins/jenkins-slave/workspace/Hadoop-Mapreduce-trunk/hadoop-mapreduce-project/hadoop-mapreduce-client/hadoop-mapreduce-client-jobclient/target/surefire-reports for the individual test results.
[ERROR] -> [Help 1]
[ERROR]
[ERROR] To see the full stack trace of the errors, re-run Maven with the -e switch.
[ERROR] Re-run Maven using the -X switch to enable full debug logging.
[ERROR]
[ERROR] For more information about the errors and possible solutions, please read the following articles:
[ERROR] [Help 1] http://cwiki.apache.org/confluence/display/MAVEN/MojoFailureException
[ERROR]
[ERROR] After correcting the problems, you can resume the build with the command
[ERROR] mvn <goals> -rf :hadoop-mapreduce-client-jobclient
Build step 'Execute shell' marked build as failure
[FINDBUGS] Skipping publisher since build result is FAILURE
Archiving artifacts
Recording test results
Updating YARN-3840
Email was triggered for: Failure - Any
Sending email for trigger: Failure - Any
###################################################################################
############################## FAILED TESTS (if any) ##############################
2 tests failed.
FAILED: org.apache.hadoop.mapred.TestMRTimelineEventHandling.testMRTimelineEventHandling
Error Message:
Job didn't finish in 30 seconds
Stack Trace:
java.io.IOException: Job didn't finish in 30 seconds
at org.apache.hadoop.mapred.UtilsForTests.runJobSucceed(UtilsForTests.java:622)
at org.apache.hadoop.mapred.TestMRTimelineEventHandling.testMRTimelineEventHandling(TestMRTimelineEventHandling.java:99)
FAILED: org.apache.hadoop.mapred.TestMRTimelineEventHandling.testMapreduceJobTimelineServiceEnabled
Error Message:
Job didn't finish in 30 seconds
Stack Trace:
java.io.IOException: Job didn't finish in 30 seconds
at org.apache.hadoop.mapred.UtilsForTests.runJobSucceed(UtilsForTests.java:622)
at org.apache.hadoop.mapred.TestMRTimelineEventHandling.testMapreduceJobTimelineServiceEnabled(TestMRTimelineEventHandling.java:162)
Hadoop-Mapreduce-trunk - Build # 2599 - Still Failing
Posted by Apache Jenkins Server <je...@builds.apache.org>.
See https://builds.apache.org/job/Hadoop-Mapreduce-trunk/2599/
###################################################################################
########################## LAST 60 LINES OF THE CONSOLE ###########################
[...truncated 32274 lines...]
Running org.apache.hadoop.mapreduce.v2.app.webapp.TestAMWebApp
Tests run: 12, Failures: 0, Errors: 0, Skipped: 0, Time elapsed: 22.459 sec - in org.apache.hadoop.mapreduce.v2.app.webapp.TestAMWebApp
Running org.apache.hadoop.mapreduce.v2.app.webapp.TestAMWebServicesJobConf
Tests run: 4, Failures: 0, Errors: 0, Skipped: 0, Time elapsed: 8.291 sec - in org.apache.hadoop.mapreduce.v2.app.webapp.TestAMWebServicesJobConf
Running org.apache.hadoop.mapred.TestTaskAttemptListenerImpl
Tests run: 6, Failures: 0, Errors: 0, Skipped: 0, Time elapsed: 2.071 sec - in org.apache.hadoop.mapred.TestTaskAttemptListenerImpl
Running org.apache.hadoop.mapred.TestTaskAttemptFinishingMonitor
Tests run: 1, Failures: 0, Errors: 0, Skipped: 0, Time elapsed: 2.372 sec - in org.apache.hadoop.mapred.TestTaskAttemptFinishingMonitor
Running org.apache.hadoop.mapred.TestLocalContainerLauncher
Tests run: 2, Failures: 0, Errors: 0, Skipped: 0, Time elapsed: 2.928 sec - in org.apache.hadoop.mapred.TestLocalContainerLauncher
Results :
Failed tests:
TestJobImpl.testUnusableNodeTransition:629->assertJobState:1012 expected:<SUCCEEDED> but was:<ERROR>
Tests run: 340, Failures: 1, Errors: 0, Skipped: 0
[INFO] ------------------------------------------------------------------------
[INFO] Reactor Summary:
[INFO]
[INFO] Apache Hadoop MapReduce Client .................... SUCCESS [ 3.883 s]
[INFO] Apache Hadoop MapReduce Core ...................... SUCCESS [02:25 min]
[INFO] Apache Hadoop MapReduce Common .................... SUCCESS [ 40.764 s]
[INFO] Apache Hadoop MapReduce Shuffle ................... SUCCESS [ 7.725 s]
[INFO] Apache Hadoop MapReduce App ....................... FAILURE [11:17 min]
[INFO] Apache Hadoop MapReduce HistoryServer ............. SKIPPED
[INFO] Apache Hadoop MapReduce JobClient ................. SKIPPED
[INFO] Apache Hadoop MapReduce HistoryServer Plugins ..... SKIPPED
[INFO] Apache Hadoop MapReduce NativeTask ................ SKIPPED
[INFO] Apache Hadoop MapReduce Examples .................. SKIPPED
[INFO] Apache Hadoop MapReduce ........................... SKIPPED
[INFO] ------------------------------------------------------------------------
[INFO] BUILD FAILURE
[INFO] ------------------------------------------------------------------------
[INFO] Total time: 14:36 min
[INFO] Finished at: 2015-11-11T23:23:24+00:00
[INFO] Final Memory: 55M/1219M
[INFO] ------------------------------------------------------------------------
[ERROR] Failed to execute goal org.apache.maven.plugins:maven-surefire-plugin:2.17:test (default-test) on project hadoop-mapreduce-client-app: There are test failures.
[ERROR]
[ERROR] Please refer to /home/jenkins/jenkins-slave/workspace/Hadoop-Mapreduce-trunk/hadoop-mapreduce-project/hadoop-mapreduce-client/hadoop-mapreduce-client-app/target/surefire-reports for the individual test results.
[ERROR] -> [Help 1]
[ERROR]
[ERROR] To see the full stack trace of the errors, re-run Maven with the -e switch.
[ERROR] Re-run Maven using the -X switch to enable full debug logging.
[ERROR]
[ERROR] For more information about the errors and possible solutions, please read the following articles:
[ERROR] [Help 1] http://cwiki.apache.org/confluence/display/MAVEN/MojoFailureException
[ERROR]
[ERROR] After correcting the problems, you can resume the build with the command
[ERROR] mvn <goals> -rf :hadoop-mapreduce-client-app
Build step 'Execute shell' marked build as failure
[FINDBUGS] Skipping publisher since build result is FAILURE
Archiving artifacts
Recording test results
Updating HDFS-9396
Email was triggered for: Failure - Any
Sending email for trigger: Failure - Any
###################################################################################
############################## FAILED TESTS (if any) ##############################
1 tests failed.
FAILED: org.apache.hadoop.mapreduce.v2.app.job.impl.TestJobImpl.testUnusableNodeTransition
Error Message:
expected:<SUCCEEDED> but was:<ERROR>
Stack Trace:
java.lang.AssertionError: expected:<SUCCEEDED> but was:<ERROR>
at org.junit.Assert.fail(Assert.java:88)
at org.junit.Assert.failNotEquals(Assert.java:743)
at org.junit.Assert.assertEquals(Assert.java:118)
at org.junit.Assert.assertEquals(Assert.java:144)
at org.apache.hadoop.mapreduce.v2.app.job.impl.TestJobImpl.assertJobState(TestJobImpl.java:1012)
at org.apache.hadoop.mapreduce.v2.app.job.impl.TestJobImpl.testUnusableNodeTransition(TestJobImpl.java:629)
Hadoop-Mapreduce-trunk - Build # 2598 - Still Failing
Posted by Apache Jenkins Server <je...@builds.apache.org>.
See https://builds.apache.org/job/Hadoop-Mapreduce-trunk/2598/
###################################################################################
########################## LAST 60 LINES OF THE CONSOLE ###########################
[...truncated 32270 lines...]
Running org.apache.hadoop.mapreduce.v2.app.webapp.TestAMWebApp
Tests run: 12, Failures: 0, Errors: 0, Skipped: 0, Time elapsed: 22.949 sec - in org.apache.hadoop.mapreduce.v2.app.webapp.TestAMWebApp
Running org.apache.hadoop.mapreduce.v2.app.webapp.TestAMWebServicesJobConf
Tests run: 4, Failures: 0, Errors: 0, Skipped: 0, Time elapsed: 8.275 sec - in org.apache.hadoop.mapreduce.v2.app.webapp.TestAMWebServicesJobConf
Running org.apache.hadoop.mapred.TestTaskAttemptListenerImpl
Tests run: 6, Failures: 0, Errors: 0, Skipped: 0, Time elapsed: 1.872 sec - in org.apache.hadoop.mapred.TestTaskAttemptListenerImpl
Running org.apache.hadoop.mapred.TestTaskAttemptFinishingMonitor
Tests run: 1, Failures: 0, Errors: 0, Skipped: 0, Time elapsed: 2.162 sec - in org.apache.hadoop.mapred.TestTaskAttemptFinishingMonitor
Running org.apache.hadoop.mapred.TestLocalContainerLauncher
Tests run: 2, Failures: 0, Errors: 0, Skipped: 0, Time elapsed: 2.625 sec - in org.apache.hadoop.mapred.TestLocalContainerLauncher
Results :
Failed tests:
TestJobImpl.testUnusableNodeTransition:629->assertJobState:1012 expected:<SUCCEEDED> but was:<ERROR>
Tests run: 340, Failures: 1, Errors: 0, Skipped: 0
[INFO] ------------------------------------------------------------------------
[INFO] Reactor Summary:
[INFO]
[INFO] Apache Hadoop MapReduce Client .................... SUCCESS [ 3.788 s]
[INFO] Apache Hadoop MapReduce Core ...................... SUCCESS [02:15 min]
[INFO] Apache Hadoop MapReduce Common .................... SUCCESS [ 37.474 s]
[INFO] Apache Hadoop MapReduce Shuffle ................... SUCCESS [ 7.131 s]
[INFO] Apache Hadoop MapReduce App ....................... FAILURE [11:13 min]
[INFO] Apache Hadoop MapReduce HistoryServer ............. SKIPPED
[INFO] Apache Hadoop MapReduce JobClient ................. SKIPPED
[INFO] Apache Hadoop MapReduce HistoryServer Plugins ..... SKIPPED
[INFO] Apache Hadoop MapReduce NativeTask ................ SKIPPED
[INFO] Apache Hadoop MapReduce Examples .................. SKIPPED
[INFO] Apache Hadoop MapReduce ........................... SKIPPED
[INFO] ------------------------------------------------------------------------
[INFO] BUILD FAILURE
[INFO] ------------------------------------------------------------------------
[INFO] Total time: 14:19 min
[INFO] Finished at: 2015-11-11T20:36:31+00:00
[INFO] Final Memory: 44M/1215M
[INFO] ------------------------------------------------------------------------
[ERROR] Failed to execute goal org.apache.maven.plugins:maven-surefire-plugin:2.17:test (default-test) on project hadoop-mapreduce-client-app: There are test failures.
[ERROR]
[ERROR] Please refer to /home/jenkins/jenkins-slave/workspace/Hadoop-Mapreduce-trunk/hadoop-mapreduce-project/hadoop-mapreduce-client/hadoop-mapreduce-client-app/target/surefire-reports for the individual test results.
[ERROR] -> [Help 1]
[ERROR]
[ERROR] To see the full stack trace of the errors, re-run Maven with the -e switch.
[ERROR] Re-run Maven using the -X switch to enable full debug logging.
[ERROR]
[ERROR] For more information about the errors and possible solutions, please read the following articles:
[ERROR] [Help 1] http://cwiki.apache.org/confluence/display/MAVEN/MojoFailureException
[ERROR]
[ERROR] After correcting the problems, you can resume the build with the command
[ERROR] mvn <goals> -rf :hadoop-mapreduce-client-app
Build step 'Execute shell' marked build as failure
[FINDBUGS] Skipping publisher since build result is FAILURE
Archiving artifacts
Recording test results
Updating YARN-4183
Email was triggered for: Failure - Any
Sending email for trigger: Failure - Any
###################################################################################
############################## FAILED TESTS (if any) ##############################
1 tests failed.
FAILED: org.apache.hadoop.mapreduce.v2.app.job.impl.TestJobImpl.testUnusableNodeTransition
Error Message:
expected:<SUCCEEDED> but was:<ERROR>
Stack Trace:
java.lang.AssertionError: expected:<SUCCEEDED> but was:<ERROR>
at org.junit.Assert.fail(Assert.java:88)
at org.junit.Assert.failNotEquals(Assert.java:743)
at org.junit.Assert.assertEquals(Assert.java:118)
at org.junit.Assert.assertEquals(Assert.java:144)
at org.apache.hadoop.mapreduce.v2.app.job.impl.TestJobImpl.assertJobState(TestJobImpl.java:1012)
at org.apache.hadoop.mapreduce.v2.app.job.impl.TestJobImpl.testUnusableNodeTransition(TestJobImpl.java:629)
Hadoop-Mapreduce-trunk - Build # 2597 - Still Failing
Posted by Apache Jenkins Server <je...@builds.apache.org>.
See https://builds.apache.org/job/Hadoop-Mapreduce-trunk/2597/
###################################################################################
########################## LAST 60 LINES OF THE CONSOLE ###########################
[...truncated 32366 lines...]
Running org.apache.hadoop.mapreduce.v2.hs.webapp.TestBlocks
Tests run: 5, Failures: 0, Errors: 0, Skipped: 0, Time elapsed: 1.518 sec - in org.apache.hadoop.mapreduce.v2.hs.webapp.TestBlocks
Running org.apache.hadoop.mapreduce.v2.hs.webapp.dao.TestJobInfo
Tests run: 2, Failures: 0, Errors: 0, Skipped: 0, Time elapsed: 2.286 sec - in org.apache.hadoop.mapreduce.v2.hs.webapp.dao.TestJobInfo
Running org.apache.hadoop.mapreduce.v2.hs.webapp.TestHsWebServicesAttempts
Tests run: 15, Failures: 0, Errors: 0, Skipped: 0, Time elapsed: 8.599 sec - in org.apache.hadoop.mapreduce.v2.hs.webapp.TestHsWebServicesAttempts
Running org.apache.hadoop.mapreduce.v2.hs.webapp.TestHsWebServices
Tests run: 11, Failures: 0, Errors: 0, Skipped: 0, Time elapsed: 7.074 sec - in org.apache.hadoop.mapreduce.v2.hs.webapp.TestHsWebServices
Running org.apache.hadoop.mapreduce.v2.hs.TestJobListCache
Tests run: 2, Failures: 0, Errors: 0, Skipped: 0, Time elapsed: 0.717 sec - in org.apache.hadoop.mapreduce.v2.hs.TestJobListCache
Results :
Failed tests:
TestJobHistoryServer.testLaunch:209 expected:<0> but was:<-1>
Tests run: 198, Failures: 1, Errors: 0, Skipped: 0
[INFO] ------------------------------------------------------------------------
[INFO] Reactor Summary:
[INFO]
[INFO] Apache Hadoop MapReduce Client .................... SUCCESS [ 2.977 s]
[INFO] Apache Hadoop MapReduce Core ...................... SUCCESS [01:42 min]
[INFO] Apache Hadoop MapReduce Common .................... SUCCESS [ 29.048 s]
[INFO] Apache Hadoop MapReduce Shuffle ................... SUCCESS [ 4.881 s]
[INFO] Apache Hadoop MapReduce App ....................... SUCCESS [09:17 min]
[INFO] Apache Hadoop MapReduce HistoryServer ............. FAILURE [05:35 min]
[INFO] Apache Hadoop MapReduce JobClient ................. SKIPPED
[INFO] Apache Hadoop MapReduce HistoryServer Plugins ..... SKIPPED
[INFO] Apache Hadoop MapReduce NativeTask ................ SKIPPED
[INFO] Apache Hadoop MapReduce Examples .................. SKIPPED
[INFO] Apache Hadoop MapReduce ........................... SKIPPED
[INFO] ------------------------------------------------------------------------
[INFO] BUILD FAILURE
[INFO] ------------------------------------------------------------------------
[INFO] Total time: 17:12 min
[INFO] Finished at: 2015-11-11T18:16:05+00:00
[INFO] Final Memory: 44M/694M
[INFO] ------------------------------------------------------------------------
[ERROR] Failed to execute goal org.apache.maven.plugins:maven-surefire-plugin:2.17:test (default-test) on project hadoop-mapreduce-client-hs: There are test failures.
[ERROR]
[ERROR] Please refer to /home/jenkins/jenkins-slave/workspace/Hadoop-Mapreduce-trunk/hadoop-mapreduce-project/hadoop-mapreduce-client/hadoop-mapreduce-client-hs/target/surefire-reports for the individual test results.
[ERROR] -> [Help 1]
[ERROR]
[ERROR] To see the full stack trace of the errors, re-run Maven with the -e switch.
[ERROR] Re-run Maven using the -X switch to enable full debug logging.
[ERROR]
[ERROR] For more information about the errors and possible solutions, please read the following articles:
[ERROR] [Help 1] http://cwiki.apache.org/confluence/display/MAVEN/MojoFailureException
[ERROR]
[ERROR] After correcting the problems, you can resume the build with the command
[ERROR] mvn <goals> -rf :hadoop-mapreduce-client-hs
Build step 'Execute shell' marked build as failure
[FINDBUGS] Skipping publisher since build result is FAILURE
Archiving artifacts
Recording test results
Updating MAPREDUCE-6533
Email was triggered for: Failure - Any
Sending email for trigger: Failure - Any
###################################################################################
############################## FAILED TESTS (if any) ##############################
1 tests failed.
FAILED: org.apache.hadoop.mapreduce.v2.hs.TestJobHistoryServer.testLaunch
Error Message:
expected:<0> but was:<-1>
Stack Trace:
java.lang.AssertionError: expected:<0> but was:<-1>
at org.junit.Assert.fail(Assert.java:88)
at org.junit.Assert.failNotEquals(Assert.java:743)
at org.junit.Assert.assertEquals(Assert.java:118)
at org.junit.Assert.assertEquals(Assert.java:555)
at org.junit.Assert.assertEquals(Assert.java:542)
at org.apache.hadoop.mapreduce.v2.hs.TestJobHistoryServer.testLaunch(TestJobHistoryServer.java:209)
Hadoop-Mapreduce-trunk - Build # 2596 - Still Failing
Posted by Apache Jenkins Server <je...@builds.apache.org>.
See https://builds.apache.org/job/Hadoop-Mapreduce-trunk/2596/
###################################################################################
########################## LAST 60 LINES OF THE CONSOLE ###########################
[...truncated 32267 lines...]
Running org.apache.hadoop.mapreduce.v2.app.webapp.TestAMWebApp
Tests run: 12, Failures: 0, Errors: 0, Skipped: 0, Time elapsed: 25.542 sec - in org.apache.hadoop.mapreduce.v2.app.webapp.TestAMWebApp
Running org.apache.hadoop.mapreduce.v2.app.webapp.TestAMWebServicesJobConf
Tests run: 4, Failures: 0, Errors: 0, Skipped: 0, Time elapsed: 9.421 sec - in org.apache.hadoop.mapreduce.v2.app.webapp.TestAMWebServicesJobConf
Running org.apache.hadoop.mapred.TestTaskAttemptListenerImpl
Tests run: 6, Failures: 0, Errors: 0, Skipped: 0, Time elapsed: 2.037 sec - in org.apache.hadoop.mapred.TestTaskAttemptListenerImpl
Running org.apache.hadoop.mapred.TestTaskAttemptFinishingMonitor
Tests run: 1, Failures: 0, Errors: 0, Skipped: 0, Time elapsed: 2.547 sec - in org.apache.hadoop.mapred.TestTaskAttemptFinishingMonitor
Running org.apache.hadoop.mapred.TestLocalContainerLauncher
Tests run: 2, Failures: 0, Errors: 0, Skipped: 0, Time elapsed: 3.514 sec - in org.apache.hadoop.mapred.TestLocalContainerLauncher
Results :
Failed tests:
TestMRApp.testUpdatedNodes:262 Expecting 2 more completion events for killed expected:<4> but was:<2>
Tests run: 340, Failures: 1, Errors: 0, Skipped: 0
[INFO] ------------------------------------------------------------------------
[INFO] Reactor Summary:
[INFO]
[INFO] Apache Hadoop MapReduce Client .................... SUCCESS [ 4.567 s]
[INFO] Apache Hadoop MapReduce Core ...................... SUCCESS [02:34 min]
[INFO] Apache Hadoop MapReduce Common .................... SUCCESS [ 42.357 s]
[INFO] Apache Hadoop MapReduce Shuffle ................... SUCCESS [ 8.785 s]
[INFO] Apache Hadoop MapReduce App ....................... FAILURE [12:11 min]
[INFO] Apache Hadoop MapReduce HistoryServer ............. SKIPPED
[INFO] Apache Hadoop MapReduce JobClient ................. SKIPPED
[INFO] Apache Hadoop MapReduce HistoryServer Plugins ..... SKIPPED
[INFO] Apache Hadoop MapReduce NativeTask ................ SKIPPED
[INFO] Apache Hadoop MapReduce Examples .................. SKIPPED
[INFO] Apache Hadoop MapReduce ........................... SKIPPED
[INFO] ------------------------------------------------------------------------
[INFO] BUILD FAILURE
[INFO] ------------------------------------------------------------------------
[INFO] Total time: 15:44 min
[INFO] Finished at: 2015-11-11T15:25:16+00:00
[INFO] Final Memory: 42M/1268M
[INFO] ------------------------------------------------------------------------
[ERROR] Failed to execute goal org.apache.maven.plugins:maven-surefire-plugin:2.17:test (default-test) on project hadoop-mapreduce-client-app: There are test failures.
[ERROR]
[ERROR] Please refer to /home/jenkins/jenkins-slave/workspace/Hadoop-Mapreduce-trunk/hadoop-mapreduce-project/hadoop-mapreduce-client/hadoop-mapreduce-client-app/target/surefire-reports for the individual test results.
[ERROR] -> [Help 1]
[ERROR]
[ERROR] To see the full stack trace of the errors, re-run Maven with the -e switch.
[ERROR] Re-run Maven using the -X switch to enable full debug logging.
[ERROR]
[ERROR] For more information about the errors and possible solutions, please read the following articles:
[ERROR] [Help 1] http://cwiki.apache.org/confluence/display/MAVEN/MojoFailureException
[ERROR]
[ERROR] After correcting the problems, you can resume the build with the command
[ERROR] mvn <goals> -rf :hadoop-mapreduce-client-app
Build step 'Execute shell' marked build as failure
[FINDBUGS] Skipping publisher since build result is FAILURE
Archiving artifacts
Recording test results
Updating HADOOP-12526
Email was triggered for: Failure - Any
Sending email for trigger: Failure - Any
###################################################################################
############################## FAILED TESTS (if any) ##############################
1 tests failed.
FAILED: org.apache.hadoop.mapreduce.v2.app.TestMRApp.testUpdatedNodes
Error Message:
Expecting 2 more completion events for killed expected:<4> but was:<2>
Stack Trace:
java.lang.AssertionError: Expecting 2 more completion events for killed expected:<4> but was:<2>
at org.junit.Assert.fail(Assert.java:88)
at org.junit.Assert.failNotEquals(Assert.java:743)
at org.junit.Assert.assertEquals(Assert.java:118)
at org.junit.Assert.assertEquals(Assert.java:555)
at org.apache.hadoop.mapreduce.v2.app.TestMRApp.testUpdatedNodes(TestMRApp.java:262)
Hadoop-Mapreduce-trunk - Build # 2595 - Still Failing
Posted by Apache Jenkins Server <je...@builds.apache.org>.
See https://builds.apache.org/job/Hadoop-Mapreduce-trunk/2595/
###################################################################################
########################## LAST 60 LINES OF THE CONSOLE ###########################
[...truncated 32267 lines...]
Running org.apache.hadoop.mapreduce.v2.app.webapp.TestAMWebApp
Tests run: 12, Failures: 0, Errors: 0, Skipped: 0, Time elapsed: 22.155 sec - in org.apache.hadoop.mapreduce.v2.app.webapp.TestAMWebApp
Running org.apache.hadoop.mapreduce.v2.app.webapp.TestAMWebServicesJobConf
Tests run: 4, Failures: 0, Errors: 0, Skipped: 0, Time elapsed: 8.397 sec - in org.apache.hadoop.mapreduce.v2.app.webapp.TestAMWebServicesJobConf
Running org.apache.hadoop.mapred.TestTaskAttemptListenerImpl
Tests run: 6, Failures: 0, Errors: 0, Skipped: 0, Time elapsed: 1.944 sec - in org.apache.hadoop.mapred.TestTaskAttemptListenerImpl
Running org.apache.hadoop.mapred.TestTaskAttemptFinishingMonitor
Tests run: 1, Failures: 0, Errors: 0, Skipped: 0, Time elapsed: 2.117 sec - in org.apache.hadoop.mapred.TestTaskAttemptFinishingMonitor
Running org.apache.hadoop.mapred.TestLocalContainerLauncher
Tests run: 2, Failures: 0, Errors: 0, Skipped: 0, Time elapsed: 2.515 sec - in org.apache.hadoop.mapred.TestLocalContainerLauncher
Results :
Failed tests:
TestTaskAttempt.testMRAppHistoryForTAFailedInAssigned:177->testTaskAttemptAssignedKilledHistory:388 No Ta Started JH Event
Tests run: 340, Failures: 1, Errors: 0, Skipped: 0
[INFO] ------------------------------------------------------------------------
[INFO] Reactor Summary:
[INFO]
[INFO] Apache Hadoop MapReduce Client .................... SUCCESS [ 5.085 s]
[INFO] Apache Hadoop MapReduce Core ...................... SUCCESS [02:25 min]
[INFO] Apache Hadoop MapReduce Common .................... SUCCESS [ 38.974 s]
[INFO] Apache Hadoop MapReduce Shuffle ................... SUCCESS [ 7.497 s]
[INFO] Apache Hadoop MapReduce App ....................... FAILURE [11:02 min]
[INFO] Apache Hadoop MapReduce HistoryServer ............. SKIPPED
[INFO] Apache Hadoop MapReduce JobClient ................. SKIPPED
[INFO] Apache Hadoop MapReduce HistoryServer Plugins ..... SKIPPED
[INFO] Apache Hadoop MapReduce NativeTask ................ SKIPPED
[INFO] Apache Hadoop MapReduce Examples .................. SKIPPED
[INFO] Apache Hadoop MapReduce ........................... SKIPPED
[INFO] ------------------------------------------------------------------------
[INFO] BUILD FAILURE
[INFO] ------------------------------------------------------------------------
[INFO] Total time: 14:21 min
[INFO] Finished at: 2015-11-11T08:26:16+00:00
[INFO] Final Memory: 49M/1219M
[INFO] ------------------------------------------------------------------------
[ERROR] Failed to execute goal org.apache.maven.plugins:maven-surefire-plugin:2.17:test (default-test) on project hadoop-mapreduce-client-app: There are test failures.
[ERROR]
[ERROR] Please refer to /home/jenkins/jenkins-slave/workspace/Hadoop-Mapreduce-trunk/hadoop-mapreduce-project/hadoop-mapreduce-client/hadoop-mapreduce-client-app/target/surefire-reports for the individual test results.
[ERROR] -> [Help 1]
[ERROR]
[ERROR] To see the full stack trace of the errors, re-run Maven with the -e switch.
[ERROR] Re-run Maven using the -X switch to enable full debug logging.
[ERROR]
[ERROR] For more information about the errors and possible solutions, please read the following articles:
[ERROR] [Help 1] http://cwiki.apache.org/confluence/display/MAVEN/MojoFailureException
[ERROR]
[ERROR] After correcting the problems, you can resume the build with the command
[ERROR] mvn <goals> -rf :hadoop-mapreduce-client-app
Build step 'Execute shell' marked build as failure
[FINDBUGS] Skipping publisher since build result is FAILURE
Archiving artifacts
Recording test results
Updating YARN-4241
Email was triggered for: Failure - Any
Sending email for trigger: Failure - Any
###################################################################################
############################## FAILED TESTS (if any) ##############################
1 tests failed.
FAILED: org.apache.hadoop.mapreduce.v2.app.job.impl.TestTaskAttempt.testMRAppHistoryForTAFailedInAssigned
Error Message:
No Ta Started JH Event
Stack Trace:
java.lang.AssertionError: No Ta Started JH Event
at org.junit.Assert.fail(Assert.java:88)
at org.junit.Assert.assertTrue(Assert.java:41)
at org.apache.hadoop.mapreduce.v2.app.job.impl.TestTaskAttempt.testTaskAttemptAssignedKilledHistory(TestTaskAttempt.java:388)
at org.apache.hadoop.mapreduce.v2.app.job.impl.TestTaskAttempt.testMRAppHistoryForTAFailedInAssigned(TestTaskAttempt.java:177)
Hadoop-Mapreduce-trunk - Build # 2594 - Still Failing
Posted by Apache Jenkins Server <je...@builds.apache.org>.
See https://builds.apache.org/job/Hadoop-Mapreduce-trunk/2594/
###################################################################################
########################## LAST 60 LINES OF THE CONSOLE ###########################
[...truncated 32787 lines...]
Running org.apache.hadoop.mapred.pipes.TestPipeApplication
Tests run: 5, Failures: 0, Errors: 0, Skipped: 0, Time elapsed: 6.167 sec - in org.apache.hadoop.mapred.pipes.TestPipeApplication
Running org.apache.hadoop.mapred.TestJavaSerialization
Tests run: 2, Failures: 0, Errors: 0, Skipped: 0, Time elapsed: 4.758 sec - in org.apache.hadoop.mapred.TestJavaSerialization
Running org.apache.hadoop.mapred.TestSpecialCharactersInOutputPath
Tests run: 1, Failures: 0, Errors: 0, Skipped: 0, Time elapsed: 29.563 sec - in org.apache.hadoop.mapred.TestSpecialCharactersInOutputPath
Running org.apache.hadoop.ipc.TestMRCJCSocketFactory
Tests run: 1, Failures: 0, Errors: 0, Skipped: 0, Time elapsed: 23.082 sec - in org.apache.hadoop.ipc.TestMRCJCSocketFactory
Results :
Tests in error:
TestMRTimelineEventHandling.testMRTimelineEventHandling:99 » IO Job didn't fin...
TestMRTimelineEventHandling.testMapreduceJobTimelineServiceEnabled:162 » IO Jo...
Tests run: 523, Failures: 0, Errors: 2, Skipped: 11
[INFO] ------------------------------------------------------------------------
[INFO] Reactor Summary:
[INFO]
[INFO] Apache Hadoop MapReduce Client .................... SUCCESS [ 3.577 s]
[INFO] Apache Hadoop MapReduce Core ...................... SUCCESS [02:00 min]
[INFO] Apache Hadoop MapReduce Common .................... SUCCESS [ 36.639 s]
[INFO] Apache Hadoop MapReduce Shuffle ................... SUCCESS [ 5.935 s]
[INFO] Apache Hadoop MapReduce App ....................... SUCCESS [10:12 min]
[INFO] Apache Hadoop MapReduce HistoryServer ............. SUCCESS [06:07 min]
[INFO] Apache Hadoop MapReduce JobClient ................. FAILURE [ 01:47 h]
[INFO] Apache Hadoop MapReduce HistoryServer Plugins ..... SKIPPED
[INFO] Apache Hadoop MapReduce NativeTask ................ SKIPPED
[INFO] Apache Hadoop MapReduce Examples .................. SKIPPED
[INFO] Apache Hadoop MapReduce ........................... SKIPPED
[INFO] ------------------------------------------------------------------------
[INFO] BUILD FAILURE
[INFO] ------------------------------------------------------------------------
[INFO] Total time: 02:07 h
[INFO] Finished at: 2015-11-11T03:57:45+00:00
[INFO] Final Memory: 42M/982M
[INFO] ------------------------------------------------------------------------
[ERROR] Failed to execute goal org.apache.maven.plugins:maven-surefire-plugin:2.17:test (default-test) on project hadoop-mapreduce-client-jobclient: There are test failures.
[ERROR]
[ERROR] Please refer to /home/jenkins/jenkins-slave/workspace/Hadoop-Mapreduce-trunk/hadoop-mapreduce-project/hadoop-mapreduce-client/hadoop-mapreduce-client-jobclient/target/surefire-reports for the individual test results.
[ERROR] -> [Help 1]
[ERROR]
[ERROR] To see the full stack trace of the errors, re-run Maven with the -e switch.
[ERROR] Re-run Maven using the -X switch to enable full debug logging.
[ERROR]
[ERROR] For more information about the errors and possible solutions, please read the following articles:
[ERROR] [Help 1] http://cwiki.apache.org/confluence/display/MAVEN/MojoFailureException
[ERROR]
[ERROR] After correcting the problems, you can resume the build with the command
[ERROR] mvn <goals> -rf :hadoop-mapreduce-client-jobclient
Build step 'Execute shell' marked build as failure
[FINDBUGS] Skipping publisher since build result is FAILURE
Archiving artifacts
Recording test results
Updating HDFS-9369
Updating HDFS-9245
Email was triggered for: Failure - Any
Sending email for trigger: Failure - Any
###################################################################################
############################## FAILED TESTS (if any) ##############################
2 tests failed.
FAILED: org.apache.hadoop.mapred.TestMRTimelineEventHandling.testMRTimelineEventHandling
Error Message:
Job didn't finish in 30 seconds
Stack Trace:
java.io.IOException: Job didn't finish in 30 seconds
at org.apache.hadoop.mapred.UtilsForTests.runJobSucceed(UtilsForTests.java:622)
at org.apache.hadoop.mapred.TestMRTimelineEventHandling.testMRTimelineEventHandling(TestMRTimelineEventHandling.java:99)
FAILED: org.apache.hadoop.mapred.TestMRTimelineEventHandling.testMapreduceJobTimelineServiceEnabled
Error Message:
Job didn't finish in 30 seconds
Stack Trace:
java.io.IOException: Job didn't finish in 30 seconds
at org.apache.hadoop.mapred.UtilsForTests.runJobSucceed(UtilsForTests.java:622)
at org.apache.hadoop.mapred.TestMRTimelineEventHandling.testMapreduceJobTimelineServiceEnabled(TestMRTimelineEventHandling.java:162)
Hadoop-Mapreduce-trunk - Build # 2593 - Still Failing
Posted by Apache Jenkins Server <je...@builds.apache.org>.
See https://builds.apache.org/job/Hadoop-Mapreduce-trunk/2593/
###################################################################################
########################## LAST 60 LINES OF THE CONSOLE ###########################
[...truncated 32971 lines...]
Tests run: 1, Failures: 0, Errors: 0, Skipped: 1, Time elapsed: 0.048 sec - in org.apache.hadoop.mapred.TestMiniMRDFSCaching
Running org.apache.hadoop.io.TestSequenceFileMergeProgress
Tests run: 3, Failures: 0, Errors: 0, Skipped: 0, Time elapsed: 2.351 sec - in org.apache.hadoop.io.TestSequenceFileMergeProgress
Running org.apache.hadoop.conf.TestNoDefaultsJobConf
Tests run: 1, Failures: 0, Errors: 0, Skipped: 0, Time elapsed: 22.528 sec - in org.apache.hadoop.conf.TestNoDefaultsJobConf
Results :
Tests in error:
TestMiniMRProxyUser.setUp:69 » NoClassDefFound org/apache/hadoop/util/Platform...
TestDFSIO.beforeClass:216->testWrite:231->writeTest:437->runIOTest:455 » Remote
TestDFSIO.afterClass:224->cleanup:958 » Remote org/apache/hadoop/hdfs/server/n...
TestMiniMRClientCluster.setup:80 » NoClassDefFound org/apache/hadoop/yarn/serv...
TestMiniMRClientCluster.cleanup:93 NullPointer
TestMRTimelineEventHandling.testMRTimelineEventHandling:99 » IO Job didn't fin...
TestMRTimelineEventHandling.testMapreduceJobTimelineServiceEnabled:162 » IO Jo...
Tests run: 518, Failures: 0, Errors: 7, Skipped: 11
[INFO] ------------------------------------------------------------------------
[INFO] Reactor Summary:
[INFO]
[INFO] Apache Hadoop MapReduce Client .................... SUCCESS [ 2.844 s]
[INFO] Apache Hadoop MapReduce Core ...................... SUCCESS [01:41 min]
[INFO] Apache Hadoop MapReduce Common .................... SUCCESS [ 29.886 s]
[INFO] Apache Hadoop MapReduce Shuffle ................... SUCCESS [ 4.836 s]
[INFO] Apache Hadoop MapReduce App ....................... SUCCESS [09:16 min]
[INFO] Apache Hadoop MapReduce HistoryServer ............. SUCCESS [05:36 min]
[INFO] Apache Hadoop MapReduce JobClient ................. FAILURE [ 01:41 h]
[INFO] Apache Hadoop MapReduce HistoryServer Plugins ..... SKIPPED
[INFO] Apache Hadoop MapReduce NativeTask ................ SKIPPED
[INFO] Apache Hadoop MapReduce Examples .................. SKIPPED
[INFO] Apache Hadoop MapReduce ........................... SKIPPED
[INFO] ------------------------------------------------------------------------
[INFO] BUILD FAILURE
[INFO] ------------------------------------------------------------------------
[INFO] Total time: 01:58 h
[INFO] Finished at: 2015-11-11T00:56:43+00:00
[INFO] Final Memory: 34M/750M
[INFO] ------------------------------------------------------------------------
[ERROR] Failed to execute goal org.apache.maven.plugins:maven-surefire-plugin:2.17:test (default-test) on project hadoop-mapreduce-client-jobclient: ExecutionException: java.lang.RuntimeException: The forked VM terminated without properly saying goodbye. VM crash or System.exit called?
[ERROR] Command was /bin/sh -c cd /home/jenkins/jenkins-slave/workspace/Hadoop-Mapreduce-trunk/hadoop-mapreduce-project/hadoop-mapreduce-client/hadoop-mapreduce-client-jobclient && /home/jenkins/tools/java/jdk1.7.0_55/jre/bin/java -Xmx2048m -XX:MaxPermSize=768m -XX:+HeapDumpOnOutOfMemoryError -jar /home/jenkins/jenkins-slave/workspace/Hadoop-Mapreduce-trunk/hadoop-mapreduce-project/hadoop-mapreduce-client/hadoop-mapreduce-client-jobclient/target/surefire/surefirebooter9188880219802001889.jar /home/jenkins/jenkins-slave/workspace/Hadoop-Mapreduce-trunk/hadoop-mapreduce-project/hadoop-mapreduce-client/hadoop-mapreduce-client-jobclient/target/surefire/surefire6355861283205753099tmp /home/jenkins/jenkins-slave/workspace/Hadoop-Mapreduce-trunk/hadoop-mapreduce-project/hadoop-mapreduce-client/hadoop-mapreduce-client-jobclient/target/surefire/surefire_2164786755136208054768tmp
[ERROR] -> [Help 1]
[ERROR]
[ERROR] To see the full stack trace of the errors, re-run Maven with the -e switch.
[ERROR] Re-run Maven using the -X switch to enable full debug logging.
[ERROR]
[ERROR] For more information about the errors and possible solutions, please read the following articles:
[ERROR] [Help 1] http://cwiki.apache.org/confluence/display/MAVEN/MojoFailureException
[ERROR]
[ERROR] After correcting the problems, you can resume the build with the command
[ERROR] mvn <goals> -rf :hadoop-mapreduce-client-jobclient
Build step 'Execute shell' marked build as failure
[FINDBUGS] Skipping publisher since build result is FAILURE
Archiving artifacts
Recording test results
Updating YARN-1510
Email was triggered for: Failure - Any
Sending email for trigger: Failure - Any
###################################################################################
############################## FAILED TESTS (if any) ##############################
7 tests failed.
FAILED: org.apache.hadoop.fs.TestDFSIO.org.apache.hadoop.fs.TestDFSIO
Error Message:
org/apache/hadoop/hdfs/server/namenode/CachedBlock
at org.apache.hadoop.hdfs.server.namenode.CacheManager.setCachedLocations(CacheManager.java:899)
at org.apache.hadoop.hdfs.server.namenode.FSDirStatAndListingOp.createLocatedFileStatus(FSDirStatAndListingOp.java:565)
at org.apache.hadoop.hdfs.server.namenode.FSDirStatAndListingOp.createFileStatus(FSDirStatAndListingOp.java:430)
at org.apache.hadoop.hdfs.server.namenode.FSDirStatAndListingOp.getListing(FSDirStatAndListingOp.java:278)
at org.apache.hadoop.hdfs.server.namenode.FSDirStatAndListingOp.getListingInt(FSDirStatAndListingOp.java:86)
at org.apache.hadoop.hdfs.server.namenode.FSNamesystem.getListing(FSNamesystem.java:3547)
at org.apache.hadoop.hdfs.server.namenode.NameNodeRpcServer.getListing(NameNodeRpcServer.java:1062)
at org.apache.hadoop.hdfs.protocolPB.ClientNamenodeProtocolServerSideTranslatorPB.getListing(ClientNamenodeProtocolServerSideTranslatorPB.java:642)
at org.apache.hadoop.hdfs.protocol.proto.ClientNamenodeProtocolProtos$ClientNamenodeProtocol$2.callBlockingMethod(ClientNamenodeProtocolProtos.java)
at org.apache.hadoop.ipc.ProtobufRpcEngine$Server$ProtoBufRpcInvoker.call(ProtobufRpcEngine.java:637)
at org.apache.hadoop.ipc.RPC$Server.call(RPC.java:976)
at org.apache.hadoop.ipc.Server$Handler$1.run(Server.java:2305)
at org.apache.hadoop.ipc.Server$Handler$1.run(Server.java:2301)
at java.security.AccessController.doPrivileged(Native Method)
at javax.security.auth.Subject.doAs(Subject.java:415)
at org.apache.hadoop.security.UserGroupInformation.doAs(UserGroupInformation.java:1669)
at org.apache.hadoop.ipc.Server$Handler.run(Server.java:2301)
Caused by: java.lang.ClassNotFoundException: org.apache.hadoop.hdfs.server.namenode.CachedBlock
at java.net.URLClassLoader$1.run(URLClassLoader.java:366)
at java.net.URLClassLoader$1.run(URLClassLoader.java:355)
at java.security.AccessController.doPrivileged(Native Method)
at java.net.URLClassLoader.findClass(URLClassLoader.java:354)
at java.lang.ClassLoader.loadClass(ClassLoader.java:425)
at sun.misc.Launcher$AppClassLoader.loadClass(Launcher.java:308)
at java.lang.ClassLoader.loadClass(ClassLoader.java:358)
... 17 more
Stack Trace:
org.apache.hadoop.ipc.RemoteException: org/apache/hadoop/hdfs/server/namenode/CachedBlock
at org.apache.hadoop.hdfs.server.namenode.CacheManager.setCachedLocations(CacheManager.java:899)
at org.apache.hadoop.hdfs.server.namenode.FSDirStatAndListingOp.createLocatedFileStatus(FSDirStatAndListingOp.java:565)
at org.apache.hadoop.hdfs.server.namenode.FSDirStatAndListingOp.createFileStatus(FSDirStatAndListingOp.java:430)
at org.apache.hadoop.hdfs.server.namenode.FSDirStatAndListingOp.getListing(FSDirStatAndListingOp.java:278)
at org.apache.hadoop.hdfs.server.namenode.FSDirStatAndListingOp.getListingInt(FSDirStatAndListingOp.java:86)
at org.apache.hadoop.hdfs.server.namenode.FSNamesystem.getListing(FSNamesystem.java:3547)
at org.apache.hadoop.hdfs.server.namenode.NameNodeRpcServer.getListing(NameNodeRpcServer.java:1062)
at org.apache.hadoop.hdfs.protocolPB.ClientNamenodeProtocolServerSideTranslatorPB.getListing(ClientNamenodeProtocolServerSideTranslatorPB.java:642)
at org.apache.hadoop.hdfs.protocol.proto.ClientNamenodeProtocolProtos$ClientNamenodeProtocol$2.callBlockingMethod(ClientNamenodeProtocolProtos.java)
at org.apache.hadoop.ipc.ProtobufRpcEngine$Server$ProtoBufRpcInvoker.call(ProtobufRpcEngine.java:637)
at org.apache.hadoop.ipc.RPC$Server.call(RPC.java:976)
at org.apache.hadoop.ipc.Server$Handler$1.run(Server.java:2305)
at org.apache.hadoop.ipc.Server$Handler$1.run(Server.java:2301)
at java.security.AccessController.doPrivileged(Native Method)
at javax.security.auth.Subject.doAs(Subject.java:415)
at org.apache.hadoop.security.UserGroupInformation.doAs(UserGroupInformation.java:1669)
at org.apache.hadoop.ipc.Server$Handler.run(Server.java:2301)
Caused by: java.lang.ClassNotFoundException: org.apache.hadoop.hdfs.server.namenode.CachedBlock
at java.net.URLClassLoader$1.run(URLClassLoader.java:366)
at java.net.URLClassLoader$1.run(URLClassLoader.java:355)
at java.security.AccessController.doPrivileged(Native Method)
at java.net.URLClassLoader.findClass(URLClassLoader.java:354)
at java.lang.ClassLoader.loadClass(ClassLoader.java:425)
at sun.misc.Launcher$AppClassLoader.loadClass(Launcher.java:308)
at java.lang.ClassLoader.loadClass(ClassLoader.java:358)
... 17 more
at org.apache.hadoop.ipc.Client.call(Client.java:1448)
at org.apache.hadoop.ipc.Client.call(Client.java:1385)
at org.apache.hadoop.ipc.ProtobufRpcEngine$Invoker.invoke(ProtobufRpcEngine.java:230)
at com.sun.proxy.$Proxy21.getListing(Unknown Source)
at org.apache.hadoop.hdfs.protocolPB.ClientNamenodeProtocolTranslatorPB.getListing(ClientNamenodeProtocolTranslatorPB.java:547)
at sun.reflect.NativeMethodAccessorImpl.invoke0(Native Method)
at sun.reflect.NativeMethodAccessorImpl.invoke(NativeMethodAccessorImpl.java:57)
at sun.reflect.DelegatingMethodAccessorImpl.invoke(DelegatingMethodAccessorImpl.java:43)
at java.lang.reflect.Method.invoke(Method.java:606)
at org.apache.hadoop.io.retry.RetryInvocationHandler.invokeMethod(RetryInvocationHandler.java:255)
at org.apache.hadoop.io.retry.RetryInvocationHandler.invoke(RetryInvocationHandler.java:103)
at com.sun.proxy.$Proxy24.getListing(Unknown Source)
at org.apache.hadoop.hdfs.DFSClient.listPaths(DFSClient.java:1575)
at org.apache.hadoop.hdfs.DistributedFileSystem$DirListingIterator.<init>(DistributedFileSystem.java:932)
at org.apache.hadoop.hdfs.DistributedFileSystem$DirListingIterator.<init>(DistributedFileSystem.java:915)
at org.apache.hadoop.hdfs.DistributedFileSystem$20.doCall(DistributedFileSystem.java:860)
at org.apache.hadoop.hdfs.DistributedFileSystem$20.doCall(DistributedFileSystem.java:856)
at org.apache.hadoop.fs.FileSystemLinkResolver.resolve(FileSystemLinkResolver.java:81)
at org.apache.hadoop.hdfs.DistributedFileSystem.listLocatedStatus(DistributedFileSystem.java:874)
at org.apache.hadoop.fs.FileSystem.listLocatedStatus(FileSystem.java:1702)
at org.apache.hadoop.mapred.FileInputFormat.singleThreadedListStatus(FileInputFormat.java:274)
at org.apache.hadoop.mapred.FileInputFormat.listStatus(FileInputFormat.java:236)
at org.apache.hadoop.mapred.SequenceFileInputFormat.listStatus(SequenceFileInputFormat.java:45)
at org.apache.hadoop.mapred.FileInputFormat.getSplits(FileInputFormat.java:322)
at org.apache.hadoop.mapreduce.JobSubmitter.writeOldSplits(JobSubmitter.java:329)
at org.apache.hadoop.mapreduce.JobSubmitter.writeSplits(JobSubmitter.java:321)
at org.apache.hadoop.mapreduce.JobSubmitter.submitJobInternal(JobSubmitter.java:196)
at org.apache.hadoop.mapreduce.Job$10.run(Job.java:1290)
at org.apache.hadoop.mapreduce.Job$10.run(Job.java:1287)
at java.security.AccessController.doPrivileged(Native Method)
at javax.security.auth.Subject.doAs(Subject.java:415)
at org.apache.hadoop.security.UserGroupInformation.doAs(UserGroupInformation.java:1669)
at org.apache.hadoop.mapreduce.Job.submit(Job.java:1287)
at org.apache.hadoop.mapred.JobClient$1.run(JobClient.java:575)
at org.apache.hadoop.mapred.JobClient$1.run(JobClient.java:570)
at java.security.AccessController.doPrivileged(Native Method)
at javax.security.auth.Subject.doAs(Subject.java:415)
at org.apache.hadoop.security.UserGroupInformation.doAs(UserGroupInformation.java:1669)
at org.apache.hadoop.mapred.JobClient.submitJobInternal(JobClient.java:570)
at org.apache.hadoop.mapred.JobClient.submitJob(JobClient.java:561)
at org.apache.hadoop.mapred.JobClient.runJob(JobClient.java:864)
at org.apache.hadoop.fs.TestDFSIO.runIOTest(TestDFSIO.java:455)
at org.apache.hadoop.fs.TestDFSIO.writeTest(TestDFSIO.java:437)
at org.apache.hadoop.fs.TestDFSIO.testWrite(TestDFSIO.java:231)
at org.apache.hadoop.fs.TestDFSIO.beforeClass(TestDFSIO.java:216)
FAILED: org.apache.hadoop.fs.TestDFSIO.org.apache.hadoop.fs.TestDFSIO
Error Message:
org/apache/hadoop/hdfs/server/namenode/FSDirSnapshotOp
at org.apache.hadoop.hdfs.server.namenode.FSDirDeleteOp.delete(FSDirDeleteOp.java:60)
at org.apache.hadoop.hdfs.server.namenode.FSDirDeleteOp.deleteInternal(FSDirDeleteOp.java:192)
at org.apache.hadoop.hdfs.server.namenode.FSDirDeleteOp.delete(FSDirDeleteOp.java:115)
at org.apache.hadoop.hdfs.server.namenode.FSNamesystem.delete(FSNamesystem.java:2742)
at org.apache.hadoop.hdfs.server.namenode.NameNodeRpcServer.delete(NameNodeRpcServer.java:1016)
at org.apache.hadoop.hdfs.protocolPB.ClientNamenodeProtocolServerSideTranslatorPB.delete(ClientNamenodeProtocolServerSideTranslatorPB.java:619)
at org.apache.hadoop.hdfs.protocol.proto.ClientNamenodeProtocolProtos$ClientNamenodeProtocol$2.callBlockingMethod(ClientNamenodeProtocolProtos.java)
at org.apache.hadoop.ipc.ProtobufRpcEngine$Server$ProtoBufRpcInvoker.call(ProtobufRpcEngine.java:637)
at org.apache.hadoop.ipc.RPC$Server.call(RPC.java:976)
at org.apache.hadoop.ipc.Server$Handler$1.run(Server.java:2305)
at org.apache.hadoop.ipc.Server$Handler$1.run(Server.java:2301)
at java.security.AccessController.doPrivileged(Native Method)
at javax.security.auth.Subject.doAs(Subject.java:415)
at org.apache.hadoop.security.UserGroupInformation.doAs(UserGroupInformation.java:1669)
at org.apache.hadoop.ipc.Server$Handler.run(Server.java:2301)
Caused by: java.lang.ClassNotFoundException: org.apache.hadoop.hdfs.server.namenode.FSDirSnapshotOp
at java.net.URLClassLoader$1.run(URLClassLoader.java:366)
at java.net.URLClassLoader$1.run(URLClassLoader.java:355)
at java.security.AccessController.doPrivileged(Native Method)
at java.net.URLClassLoader.findClass(URLClassLoader.java:354)
at java.lang.ClassLoader.loadClass(ClassLoader.java:425)
at sun.misc.Launcher$AppClassLoader.loadClass(Launcher.java:308)
at java.lang.ClassLoader.loadClass(ClassLoader.java:358)
... 15 more
Stack Trace:
org.apache.hadoop.ipc.RemoteException: org/apache/hadoop/hdfs/server/namenode/FSDirSnapshotOp
at org.apache.hadoop.hdfs.server.namenode.FSDirDeleteOp.delete(FSDirDeleteOp.java:60)
at org.apache.hadoop.hdfs.server.namenode.FSDirDeleteOp.deleteInternal(FSDirDeleteOp.java:192)
at org.apache.hadoop.hdfs.server.namenode.FSDirDeleteOp.delete(FSDirDeleteOp.java:115)
at org.apache.hadoop.hdfs.server.namenode.FSNamesystem.delete(FSNamesystem.java:2742)
at org.apache.hadoop.hdfs.server.namenode.NameNodeRpcServer.delete(NameNodeRpcServer.java:1016)
at org.apache.hadoop.hdfs.protocolPB.ClientNamenodeProtocolServerSideTranslatorPB.delete(ClientNamenodeProtocolServerSideTranslatorPB.java:619)
at org.apache.hadoop.hdfs.protocol.proto.ClientNamenodeProtocolProtos$ClientNamenodeProtocol$2.callBlockingMethod(ClientNamenodeProtocolProtos.java)
at org.apache.hadoop.ipc.ProtobufRpcEngine$Server$ProtoBufRpcInvoker.call(ProtobufRpcEngine.java:637)
at org.apache.hadoop.ipc.RPC$Server.call(RPC.java:976)
at org.apache.hadoop.ipc.Server$Handler$1.run(Server.java:2305)
at org.apache.hadoop.ipc.Server$Handler$1.run(Server.java:2301)
at java.security.AccessController.doPrivileged(Native Method)
at javax.security.auth.Subject.doAs(Subject.java:415)
at org.apache.hadoop.security.UserGroupInformation.doAs(UserGroupInformation.java:1669)
at org.apache.hadoop.ipc.Server$Handler.run(Server.java:2301)
Caused by: java.lang.ClassNotFoundException: org.apache.hadoop.hdfs.server.namenode.FSDirSnapshotOp
at java.net.URLClassLoader$1.run(URLClassLoader.java:366)
at java.net.URLClassLoader$1.run(URLClassLoader.java:355)
at java.security.AccessController.doPrivileged(Native Method)
at java.net.URLClassLoader.findClass(URLClassLoader.java:354)
at java.lang.ClassLoader.loadClass(ClassLoader.java:425)
at sun.misc.Launcher$AppClassLoader.loadClass(Launcher.java:308)
at java.lang.ClassLoader.loadClass(ClassLoader.java:358)
... 15 more
at org.apache.hadoop.ipc.Client.call(Client.java:1448)
at org.apache.hadoop.ipc.Client.call(Client.java:1385)
at org.apache.hadoop.ipc.ProtobufRpcEngine$Invoker.invoke(ProtobufRpcEngine.java:230)
at com.sun.proxy.$Proxy21.delete(Unknown Source)
at org.apache.hadoop.hdfs.protocolPB.ClientNamenodeProtocolTranslatorPB.delete(ClientNamenodeProtocolTranslatorPB.java:518)
at sun.reflect.NativeMethodAccessorImpl.invoke0(Native Method)
at sun.reflect.NativeMethodAccessorImpl.invoke(NativeMethodAccessorImpl.java:57)
at sun.reflect.DelegatingMethodAccessorImpl.invoke(DelegatingMethodAccessorImpl.java:43)
at java.lang.reflect.Method.invoke(Method.java:606)
at org.apache.hadoop.io.retry.RetryInvocationHandler.invokeMethod(RetryInvocationHandler.java:255)
at org.apache.hadoop.io.retry.RetryInvocationHandler.invoke(RetryInvocationHandler.java:103)
at com.sun.proxy.$Proxy24.delete(Unknown Source)
at org.apache.hadoop.hdfs.DFSClient.delete(DFSClient.java:1536)
at org.apache.hadoop.hdfs.DistributedFileSystem$15.doCall(DistributedFileSystem.java:698)
at org.apache.hadoop.hdfs.DistributedFileSystem$15.doCall(DistributedFileSystem.java:695)
at org.apache.hadoop.fs.FileSystemLinkResolver.resolve(FileSystemLinkResolver.java:81)
at org.apache.hadoop.hdfs.DistributedFileSystem.delete(DistributedFileSystem.java:705)
at org.apache.hadoop.fs.TestDFSIO.cleanup(TestDFSIO.java:958)
at org.apache.hadoop.fs.TestDFSIO.afterClass(TestDFSIO.java:224)
FAILED: org.apache.hadoop.mapred.TestMiniMRClientCluster.org.apache.hadoop.mapred.TestMiniMRClientCluster
Error Message:
org/apache/hadoop/yarn/server/applicationhistoryservice/ApplicationHistoryWriter
Stack Trace:
java.lang.NoClassDefFoundError: org/apache/hadoop/yarn/server/applicationhistoryservice/ApplicationHistoryWriter
at java.net.URLClassLoader$1.run(URLClassLoader.java:366)
at java.net.URLClassLoader$1.run(URLClassLoader.java:355)
at java.security.AccessController.doPrivileged(Native Method)
at java.net.URLClassLoader.findClass(URLClassLoader.java:354)
at java.lang.ClassLoader.loadClass(ClassLoader.java:425)
at sun.misc.Launcher$AppClassLoader.loadClass(Launcher.java:308)
at java.lang.ClassLoader.loadClass(ClassLoader.java:358)
at org.apache.hadoop.yarn.server.resourcemanager.ResourceManager.createRMApplicationHistoryWriter(ResourceManager.java:362)
at org.apache.hadoop.yarn.server.resourcemanager.ResourceManager.serviceInit(ResourceManager.java:260)
at org.apache.hadoop.service.AbstractService.init(AbstractService.java:163)
at org.apache.hadoop.yarn.server.MiniYARNCluster.initResourceManager(MiniYARNCluster.java:299)
at org.apache.hadoop.yarn.server.MiniYARNCluster.access$400(MiniYARNCluster.java:99)
at org.apache.hadoop.yarn.server.MiniYARNCluster$ResourceManagerWrapper.serviceInit(MiniYARNCluster.java:451)
at org.apache.hadoop.service.AbstractService.init(AbstractService.java:163)
at org.apache.hadoop.service.CompositeService.serviceInit(CompositeService.java:107)
at org.apache.hadoop.yarn.server.MiniYARNCluster.serviceInit(MiniYARNCluster.java:273)
at org.apache.hadoop.mapreduce.v2.MiniMRYarnCluster.serviceInit(MiniMRYarnCluster.java:186)
at org.apache.hadoop.service.AbstractService.init(AbstractService.java:163)
at org.apache.hadoop.mapred.MiniMRClientClusterFactory.create(MiniMRClientClusterFactory.java:79)
at org.apache.hadoop.mapred.MiniMRClientClusterFactory.create(MiniMRClientClusterFactory.java:41)
at org.apache.hadoop.mapred.TestMiniMRClientCluster.setup(TestMiniMRClientCluster.java:80)
FAILED: org.apache.hadoop.mapred.TestMiniMRClientCluster.org.apache.hadoop.mapred.TestMiniMRClientCluster
Error Message:
null
Stack Trace:
java.lang.NullPointerException: null
at org.apache.hadoop.mapred.TestMiniMRClientCluster.cleanup(TestMiniMRClientCluster.java:93)
FAILED: org.apache.hadoop.mapreduce.v2.TestMiniMRProxyUser.testValidProxyUser
Error Message:
org/apache/hadoop/util/PlatformName
Stack Trace:
java.lang.NoClassDefFoundError: org/apache/hadoop/util/PlatformName
at java.net.URLClassLoader$1.run(URLClassLoader.java:366)
at java.net.URLClassLoader$1.run(URLClassLoader.java:355)
at java.security.AccessController.doPrivileged(Native Method)
at java.net.URLClassLoader.findClass(URLClassLoader.java:354)
at java.lang.ClassLoader.loadClass(ClassLoader.java:425)
at sun.misc.Launcher$AppClassLoader.loadClass(Launcher.java:308)
at java.lang.ClassLoader.loadClass(ClassLoader.java:358)
at org.apache.hadoop.security.UserGroupInformation.getOSLoginModuleName(UserGroupInformation.java:378)
at org.apache.hadoop.security.UserGroupInformation.<clinit>(UserGroupInformation.java:423)
at org.apache.hadoop.mapreduce.v2.TestMiniMRProxyUser.setUp(TestMiniMRProxyUser.java:69)
FAILED: org.apache.hadoop.mapred.TestMRTimelineEventHandling.testMRTimelineEventHandling
Error Message:
Job didn't finish in 30 seconds
Stack Trace:
java.io.IOException: Job didn't finish in 30 seconds
at org.apache.hadoop.mapred.UtilsForTests.runJobSucceed(UtilsForTests.java:622)
at org.apache.hadoop.mapred.TestMRTimelineEventHandling.testMRTimelineEventHandling(TestMRTimelineEventHandling.java:99)
FAILED: org.apache.hadoop.mapred.TestMRTimelineEventHandling.testMapreduceJobTimelineServiceEnabled
Error Message:
Job didn't finish in 30 seconds
Stack Trace:
java.io.IOException: Job didn't finish in 30 seconds
at org.apache.hadoop.mapred.UtilsForTests.runJobSucceed(UtilsForTests.java:622)
at org.apache.hadoop.mapred.TestMRTimelineEventHandling.testMapreduceJobTimelineServiceEnabled(TestMRTimelineEventHandling.java:162)
Hadoop-Mapreduce-trunk - Build # 2592 - Still Failing
Posted by Apache Jenkins Server <je...@builds.apache.org>.
See https://builds.apache.org/job/Hadoop-Mapreduce-trunk/2592/
###################################################################################
########################## LAST 60 LINES OF THE CONSOLE ###########################
[...truncated 32768 lines...]
Running org.apache.hadoop.mapreduce.lib.output.TestMRSequenceFileAsBinaryOutputFormat
Tests run: 3, Failures: 0, Errors: 0, Skipped: 0, Time elapsed: 1.843 sec - in org.apache.hadoop.mapreduce.lib.output.TestMRSequenceFileAsBinaryOutputFormat
Running org.apache.hadoop.mapreduce.lib.output.TestJobOutputCommitter
Tests run: 3, Failures: 0, Errors: 0, Skipped: 0, Time elapsed: 237.739 sec - in org.apache.hadoop.mapreduce.lib.output.TestJobOutputCommitter
Running org.apache.hadoop.mapreduce.lib.output.TestMRCJCFileOutputCommitter
Tests run: 4, Failures: 0, Errors: 0, Skipped: 0, Time elapsed: 1.604 sec - in org.apache.hadoop.mapreduce.lib.output.TestMRCJCFileOutputCommitter
Running org.apache.hadoop.util.TestMRCJCReflectionUtils
Tests run: 1, Failures: 0, Errors: 0, Skipped: 0, Time elapsed: 0.658 sec - in org.apache.hadoop.util.TestMRCJCReflectionUtils
Running org.apache.hadoop.util.TestMRCJCRunJar
Tests run: 1, Failures: 0, Errors: 0, Skipped: 0, Time elapsed: 0.254 sec - in org.apache.hadoop.util.TestMRCJCRunJar
Running org.apache.hadoop.io.TestSequenceFileMergeProgress
Tests run: 3, Failures: 0, Errors: 0, Skipped: 0, Time elapsed: 2.391 sec - in org.apache.hadoop.io.TestSequenceFileMergeProgress
Results :
Tests in error:
TestMRTimelineEventHandling.testMRTimelineEventHandling:99 » IO Job didn't fin...
TestMRTimelineEventHandling.testMapreduceJobTimelineServiceEnabled:162 » IO Jo...
Tests run: 511, Failures: 0, Errors: 2, Skipped: 11
[INFO] ------------------------------------------------------------------------
[INFO] Reactor Summary:
[INFO]
[INFO] Apache Hadoop MapReduce Client .................... SUCCESS [ 2.853 s]
[INFO] Apache Hadoop MapReduce Core ...................... SUCCESS [01:41 min]
[INFO] Apache Hadoop MapReduce Common .................... SUCCESS [ 29.329 s]
[INFO] Apache Hadoop MapReduce Shuffle ................... SUCCESS [ 5.003 s]
[INFO] Apache Hadoop MapReduce App ....................... SUCCESS [09:16 min]
[INFO] Apache Hadoop MapReduce HistoryServer ............. SUCCESS [05:38 min]
[INFO] Apache Hadoop MapReduce JobClient ................. FAILURE [ 01:51 h]
[INFO] Apache Hadoop MapReduce HistoryServer Plugins ..... SKIPPED
[INFO] Apache Hadoop MapReduce NativeTask ................ SKIPPED
[INFO] Apache Hadoop MapReduce Examples .................. SKIPPED
[INFO] Apache Hadoop MapReduce ........................... SKIPPED
[INFO] ------------------------------------------------------------------------
[INFO] BUILD FAILURE
[INFO] ------------------------------------------------------------------------
[INFO] Total time: 02:08 h
[INFO] Finished at: 2015-11-10T22:09:30+00:00
[INFO] Final Memory: 38M/677M
[INFO] ------------------------------------------------------------------------
[ERROR] Failed to execute goal org.apache.maven.plugins:maven-surefire-plugin:2.17:test (default-test) on project hadoop-mapreduce-client-jobclient: There was a timeout or other error in the fork -> [Help 1]
[ERROR]
[ERROR] To see the full stack trace of the errors, re-run Maven with the -e switch.
[ERROR] Re-run Maven using the -X switch to enable full debug logging.
[ERROR]
[ERROR] For more information about the errors and possible solutions, please read the following articles:
[ERROR] [Help 1] http://cwiki.apache.org/confluence/display/MAVEN/MojoFailureException
[ERROR]
[ERROR] After correcting the problems, you can resume the build with the command
[ERROR] mvn <goals> -rf :hadoop-mapreduce-client-jobclient
Build step 'Execute shell' marked build as failure
[FINDBUGS] Skipping publisher since build result is FAILURE
Archiving artifacts
Recording test results
Updating HADOOP-12560
Email was triggered for: Failure - Any
Sending email for trigger: Failure - Any
###################################################################################
############################## FAILED TESTS (if any) ##############################
2 tests failed.
FAILED: org.apache.hadoop.mapred.TestMRTimelineEventHandling.testMRTimelineEventHandling
Error Message:
Job didn't finish in 30 seconds
Stack Trace:
java.io.IOException: Job didn't finish in 30 seconds
at org.apache.hadoop.mapred.UtilsForTests.runJobSucceed(UtilsForTests.java:622)
at org.apache.hadoop.mapred.TestMRTimelineEventHandling.testMRTimelineEventHandling(TestMRTimelineEventHandling.java:99)
FAILED: org.apache.hadoop.mapred.TestMRTimelineEventHandling.testMapreduceJobTimelineServiceEnabled
Error Message:
Job didn't finish in 30 seconds
Stack Trace:
java.io.IOException: Job didn't finish in 30 seconds
at org.apache.hadoop.mapred.UtilsForTests.runJobSucceed(UtilsForTests.java:622)
at org.apache.hadoop.mapred.TestMRTimelineEventHandling.testMapreduceJobTimelineServiceEnabled(TestMRTimelineEventHandling.java:162)
Hadoop-Mapreduce-trunk - Build # 2591 - Still Failing
Posted by Apache Jenkins Server <je...@builds.apache.org>.
See https://builds.apache.org/job/Hadoop-Mapreduce-trunk/2591/
###################################################################################
########################## LAST 60 LINES OF THE CONSOLE ###########################
[...truncated 31950 lines...]
+-org.apache.hadoop:hadoop-annotations:3.0.0-SNAPSHOT
and
+-org.apache.hadoop:hadoop-mapreduce-client:3.0.0-SNAPSHOT
+-org.apache.hadoop:hadoop-annotations:3.0.0-20151110.190327-7697
and
+-org.apache.hadoop:hadoop-mapreduce-client:3.0.0-SNAPSHOT
+-org.apache.hadoop:hadoop-common:3.0.0-SNAPSHOT
+-org.apache.hadoop:hadoop-annotations:3.0.0-SNAPSHOT
[WARNING] Rule 0: org.apache.maven.plugins.enforcer.DependencyConvergence failed with message:
Failed while enforcing releasability the error(s) are [
Dependency convergence error for org.apache.hadoop:hadoop-annotations:3.0.0-SNAPSHOT paths to dependency are:
+-org.apache.hadoop:hadoop-mapreduce-client:3.0.0-SNAPSHOT
+-org.apache.hadoop:hadoop-common:3.0.0-SNAPSHOT
+-org.apache.hadoop:hadoop-annotations:3.0.0-SNAPSHOT
and
+-org.apache.hadoop:hadoop-mapreduce-client:3.0.0-SNAPSHOT
+-org.apache.hadoop:hadoop-annotations:3.0.0-20151110.190327-7697
and
+-org.apache.hadoop:hadoop-mapreduce-client:3.0.0-SNAPSHOT
+-org.apache.hadoop:hadoop-common:3.0.0-SNAPSHOT
+-org.apache.hadoop:hadoop-annotations:3.0.0-SNAPSHOT
]
[INFO] ------------------------------------------------------------------------
[INFO] Reactor Summary:
[INFO]
[INFO] Apache Hadoop MapReduce Client .................... FAILURE [ 5.959 s]
[INFO] Apache Hadoop MapReduce Core ...................... SKIPPED
[INFO] Apache Hadoop MapReduce Common .................... SKIPPED
[INFO] Apache Hadoop MapReduce Shuffle ................... SKIPPED
[INFO] Apache Hadoop MapReduce App ....................... SKIPPED
[INFO] Apache Hadoop MapReduce HistoryServer ............. SKIPPED
[INFO] Apache Hadoop MapReduce JobClient ................. SKIPPED
[INFO] Apache Hadoop MapReduce HistoryServer Plugins ..... SKIPPED
[INFO] Apache Hadoop MapReduce NativeTask ................ SKIPPED
[INFO] Apache Hadoop MapReduce Examples .................. SKIPPED
[INFO] Apache Hadoop MapReduce ........................... SKIPPED
[INFO] ------------------------------------------------------------------------
[INFO] BUILD FAILURE
[INFO] ------------------------------------------------------------------------
[INFO] Total time: 7.815 s
[INFO] Finished at: 2015-11-10T19:08:50+00:00
[INFO] Final Memory: 23M/723M
[INFO] ------------------------------------------------------------------------
[ERROR] Failed to execute goal org.apache.maven.plugins:maven-enforcer-plugin:1.3.1:enforce (depcheck) on project hadoop-mapreduce-client: Some Enforcer rules have failed. Look above for specific messages explaining why the rule failed. -> [Help 1]
[ERROR]
[ERROR] To see the full stack trace of the errors, re-run Maven with the -e switch.
[ERROR] Re-run Maven using the -X switch to enable full debug logging.
[ERROR]
[ERROR] For more information about the errors and possible solutions, please read the following articles:
[ERROR] [Help 1] http://cwiki.apache.org/confluence/display/MAVEN/MojoExecutionException
Build step 'Execute shell' marked build as failure
[FINDBUGS] Skipping publisher since build result is FAILURE
Archiving artifacts
Recording test results
ERROR: Publisher 'Publish JUnit test result report' failed: No test report files were found. Configuration error?
Updating HDFS-9364
Email was triggered for: Failure - Any
Sending email for trigger: Failure - Any
###################################################################################
############################## FAILED TESTS (if any) ##############################
No tests ran.
Hadoop-Mapreduce-trunk - Build # 2590 - Still Failing
Posted by Apache Jenkins Server <je...@builds.apache.org>.
See https://builds.apache.org/job/Hadoop-Mapreduce-trunk/2590/
###################################################################################
########################## LAST 60 LINES OF THE CONSOLE ###########################
[...truncated 32404 lines...]
Tests run: 15, Failures: 0, Errors: 0, Skipped: 0, Time elapsed: 15.989 sec - in org.apache.hadoop.mapreduce.v2.hs.webapp.TestHsWebServicesAttempts
Running org.apache.hadoop.mapreduce.v2.hs.webapp.TestHsWebServices
Tests run: 11, Failures: 0, Errors: 0, Skipped: 0, Time elapsed: 10.565 sec - in org.apache.hadoop.mapreduce.v2.hs.webapp.TestHsWebServices
Running org.apache.hadoop.mapreduce.v2.hs.webapp.TestBlocks
Tests run: 5, Failures: 0, Errors: 0, Skipped: 0, Time elapsed: 2.133 sec - in org.apache.hadoop.mapreduce.v2.hs.webapp.TestBlocks
Running org.apache.hadoop.mapreduce.v2.hs.webapp.TestHSWebApp
Tests run: 15, Failures: 0, Errors: 0, Skipped: 0, Time elapsed: 13.885 sec - in org.apache.hadoop.mapreduce.v2.hs.webapp.TestHSWebApp
Running org.apache.hadoop.mapreduce.v2.hs.TestCompletedTask
Tests run: 2, Failures: 0, Errors: 0, Skipped: 0, Time elapsed: 1.15 sec - in org.apache.hadoop.mapreduce.v2.hs.TestCompletedTask
Results :
Tests in error:
TestJobListCache.testAddExisting:39 » test timed out after 1000 milliseconds
Tests run: 198, Failures: 0, Errors: 1, Skipped: 0
[INFO] ------------------------------------------------------------------------
[INFO] Reactor Summary:
[INFO]
[INFO] Apache Hadoop MapReduce Client .................... SUCCESS [ 3.763 s]
[INFO] Apache Hadoop MapReduce Core ...................... SUCCESS [02:14 min]
[INFO] Apache Hadoop MapReduce Common .................... SUCCESS [ 37.448 s]
[INFO] Apache Hadoop MapReduce Shuffle ................... SUCCESS [ 6.817 s]
[INFO] Apache Hadoop MapReduce App ....................... SUCCESS [11:21 min]
[INFO] Apache Hadoop MapReduce HistoryServer ............. FAILURE [07:07 min]
[INFO] Apache Hadoop MapReduce JobClient ................. SKIPPED
[INFO] Apache Hadoop MapReduce HistoryServer Plugins ..... SKIPPED
[INFO] Apache Hadoop MapReduce NativeTask ................ SKIPPED
[INFO] Apache Hadoop MapReduce Examples .................. SKIPPED
[INFO] Apache Hadoop MapReduce ........................... SKIPPED
[INFO] ------------------------------------------------------------------------
[INFO] BUILD FAILURE
[INFO] ------------------------------------------------------------------------
[INFO] Total time: 21:33 min
[INFO] Finished at: 2015-11-10T08:44:09+00:00
[INFO] Final Memory: 47M/1226M
[INFO] ------------------------------------------------------------------------
[ERROR] Failed to execute goal org.apache.maven.plugins:maven-surefire-plugin:2.17:test (default-test) on project hadoop-mapreduce-client-hs: There are test failures.
[ERROR]
[ERROR] Please refer to /home/jenkins/jenkins-slave/workspace/Hadoop-Mapreduce-trunk/hadoop-mapreduce-project/hadoop-mapreduce-client/hadoop-mapreduce-client-hs/target/surefire-reports for the individual test results.
[ERROR] -> [Help 1]
[ERROR]
[ERROR] To see the full stack trace of the errors, re-run Maven with the -e switch.
[ERROR] Re-run Maven using the -X switch to enable full debug logging.
[ERROR]
[ERROR] For more information about the errors and possible solutions, please read the following articles:
[ERROR] [Help 1] http://cwiki.apache.org/confluence/display/MAVEN/MojoFailureException
[ERROR]
[ERROR] After correcting the problems, you can resume the build with the command
[ERROR] mvn <goals> -rf :hadoop-mapreduce-client-hs
Build step 'Execute shell' marked build as failure
[FINDBUGS] Skipping publisher since build result is FAILURE
Archiving artifacts
Recording test results
Updating HDFS-9401
Updating HADOOP-12482
Email was triggered for: Failure - Any
Sending email for trigger: Failure - Any
###################################################################################
############################## FAILED TESTS (if any) ##############################
1 tests failed.
FAILED: org.apache.hadoop.mapreduce.v2.hs.TestJobListCache.testAddExisting
Error Message:
test timed out after 1000 milliseconds
Stack Trace:
java.lang.Exception: test timed out after 1000 milliseconds
at java.util.zip.Inflater.inflateBytes(Native Method)
at java.util.zip.Inflater.inflate(Inflater.java:259)
at java.util.zip.InflaterInputStream.read(InflaterInputStream.java:152)
at sun.misc.Resource.getBytes(Resource.java:124)
at java.net.URLClassLoader.defineClass(URLClassLoader.java:444)
at java.net.URLClassLoader.access$100(URLClassLoader.java:71)
at java.net.URLClassLoader$1.run(URLClassLoader.java:361)
at java.net.URLClassLoader$1.run(URLClassLoader.java:355)
at java.security.AccessController.doPrivileged(Native Method)
at java.net.URLClassLoader.findClass(URLClassLoader.java:354)
at java.lang.ClassLoader.loadClass(ClassLoader.java:425)
at sun.misc.Launcher$AppClassLoader.loadClass(Launcher.java:308)
at java.lang.ClassLoader.loadClass(ClassLoader.java:358)
at org.mockito.cglib.core.KeyFactory$Generator.generateClass(KeyFactory.java:167)
at org.mockito.cglib.core.DefaultGeneratorStrategy.generate(DefaultGeneratorStrategy.java:25)
at org.mockito.cglib.core.AbstractClassGenerator.create(AbstractClassGenerator.java:217)
at org.mockito.cglib.core.KeyFactory$Generator.create(KeyFactory.java:145)
at org.mockito.cglib.core.KeyFactory.create(KeyFactory.java:117)
at org.mockito.cglib.core.KeyFactory.create(KeyFactory.java:109)
at org.mockito.cglib.core.KeyFactory.create(KeyFactory.java:105)
at org.mockito.cglib.proxy.Enhancer.<clinit>(Enhancer.java:70)
at org.mockito.internal.creation.jmock.ClassImposterizer.createProxyClass(ClassImposterizer.java:68)
at org.mockito.internal.creation.jmock.ClassImposterizer.imposterise(ClassImposterizer.java:50)
at org.mockito.internal.util.MockUtil.createMock(MockUtil.java:54)
at org.mockito.internal.MockitoCore.mock(MockitoCore.java:45)
at org.mockito.Mockito.mock(Mockito.java:921)
at org.mockito.Mockito.mock(Mockito.java:816)
at org.apache.hadoop.mapreduce.v2.hs.TestJobListCache.testAddExisting(TestJobListCache.java:39)
Hadoop-Mapreduce-trunk - Build # 2589 - Still Failing
Posted by Apache Jenkins Server <je...@builds.apache.org>.
See https://builds.apache.org/job/Hadoop-Mapreduce-trunk/2589/
###################################################################################
########################## LAST 60 LINES OF THE CONSOLE ###########################
[...truncated 32939 lines...]
Running org.apache.hadoop.conf.TestNoDefaultsJobConf
Tests run: 1, Failures: 0, Errors: 0, Skipped: 0, Time elapsed: 24.666 sec - in org.apache.hadoop.conf.TestNoDefaultsJobConf
Running org.apache.hadoop.util.TestMRCJCReflectionUtils
Tests run: 1, Failures: 0, Errors: 0, Skipped: 0, Time elapsed: 0.646 sec - in org.apache.hadoop.util.TestMRCJCReflectionUtils
Running org.apache.hadoop.util.TestMRCJCRunJar
Tests run: 1, Failures: 0, Errors: 0, Skipped: 0, Time elapsed: 0.251 sec - in org.apache.hadoop.util.TestMRCJCRunJar
Results :
Failed tests:
TestMRJobsWithProfiler.testDefaultProfiler:111->testProfilerInternal:212 expected:<4> but was:<0>
Tests in error:
TestReduceFetchFromPartialMem$1>TestSetup.run:27->setUp:61 » YarnRuntime java....
TestMRTimelineEventHandling.testMRTimelineEventHandling:99 » IO Job didn't fin...
TestMRTimelineEventHandling.testMapreduceJobTimelineServiceEnabled:162 » IO Jo...
TestClusterMRNotification>NotificationTestCase.testMR:156->NotificationTestCase.launchWordCount:241 » IO
Tests run: 522, Failures: 1, Errors: 4, Skipped: 11
[INFO] ------------------------------------------------------------------------
[INFO] Reactor Summary:
[INFO]
[INFO] Apache Hadoop MapReduce Client .................... SUCCESS [ 4.605 s]
[INFO] Apache Hadoop MapReduce Core ...................... SUCCESS [01:42 min]
[INFO] Apache Hadoop MapReduce Common .................... SUCCESS [ 30.062 s]
[INFO] Apache Hadoop MapReduce Shuffle ................... SUCCESS [ 6.226 s]
[INFO] Apache Hadoop MapReduce App ....................... SUCCESS [09:22 min]
[INFO] Apache Hadoop MapReduce HistoryServer ............. SUCCESS [05:40 min]
[INFO] Apache Hadoop MapReduce JobClient ................. FAILURE [ 01:55 h]
[INFO] Apache Hadoop MapReduce HistoryServer Plugins ..... SKIPPED
[INFO] Apache Hadoop MapReduce NativeTask ................ SKIPPED
[INFO] Apache Hadoop MapReduce Examples .................. SKIPPED
[INFO] Apache Hadoop MapReduce ........................... SKIPPED
[INFO] ------------------------------------------------------------------------
[INFO] BUILD FAILURE
[INFO] ------------------------------------------------------------------------
[INFO] Total time: 02:13 h
[INFO] Finished at: 2015-11-10T02:17:16+00:00
[INFO] Final Memory: 40M/708M
[INFO] ------------------------------------------------------------------------
[ERROR] Failed to execute goal org.apache.maven.plugins:maven-surefire-plugin:2.17:test (default-test) on project hadoop-mapreduce-client-jobclient: There was a timeout or other error in the fork -> [Help 1]
[ERROR]
[ERROR] To see the full stack trace of the errors, re-run Maven with the -e switch.
[ERROR] Re-run Maven using the -X switch to enable full debug logging.
[ERROR]
[ERROR] For more information about the errors and possible solutions, please read the following articles:
[ERROR] [Help 1] http://cwiki.apache.org/confluence/display/MAVEN/MojoFailureException
[ERROR]
[ERROR] After correcting the problems, you can resume the build with the command
[ERROR] mvn <goals> -rf :hadoop-mapreduce-client-jobclient
Build step 'Execute shell' marked build as failure
[FINDBUGS] Skipping publisher since build result is FAILURE
Archiving artifacts
Recording test results
Updating HDFS-9249
Updating HDFS-2261
Email was triggered for: Failure - Any
Sending email for trigger: Failure - Any
###################################################################################
############################## FAILED TESTS (if any) ##############################
5 tests failed.
FAILED: org.apache.hadoop.mapred.TestClusterMRNotification.testMR
Error Message:
Job status not available
Stack Trace:
java.io.IOException: Job status not available
at org.apache.hadoop.mapreduce.Job.updateStatus(Job.java:331)
at org.apache.hadoop.mapreduce.Job.isComplete(Job.java:604)
at org.apache.hadoop.mapreduce.Job.monitorAndPrintJob(Job.java:1349)
at org.apache.hadoop.mapred.JobClient$NetworkedJob.monitorAndPrintJob(JobClient.java:412)
at org.apache.hadoop.mapred.JobClient.monitorAndPrintJob(JobClient.java:886)
at org.apache.hadoop.mapred.JobClient.runJob(JobClient.java:866)
at org.apache.hadoop.mapred.NotificationTestCase.launchWordCount(NotificationTestCase.java:241)
at org.apache.hadoop.mapred.NotificationTestCase.testMR(NotificationTestCase.java:156)
at sun.reflect.NativeMethodAccessorImpl.invoke0(Native Method)
at sun.reflect.NativeMethodAccessorImpl.invoke(NativeMethodAccessorImpl.java:57)
at sun.reflect.DelegatingMethodAccessorImpl.invoke(DelegatingMethodAccessorImpl.java:43)
at java.lang.reflect.Method.invoke(Method.java:606)
at junit.framework.TestCase.runTest(TestCase.java:176)
at junit.framework.TestCase.runBare(TestCase.java:141)
at junit.framework.TestResult$1.protect(TestResult.java:122)
at junit.framework.TestResult.runProtected(TestResult.java:142)
at junit.framework.TestResult.run(TestResult.java:125)
at junit.framework.TestCase.run(TestCase.java:129)
at junit.framework.TestSuite.runTest(TestSuite.java:255)
at junit.framework.TestSuite.run(TestSuite.java:250)
at org.junit.internal.runners.JUnit38ClassRunner.run(JUnit38ClassRunner.java:84)
at org.apache.maven.surefire.junit4.JUnit4Provider.execute(JUnit4Provider.java:264)
at org.apache.maven.surefire.junit4.JUnit4Provider.executeTestSet(JUnit4Provider.java:153)
at org.apache.maven.surefire.junit4.JUnit4Provider.invoke(JUnit4Provider.java:124)
at org.apache.maven.surefire.booter.ForkedBooter.invokeProviderInSameClassLoader(ForkedBooter.java:200)
at org.apache.maven.surefire.booter.ForkedBooter.runSuitesInProcess(ForkedBooter.java:153)
at org.apache.maven.surefire.booter.ForkedBooter.main(ForkedBooter.java:103)
FAILED: org.apache.hadoop.mapred.TestReduceFetchFromPartialMem$1.org.apache.hadoop.mapred.TestReduceFetchFromPartialMem
Error Message:
java.io.IOException: ResourceManager failed to start. Final state is STOPPED
Stack Trace:
org.apache.hadoop.yarn.exceptions.YarnRuntimeException: java.io.IOException: ResourceManager failed to start. Final state is STOPPED
at org.apache.hadoop.yarn.server.MiniYARNCluster.startResourceManager(MiniYARNCluster.java:331)
at org.apache.hadoop.yarn.server.MiniYARNCluster.access$500(MiniYARNCluster.java:99)
at org.apache.hadoop.yarn.server.MiniYARNCluster$ResourceManagerWrapper.serviceStart(MiniYARNCluster.java:457)
at org.apache.hadoop.service.AbstractService.start(AbstractService.java:193)
at org.apache.hadoop.service.CompositeService.serviceStart(CompositeService.java:120)
at org.apache.hadoop.mapreduce.v2.MiniMRYarnCluster.serviceStart(MiniMRYarnCluster.java:191)
at org.apache.hadoop.service.AbstractService.start(AbstractService.java:193)
at org.apache.hadoop.mapred.MiniMRClientClusterFactory.create(MiniMRClientClusterFactory.java:80)
at org.apache.hadoop.mapred.MiniMRCluster.<init>(MiniMRCluster.java:187)
at org.apache.hadoop.mapred.MiniMRCluster.<init>(MiniMRCluster.java:175)
at org.apache.hadoop.mapred.MiniMRCluster.<init>(MiniMRCluster.java:167)
at org.apache.hadoop.mapred.MiniMRCluster.<init>(MiniMRCluster.java:159)
at org.apache.hadoop.mapred.MiniMRCluster.<init>(MiniMRCluster.java:152)
at org.apache.hadoop.mapred.MiniMRCluster.<init>(MiniMRCluster.java:145)
at org.apache.hadoop.mapred.MiniMRCluster.<init>(MiniMRCluster.java:138)
at org.apache.hadoop.mapred.MiniMRCluster.<init>(MiniMRCluster.java:133)
at org.apache.hadoop.mapred.TestReduceFetchFromPartialMem$1.setUp(TestReduceFetchFromPartialMem.java:61)
FAILED: org.apache.hadoop.mapreduce.v2.TestMRJobsWithProfiler.testDefaultProfiler
Error Message:
expected:<4> but was:<0>
Stack Trace:
java.lang.AssertionError: expected:<4> but was:<0>
at org.junit.Assert.fail(Assert.java:88)
at org.junit.Assert.failNotEquals(Assert.java:743)
at org.junit.Assert.assertEquals(Assert.java:118)
at org.junit.Assert.assertEquals(Assert.java:555)
at org.junit.Assert.assertEquals(Assert.java:542)
at org.apache.hadoop.mapreduce.v2.TestMRJobsWithProfiler.testProfilerInternal(TestMRJobsWithProfiler.java:212)
at org.apache.hadoop.mapreduce.v2.TestMRJobsWithProfiler.testDefaultProfiler(TestMRJobsWithProfiler.java:111)
FAILED: org.apache.hadoop.mapred.TestMRTimelineEventHandling.testMRTimelineEventHandling
Error Message:
Job didn't finish in 30 seconds
Stack Trace:
java.io.IOException: Job didn't finish in 30 seconds
at org.apache.hadoop.mapred.UtilsForTests.runJobSucceed(UtilsForTests.java:622)
at org.apache.hadoop.mapred.TestMRTimelineEventHandling.testMRTimelineEventHandling(TestMRTimelineEventHandling.java:99)
FAILED: org.apache.hadoop.mapred.TestMRTimelineEventHandling.testMapreduceJobTimelineServiceEnabled
Error Message:
Job didn't finish in 30 seconds
Stack Trace:
java.io.IOException: Job didn't finish in 30 seconds
at org.apache.hadoop.mapred.UtilsForTests.runJobSucceed(UtilsForTests.java:622)
at org.apache.hadoop.mapred.TestMRTimelineEventHandling.testMapreduceJobTimelineServiceEnabled(TestMRTimelineEventHandling.java:162)