You are viewing a plain text version of this content. The canonical link for it is here.
Posted to java-dev@axis.apache.org by Apache Jenkins Server <je...@builds.apache.org> on 2016/04/27 22:43:30 UTC

Build failed in Jenkins: Axis2 » Apache Axis2 - SAAJ #3465

See <https://builds.apache.org/job/Axis2/org.apache.axis2$axis2-saaj/3465/>

------------------------------------------
[INFO]                                                                         
[INFO] ------------------------------------------------------------------------
[INFO] Building Apache Axis2 - SAAJ 1.8.0-SNAPSHOT
[INFO] ------------------------------------------------------------------------
Downloading: http://repository.apache.org/snapshots/org/apache/ws/commons/axiom/saaj-testsuite/1.3.0-SNAPSHOT/maven-metadata.xml
Downloaded: http://repository.apache.org/snapshots/org/apache/ws/commons/axiom/saaj-testsuite/1.3.0-SNAPSHOT/maven-metadata.xml (2 KB at 4.1 KB/sec)
Downloading: http://repository.apache.org/snapshots/org/apache/ws/commons/axiom/saaj-testsuite/1.3.0-SNAPSHOT/saaj-testsuite-1.3.0-20160427.200947-215.pom
Downloaded: http://repository.apache.org/snapshots/org/apache/ws/commons/axiom/saaj-testsuite/1.3.0-SNAPSHOT/saaj-testsuite-1.3.0-20160427.200947-215.pom (3 KB at 5.2 KB/sec)
Downloading: http://repository.apache.org/snapshots/org/apache/ws/commons/axiom/testutils/1.3.0-SNAPSHOT/maven-metadata.xml
Downloaded: http://repository.apache.org/snapshots/org/apache/ws/commons/axiom/testutils/1.3.0-SNAPSHOT/maven-metadata.xml (2 KB at 4.0 KB/sec)
Downloading: http://repository.apache.org/snapshots/org/apache/ws/commons/axiom/testutils/1.3.0-SNAPSHOT/testutils-1.3.0-20160427.195623-226.pom
Downloaded: http://repository.apache.org/snapshots/org/apache/ws/commons/axiom/testutils/1.3.0-SNAPSHOT/testutils-1.3.0-20160427.195623-226.pom (3 KB at 6.0 KB/sec)
Downloading: http://repository.apache.org/snapshots/org/apache/ws/commons/axiom/soap-testsuite/1.3.0-SNAPSHOT/maven-metadata.xml
Downloaded: http://repository.apache.org/snapshots/org/apache/ws/commons/axiom/soap-testsuite/1.3.0-SNAPSHOT/maven-metadata.xml (2 KB at 3.9 KB/sec)
Downloading: http://repository.apache.org/snapshots/org/apache/ws/commons/axiom/soap-testsuite/1.3.0-SNAPSHOT/soap-testsuite-1.3.0-20160427.195722-226.pom
Downloaded: http://repository.apache.org/snapshots/org/apache/ws/commons/axiom/soap-testsuite/1.3.0-SNAPSHOT/soap-testsuite-1.3.0-20160427.195722-226.pom (4 KB at 9.1 KB/sec)
Downloading: http://repository.apache.org/snapshots/org/apache/ws/commons/axiom/xml-testsuite/1.3.0-SNAPSHOT/maven-metadata.xml
Downloaded: http://repository.apache.org/snapshots/org/apache/ws/commons/axiom/xml-testsuite/1.3.0-SNAPSHOT/maven-metadata.xml (2 KB at 3.3 KB/sec)
Downloading: http://repository.apache.org/snapshots/org/apache/ws/commons/axiom/xml-testsuite/1.3.0-SNAPSHOT/xml-testsuite-1.3.0-20160427.195633-226.pom
Downloaded: http://repository.apache.org/snapshots/org/apache/ws/commons/axiom/xml-testsuite/1.3.0-SNAPSHOT/xml-testsuite-1.3.0-20160427.195633-226.pom (5 KB at 11.3 KB/sec)
Downloading: http://repository.apache.org/snapshots/org/apache/ws/commons/axiom/multiton/1.3.0-SNAPSHOT/maven-metadata.xml
Downloaded: http://repository.apache.org/snapshots/org/apache/ws/commons/axiom/multiton/1.3.0-SNAPSHOT/maven-metadata.xml (2 KB at 0.8 KB/sec)
Downloading: http://repository.apache.org/snapshots/org/apache/ws/commons/axiom/multiton/1.3.0-SNAPSHOT/multiton-1.3.0-20160427.195605-226.pom
Downloaded: http://repository.apache.org/snapshots/org/apache/ws/commons/axiom/multiton/1.3.0-SNAPSHOT/multiton-1.3.0-20160427.195605-226.pom (2 KB at 2.4 KB/sec)
Downloading: http://repository.apache.org/snapshots/org/apache/ws/commons/axiom/xml-utils/1.3.0-SNAPSHOT/maven-metadata.xml
Downloaded: http://repository.apache.org/snapshots/org/apache/ws/commons/axiom/xml-utils/1.3.0-SNAPSHOT/maven-metadata.xml (2 KB at 2.1 KB/sec)
Downloading: http://repository.apache.org/snapshots/org/apache/ws/commons/axiom/xml-utils/1.3.0-SNAPSHOT/xml-utils-1.3.0-20160427.195710-226.pom
Downloaded: http://repository.apache.org/snapshots/org/apache/ws/commons/axiom/xml-utils/1.3.0-SNAPSHOT/xml-utils-1.3.0-20160427.195710-226.pom (2 KB at 5.1 KB/sec)
Downloading: http://repository.apache.org/snapshots/org/apache/ws/commons/axiom/components/1.3.0-SNAPSHOT/maven-metadata.xml
Downloaded: http://repository.apache.org/snapshots/org/apache/ws/commons/axiom/components/1.3.0-SNAPSHOT/maven-metadata.xml (618 B at 1.7 KB/sec)
Downloading: http://repository.apache.org/snapshots/org/apache/ws/commons/axiom/components/1.3.0-SNAPSHOT/components-1.3.0-20160427.195657-226.pom
Downloaded: http://repository.apache.org/snapshots/org/apache/ws/commons/axiom/components/1.3.0-SNAPSHOT/components-1.3.0-20160427.195657-226.pom (2 KB at 3.7 KB/sec)
Downloading: http://repository.apache.org/snapshots/org/apache/ws/commons/axiom/saaj-testsuite/1.3.0-SNAPSHOT/saaj-testsuite-1.3.0-20160427.200947-215.jar
Downloading: http://repository.apache.org/snapshots/org/apache/ws/commons/axiom/testutils/1.3.0-SNAPSHOT/testutils-1.3.0-20160427.195623-226.jar
Downloading: http://repository.apache.org/snapshots/org/apache/ws/commons/axiom/soap-testsuite/1.3.0-SNAPSHOT/soap-testsuite-1.3.0-20160427.195722-226.jar
Downloading: http://repository.apache.org/snapshots/org/apache/ws/commons/axiom/multiton/1.3.0-SNAPSHOT/multiton-1.3.0-20160427.195605-226.jar
Downloading: http://repository.apache.org/snapshots/org/apache/ws/commons/axiom/xml-testsuite/1.3.0-SNAPSHOT/xml-testsuite-1.3.0-20160427.195633-226.jar
Downloaded: http://repository.apache.org/snapshots/org/apache/ws/commons/axiom/multiton/1.3.0-SNAPSHOT/multiton-1.3.0-20160427.195605-226.jar (13 KB at 30.5 KB/sec)
Downloading: http://repository.apache.org/snapshots/org/apache/ws/commons/axiom/xml-utils/1.3.0-SNAPSHOT/xml-utils-1.3.0-20160427.195710-226.jar
Downloaded: http://repository.apache.org/snapshots/org/apache/ws/commons/axiom/saaj-testsuite/1.3.0-SNAPSHOT/saaj-testsuite-1.3.0-20160427.200947-215.jar (19 KB at 42.3 KB/sec)
Downloaded: http://repository.apache.org/snapshots/org/apache/ws/commons/axiom/xml-testsuite/1.3.0-SNAPSHOT/xml-testsuite-1.3.0-20160427.195633-226.jar (41 KB at 79.7 KB/sec)
Downloaded: http://repository.apache.org/snapshots/org/apache/ws/commons/axiom/testutils/1.3.0-SNAPSHOT/testutils-1.3.0-20160427.195623-226.jar (50 KB at 96.5 KB/sec)
Downloaded: http://repository.apache.org/snapshots/org/apache/ws/commons/axiom/xml-utils/1.3.0-SNAPSHOT/xml-utils-1.3.0-20160427.195710-226.jar (12 KB at 31.7 KB/sec)
Downloaded: http://repository.apache.org/snapshots/org/apache/ws/commons/axiom/soap-testsuite/1.3.0-SNAPSHOT/soap-testsuite-1.3.0-20160427.195722-226.jar (167 KB at 198.5 KB/sec)
[INFO] 
[INFO] --- maven-clean-plugin:2.2:clean (default-clean) @ axis2-saaj ---
[INFO] Deleting directory <https://builds.apache.org/job/Axis2/org.apache.axis2$axis2-saaj/ws/target>
[INFO] 
[INFO] --- maven-enforcer-plugin:1.1:enforce (default) @ axis2-saaj ---
[INFO] 
[INFO] --- maven-remote-resources-plugin:1.5:process (default) @ axis2-saaj ---
[INFO] 
[INFO] --- maven-resources-plugin:2.4.2:resources (default-resources) @ axis2-saaj ---
[INFO] Using 'UTF-8' encoding to copy filtered resources.
[INFO] Copying 4 resources
[INFO] Copying 2 resources
[INFO] 
[INFO] --- maven-compiler-plugin:2.3.1:compile (default-compile) @ axis2-saaj ---
[INFO] Compiling 29 source files to <https://builds.apache.org/job/Axis2/org.apache.axis2$axis2-saaj/ws/target/classes>
[INFO] -------------------------------------------------------------
[ERROR] COMPILATION ERROR : 
[INFO] -------------------------------------------------------------
[ERROR] <https://builds.apache.org/job/Axis2/org.apache.axis2$axis2-saaj/ws/src/org/apache/axis2/saaj/util/SAAJUtil.java>:[25,37] error: cannot find symbol

[ERROR]  package org.apache.axiom.util.stax.xop
<https://builds.apache.org/job/Axis2/org.apache.axis2$axis2-saaj/ws/src/org/apache/axis2/saaj/util/SAAJUtil.java>:[108,8] error: cannot find symbol

[ERROR]  class SAAJUtil
<https://builds.apache.org/job/Axis2/org.apache.axis2$axis2-saaj/ws/src/org/apache/axis2/saaj/util/SAAJUtil.java>:[108,48] error: cannot find symbol

[INFO] 3 errors 
[INFO] -------------------------------------------------------------

---------------------------------------------------------------------
To unsubscribe, e-mail: java-dev-unsubscribe@axis.apache.org
For additional commands, e-mail: java-dev-help@axis.apache.org


Jenkins build is back to normal : Axis2 » Apache Axis2 - SAAJ #3466

Posted by Apache Jenkins Server <je...@builds.apache.org>.
See <https://builds.apache.org/job/Axis2/org.apache.axis2$axis2-saaj/3466/changes>


---------------------------------------------------------------------
To unsubscribe, e-mail: java-dev-unsubscribe@axis.apache.org
For additional commands, e-mail: java-dev-help@axis.apache.org