You are viewing a plain text version of this content. The canonical link for it is here.
Posted to dev@oozie.apache.org by Apache Jenkins Server <je...@builds.apache.org> on 2016/10/31 20:14:09 UTC
Build failed in Jenkins: oozie-trunk-precommit-build #3416
See <https://builds.apache.org/job/oozie-trunk-precommit-build/3416/>
------------------------------------------
[...truncated 12144 lines...]
[INFO] Copying 3 resources
[INFO]
[INFO] --- maven-compiler-plugin:2.3.2:testCompile (default-testCompile) @ oozie-mini ---
[INFO] Nothing to compile - all classes are up to date
[INFO]
[INFO] --- maven-surefire-plugin:2.12.2:test (default-test) @ oozie-mini ---
[INFO] Tests are skipped.
[INFO]
[INFO] --- maven-jar-plugin:2.3.1:jar (default-jar) @ oozie-mini ---
[INFO] Building jar: <https://builds.apache.org/job/oozie-trunk-precommit-build/ws/minitest/target/oozie-mini-4.4.0-SNAPSHOT.jar>
[INFO]
[INFO] --- maven-site-plugin:2.0-beta-6:attach-descriptor (attach-descriptor) @ oozie-mini ---
[INFO]
[INFO] --- maven-assembly-plugin:2.2.1:single (default-cli) @ oozie-mini ---
[INFO] Reading assembly descriptor: src/main/assemblies/empty.xml
[INFO]
[INFO] ------------------------------------------------------------------------
[INFO] Building Apache Oozie Distro 4.4.0-SNAPSHOT
[INFO] ------------------------------------------------------------------------
[INFO]
[INFO] --- maven-remote-resources-plugin:1.5:process (default) @ oozie-distro ---
[INFO]
[INFO] --- maven-resources-plugin:2.5:resources (default-resources) @ oozie-distro ---
[debug] execute contextualize
[INFO] Using 'UTF-8' encoding to copy filtered resources.
[INFO] skip non existing resourceDirectory <https://builds.apache.org/job/oozie-trunk-precommit-build/ws/distro/src/main/resources>
[INFO] Copying 3 resources
[INFO]
[INFO] --- maven-compiler-plugin:2.3.2:compile (default-compile) @ oozie-distro ---
[INFO] No sources to compile
[INFO]
[INFO] --- maven-resources-plugin:2.5:testResources (default-testResources) @ oozie-distro ---
[debug] execute contextualize
[INFO] Using 'UTF-8' encoding to copy filtered resources.
[INFO] skip non existing resourceDirectory <https://builds.apache.org/job/oozie-trunk-precommit-build/ws/distro/src/test/resources>
[INFO] Copying 3 resources
[INFO]
[INFO] --- maven-compiler-plugin:2.3.2:testCompile (default-testCompile) @ oozie-distro ---
[INFO] No sources to compile
[INFO]
[INFO] --- maven-surefire-plugin:2.12.2:test (default-test) @ oozie-distro ---
[INFO] Tests are skipped.
[INFO]
[INFO] --- maven-jar-plugin:2.3.1:jar (default-jar) @ oozie-distro ---
[INFO] Building jar: <https://builds.apache.org/job/oozie-trunk-precommit-build/ws/distro/target/oozie-distro-4.4.0-SNAPSHOT.jar>
[INFO]
[INFO] --- maven-site-plugin:2.0-beta-6:attach-descriptor (attach-descriptor) @ oozie-distro ---
[INFO]
[INFO] --- maven-antrun-plugin:1.6:run (default) @ oozie-distro ---
[INFO] Executing tasks
main:
[get] Destination already exists (skipping): <https://builds.apache.org/job/oozie-trunk-precommit-build/ws/distro/downloads/tomcat-6.0.44.tar.gz>
[delete] Deleting directory <https://builds.apache.org/job/oozie-trunk-precommit-build/ws/distro/target/tomcat>
[mkdir] Created dir: <https://builds.apache.org/job/oozie-trunk-precommit-build/ws/distro/target/tomcat>
[gunzip] Expanding <https://builds.apache.org/job/oozie-trunk-precommit-build/ws/distro/downloads/tomcat-6.0.44.tar.gz> to <https://builds.apache.org/job/oozie-trunk-precommit-build/ws/distro/target/tomcat/tomcat-6.0.44.tar>
[untar] Expanding: <https://builds.apache.org/job/oozie-trunk-precommit-build/ws/distro/target/tomcat/tomcat-6.0.44.tar> into <https://builds.apache.org/job/oozie-trunk-precommit-build/ws/distro/target/tomcat>
[delete] Deleting directory <https://builds.apache.org/job/oozie-trunk-precommit-build/ws/distro/target/tomcat/oozie-server/webapps>
[mkdir] Created dir: <https://builds.apache.org/job/oozie-trunk-precommit-build/ws/distro/target/tomcat/oozie-server/webapps>
[delete] Deleting: <https://builds.apache.org/job/oozie-trunk-precommit-build/ws/distro/target/tomcat/oozie-server/conf/server.xml>
[copy] Copying 1 file to <https://builds.apache.org/job/oozie-trunk-precommit-build/ws/distro/target/tomcat/oozie-server/conf>
[copy] Copying 1 file to <https://builds.apache.org/job/oozie-trunk-precommit-build/ws/distro/target/tomcat/oozie-server/conf>
[mkdir] Created dir: <https://builds.apache.org/job/oozie-trunk-precommit-build/ws/distro/target/tomcat/oozie-server/conf/ssl>
[copy] Copying 1 file to <https://builds.apache.org/job/oozie-trunk-precommit-build/ws/distro/target/tomcat/oozie-server/conf/ssl>
[copy] Copying 1 file to <https://builds.apache.org/job/oozie-trunk-precommit-build/ws/distro/target/tomcat/oozie-server/conf/ssl>
[copy] Copying 1 file to <https://builds.apache.org/job/oozie-trunk-precommit-build/ws/distro/target/tomcat/oozie-server/conf/ssl>
[copy] Copying 3 files to <https://builds.apache.org/job/oozie-trunk-precommit-build/ws/distro/target/tomcat/oozie-server/webapps/ROOT>
[INFO] Executed tasks
[INFO]
[INFO] --- maven-assembly-plugin:2.2.1:single (default-cli) @ oozie-distro ---
[INFO] Reading assembly descriptor: ../src/main/assemblies/distro.xml
[INFO] Copying files to <https://builds.apache.org/job/oozie-trunk-precommit-build/ws/distro/target/oozie-4.4.0-SNAPSHOT-distro>
[WARNING] Assembly file: <https://builds.apache.org/job/oozie-trunk-precommit-build/ws/distro/target/oozie-4.4.0-SNAPSHOT-distro> is not a regular file (it may be a directory). It cannot be attached to the project build for installation or deployment.
[INFO] Building tar : <https://builds.apache.org/job/oozie-trunk-precommit-build/ws/distro/target/oozie-4.4.0-SNAPSHOT-distro.tar.gz>
[INFO]
[INFO] ------------------------------------------------------------------------
[INFO] Building Apache Oozie ZooKeeper Security Tests 4.4.0-SNAPSHOT
[INFO] ------------------------------------------------------------------------
[INFO]
[INFO] --- maven-remote-resources-plugin:1.5:process (default) @ oozie-zookeeper-security-tests ---
[INFO]
[INFO] --- maven-resources-plugin:2.5:resources (default-resources) @ oozie-zookeeper-security-tests ---
[debug] execute contextualize
[INFO] Using 'UTF-8' encoding to copy filtered resources.
[INFO] skip non existing resourceDirectory <https://builds.apache.org/job/oozie-trunk-precommit-build/ws/zookeeper-security-tests/src/main/resources>
[INFO] Copying 3 resources
[INFO]
[INFO] --- maven-compiler-plugin:2.3.2:compile (default-compile) @ oozie-zookeeper-security-tests ---
[INFO] No sources to compile
[INFO]
[INFO] --- maven-resources-plugin:2.5:testResources (default-testResources) @ oozie-zookeeper-security-tests ---
[debug] execute contextualize
[INFO] Using 'UTF-8' encoding to copy filtered resources.
[INFO] skip non existing resourceDirectory <https://builds.apache.org/job/oozie-trunk-precommit-build/ws/zookeeper-security-tests/src/test/resources>
[INFO] Copying 3 resources
[INFO]
[INFO] --- maven-compiler-plugin:2.3.2:testCompile (default-testCompile) @ oozie-zookeeper-security-tests ---
[INFO] Nothing to compile - all classes are up to date
[INFO]
[INFO] --- maven-surefire-plugin:2.12.2:test (default-test) @ oozie-zookeeper-security-tests ---
[INFO] Tests are skipped.
[INFO]
[INFO] --- maven-jar-plugin:2.3.1:jar (default-jar) @ oozie-zookeeper-security-tests ---
[INFO] Building jar: <https://builds.apache.org/job/oozie-trunk-precommit-build/ws/zookeeper-security-tests/target/oozie-zookeeper-security-tests-4.4.0-SNAPSHOT.jar>
[INFO]
[INFO] --- maven-site-plugin:2.0-beta-6:attach-descriptor (attach-descriptor) @ oozie-zookeeper-security-tests ---
[INFO]
[INFO] --- maven-assembly-plugin:2.2.1:single (default-cli) @ oozie-zookeeper-security-tests ---
[INFO] Reading assembly descriptor: src/main/assemblies/empty.xml
[INFO] ------------------------------------------------------------------------
[INFO] Reactor Summary:
[INFO]
[INFO] Apache Oozie Main .................................. SUCCESS [ 1.555 s]
[INFO] Apache Oozie Hadoop Utils hadoop-2-4.4.0-SNAPSHOT .. SUCCESS [ 2.397 s]
[INFO] Apache Oozie Hadoop Distcp hadoop-2-4.4.0-SNAPSHOT . SUCCESS [ 0.185 s]
[INFO] Apache Oozie Hadoop Auth hadoop-2-4.4.0-SNAPSHOT Test SUCCESS [ 0.336 s]
[INFO] Apache Oozie Hadoop Libs ........................... SUCCESS [ 0.025 s]
[INFO] Apache Oozie Client ................................ SUCCESS [ 25.059 s]
[INFO] Apache Oozie Share Lib Oozie ....................... SUCCESS [ 1.858 s]
[INFO] Apache Oozie Share Lib HCatalog .................... SUCCESS [ 1.927 s]
[INFO] Apache Oozie Share Lib Distcp ...................... SUCCESS [ 0.386 s]
[INFO] Apache Oozie Core .................................. SUCCESS [ 41.276 s]
[INFO] Apache Oozie Share Lib Streaming ................... SUCCESS [ 2.878 s]
[INFO] Apache Oozie Share Lib Pig ......................... SUCCESS [ 2.587 s]
[INFO] Apache Oozie Share Lib Hive ........................ SUCCESS [ 4.942 s]
[INFO] Apache Oozie Share Lib Hive 2 ...................... SUCCESS [ 4.059 s]
[INFO] Apache Oozie Share Lib Sqoop ....................... SUCCESS [ 0.577 s]
[INFO] Apache Oozie Examples .............................. SUCCESS [ 2.383 s]
[INFO] Apache Oozie Share Lib Spark ....................... SUCCESS [ 6.180 s]
[INFO] Apache Oozie Share Lib ............................. SUCCESS [ 23.113 s]
[INFO] Apache Oozie Docs .................................. SUCCESS [ 11.906 s]
[INFO] Apache Oozie WebApp ................................ SUCCESS [ 36.134 s]
[INFO] Apache Oozie Tools ................................. SUCCESS [ 1.458 s]
[INFO] Apache Oozie MiniOozie ............................. SUCCESS [ 0.692 s]
[INFO] Apache Oozie Distro ................................ SUCCESS [ 41.293 s]
[INFO] Apache Oozie ZooKeeper Security Tests .............. SUCCESS [ 2.520 s]
[INFO] ------------------------------------------------------------------------
[INFO] BUILD SUCCESS
[INFO] ------------------------------------------------------------------------
[INFO] Total time: 03:37 min
[INFO] Finished at: 2016-10-31T20:12:07+00:00
[INFO] Final Memory: 86M/986M
[INFO] ------------------------------------------------------------------------
Reports
Running test-patch task CLEAN
Running test-patch task RAW_PATCH_ANALYSIS
Running test-patch task RAT
Running test-patch task JAVADOC
Running test-patch task COMPILE
Running test-patch task FINDBUGS_DIFF
[TRACE] Folder [/home/jenkins/jenkins-slave/workspace/oozie-trunk-postcommit-build@2/test-patch/tmp/FINDBUGS_DIFF/pre/client/target/findbugs/] does not exist, creating
[TRACE] XML file [/home/jenkins/jenkins-slave/workspace/oozie-trunk-postcommit-build@2/test-patch/tmp/FINDBUGS_DIFF/pre/client/target/findbugs/findbugsXml.xml] does not exist, creating
[TRACE] Folder [/home/jenkins/jenkins-slave/workspace/oozie-trunk-postcommit-build@2/test-patch/tmp/FINDBUGS_DIFF/pre/core/target/findbugs/] does not exist, creating
[TRACE] XML file [/home/jenkins/jenkins-slave/workspace/oozie-trunk-postcommit-build@2/test-patch/tmp/FINDBUGS_DIFF/pre/core/target/findbugs/findbugsXml.xml] does not exist, creating
[TRACE] Folder [/home/jenkins/jenkins-slave/workspace/oozie-trunk-postcommit-build@2/test-patch/tmp/FINDBUGS_DIFF/pre/docs/target/findbugs/] does not exist, creating
[TRACE] XML file [/home/jenkins/jenkins-slave/workspace/oozie-trunk-postcommit-build@2/test-patch/tmp/FINDBUGS_DIFF/pre/docs/target/findbugs/findbugsXml.xml] does not exist, creating
[TRACE] Folder [/home/jenkins/jenkins-slave/workspace/oozie-trunk-postcommit-build@2/test-patch/tmp/FINDBUGS_DIFF/pre/hadooplibs/hadoop-utils-2/target/findbugs/] does not exist, creating
[TRACE] XML file [/home/jenkins/jenkins-slave/workspace/oozie-trunk-postcommit-build@2/test-patch/tmp/FINDBUGS_DIFF/pre/hadooplibs/hadoop-utils-2/target/findbugs/findbugsXml.xml] does not exist, creating
[TRACE] Folder [/home/jenkins/jenkins-slave/workspace/oozie-trunk-postcommit-build@2/test-patch/tmp/FINDBUGS_DIFF/pre/tools/target/findbugs/] does not exist, creating
[TRACE] XML file [/home/jenkins/jenkins-slave/workspace/oozie-trunk-postcommit-build@2/test-patch/tmp/FINDBUGS_DIFF/pre/tools/target/findbugs/findbugsXml.xml] does not exist, creating
[TRACE] Folder [/home/jenkins/jenkins-slave/workspace/oozie-trunk-postcommit-build@2/test-patch/tmp/FINDBUGS_DIFF/pre/examples/target/findbugs/] does not exist, creating
[TRACE] XML file [/home/jenkins/jenkins-slave/workspace/oozie-trunk-postcommit-build@2/test-patch/tmp/FINDBUGS_DIFF/pre/examples/target/findbugs/findbugsXml.xml] does not exist, creating
[TRACE] Folder [/home/jenkins/jenkins-slave/workspace/oozie-trunk-postcommit-build@2/test-patch/tmp/FINDBUGS_DIFF/pre/sharelib/streaming/target/findbugs/] does not exist, creating
[TRACE] XML file [/home/jenkins/jenkins-slave/workspace/oozie-trunk-postcommit-build@2/test-patch/tmp/FINDBUGS_DIFF/pre/sharelib/streaming/target/findbugs/findbugsXml.xml] does not exist, creating
[TRACE] Folder [/home/jenkins/jenkins-slave/workspace/oozie-trunk-postcommit-build@2/test-patch/tmp/FINDBUGS_DIFF/pre/sharelib/sqoop/target/findbugs/] does not exist, creating
[TRACE] XML file [/home/jenkins/jenkins-slave/workspace/oozie-trunk-postcommit-build@2/test-patch/tmp/FINDBUGS_DIFF/pre/sharelib/sqoop/target/findbugs/findbugsXml.xml] does not exist, creating
[TRACE] Folder [/home/jenkins/jenkins-slave/workspace/oozie-trunk-postcommit-build@2/test-patch/tmp/FINDBUGS_DIFF/pre/sharelib/distcp/target/findbugs/] does not exist, creating
[TRACE] XML file [/home/jenkins/jenkins-slave/workspace/oozie-trunk-postcommit-build@2/test-patch/tmp/FINDBUGS_DIFF/pre/sharelib/distcp/target/findbugs/findbugsXml.xml] does not exist, creating
[TRACE] Folder [/home/jenkins/jenkins-slave/workspace/oozie-trunk-postcommit-build@2/test-patch/tmp/FINDBUGS_DIFF/pre/sharelib/oozie/target/findbugs/] does not exist, creating
[TRACE] XML file [/home/jenkins/jenkins-slave/workspace/oozie-trunk-postcommit-build@2/test-patch/tmp/FINDBUGS_DIFF/pre/sharelib/oozie/target/findbugs/findbugsXml.xml] does not exist, creating
[TRACE] Folder [/home/jenkins/jenkins-slave/workspace/oozie-trunk-postcommit-build@2/test-patch/tmp/FINDBUGS_DIFF/pre/sharelib/hcatalog/target/findbugs/] does not exist, creating
[TRACE] XML file [/home/jenkins/jenkins-slave/workspace/oozie-trunk-postcommit-build@2/test-patch/tmp/FINDBUGS_DIFF/pre/sharelib/hcatalog/target/findbugs/findbugsXml.xml] does not exist, creating
[TRACE] Folder [/home/jenkins/jenkins-slave/workspace/oozie-trunk-postcommit-build@2/test-patch/tmp/FINDBUGS_DIFF/pre/sharelib/hive/target/findbugs/] does not exist, creating
[TRACE] XML file [/home/jenkins/jenkins-slave/workspace/oozie-trunk-postcommit-build@2/test-patch/tmp/FINDBUGS_DIFF/pre/sharelib/hive/target/findbugs/findbugsXml.xml] does not exist, creating
[TRACE] Folder [/home/jenkins/jenkins-slave/workspace/oozie-trunk-postcommit-build@2/test-patch/tmp/FINDBUGS_DIFF/pre/sharelib/hive2/target/findbugs/] does not exist, creating
[TRACE] XML file [/home/jenkins/jenkins-slave/workspace/oozie-trunk-postcommit-build@2/test-patch/tmp/FINDBUGS_DIFF/pre/sharelib/hive2/target/findbugs/findbugsXml.xml] does not exist, creating
[TRACE] Folder [/home/jenkins/jenkins-slave/workspace/oozie-trunk-postcommit-build@2/test-patch/tmp/FINDBUGS_DIFF/pre/sharelib/pig/target/findbugs/] does not exist, creating
[TRACE] XML file [/home/jenkins/jenkins-slave/workspace/oozie-trunk-postcommit-build@2/test-patch/tmp/FINDBUGS_DIFF/pre/sharelib/pig/target/findbugs/findbugsXml.xml] does not exist, creating
[TRACE] Folder [/home/jenkins/jenkins-slave/workspace/oozie-trunk-postcommit-build@2/test-patch/tmp/FINDBUGS_DIFF/pre/sharelib/spark/target/findbugs/] does not exist, creating
[TRACE] XML file [/home/jenkins/jenkins-slave/workspace/oozie-trunk-postcommit-build@2/test-patch/tmp/FINDBUGS_DIFF/pre/sharelib/spark/target/findbugs/findbugsXml.xml] does not exist, creating
[TRACE] Downloading FindBugs diff JAR from https://repo1.maven.org/maven2/me/andrz/findbugs/findbugs-diff/0.1.0/findbugs-diff-0.1.0-all.jar
[TRACE] FindBugs diff JAR downloaded
[ERROR] FindBugs diff JAR has a weird MD5 sum, rejecting
[TRACE] File [<https://builds.apache.org/job/oozie-trunk-precommit-build/ws/test-patch/tmp/FINDBUGS_DIFF/diff/findbugs-diff-0.1.0-all.jar]> removed
[TRACE] File [<https://builds.apache.org/job/oozie-trunk-precommit-build/ws/test-patch/tmp/FINDBUGS_DIFF/diff/findbugs-diff-0.1.0-all.jar.md5]> removed
Running test-patch task BACKWARDS_COMPATIBILITY
Running test-patch task TESTS
Running test-patch task DISTRO
Testing JIRA OOZIE-1459
Cleaning local git workspace
----------------------------
+1 PATCH_APPLIES
+1 CLEAN
-1 RAW_PATCH_ANALYSIS
+1 the patch does not introduce any @author tags
+1 the patch does not introduce any tabs
+1 the patch does not introduce any trailing spaces
+1 the patch does not introduce any line longer than 132
-1 the patch does not add/modify any testcase
+1 RAT
+1 the patch does not seem to introduce new RAT warnings
+1 JAVADOC
+1 the patch does not seem to introduce new Javadoc warnings
+1 COMPILE
+1 HEAD compiles
+1 patch compiles
+1 the patch does not seem to introduce new javac warnings
-1 FindBugs diff JAR has a weird MD5 sum, rejecting.
+1 BACKWARDS_COMPATIBILITY
+1 the patch does not change any JPA Entity/Colum/Basic/Lob/Transient annotations
+1 the patch does not modify JPA files
-1 TESTS
Tests run: 1815
Tests failed: 5
Tests errors: 3
The patch failed the following testcases:
testMain(org.apache.oozie.action.hadoop.TestHiveMain)
testPigScript(org.apache.oozie.action.hadoop.TestPigMain)
testEmbeddedPigWithinPython(org.apache.oozie.action.hadoop.TestPigMain)
testPig_withNullExternalID(org.apache.oozie.action.hadoop.TestPigMain)
testPigScript(org.apache.oozie.action.hadoop.TestPigMainWithOldAPI)
+1 DISTRO
+1 distro tarball builds with the patch
----------------------------
-1 Overall result, please check the reported -1(s)
The full output of the test-patch run is available at
https://builds.apache.org/job/oozie-trunk-precommit-build/3416/
Adding comment to JIRA
Comment added.
test-patch exit code: 1
Build step 'Execute shell' marked build as failure
Archiving artifacts
Recording test results
Build failed in Jenkins: oozie-trunk-precommit-build #3429
Posted by Apache Jenkins Server <je...@builds.apache.org>.
See <https://builds.apache.org/job/oozie-trunk-precommit-build/3429/>
------------------------------------------
[...truncated 12036 lines...]
[INFO] Copying 11 resources
[INFO] Copying 3 resources
[INFO]
[INFO] --- maven-compiler-plugin:2.3.2:testCompile (default-testCompile) @ oozie-tools ---
[INFO] Nothing to compile - all classes are up to date
[INFO]
[INFO] --- maven-surefire-plugin:2.12.2:test (default-test) @ oozie-tools ---
[INFO] Tests are skipped.
[INFO]
[INFO] --- maven-jar-plugin:2.3.1:jar (default-jar) @ oozie-tools ---
[INFO] Building jar: <https://builds.apache.org/job/oozie-trunk-precommit-build/ws/tools/target/oozie-tools-4.4.0-SNAPSHOT.jar>
[INFO]
[INFO] --- maven-site-plugin:2.0-beta-6:attach-descriptor (attach-descriptor) @ oozie-tools ---
[INFO]
[INFO] --- maven-assembly-plugin:2.2.1:single (default-cli) @ oozie-tools ---
[INFO] Reading assembly descriptor: ../src/main/assemblies/tools.xml
[WARNING] The following patterns were never triggered in this artifact exclusion filter:
o '*:*:pom:*'
[INFO] Copying files to <https://builds.apache.org/job/oozie-trunk-precommit-build/ws/tools/target/oozie-tools-4.4.0-SNAPSHOT-tools>
[WARNING] Assembly file: <https://builds.apache.org/job/oozie-trunk-precommit-build/ws/tools/target/oozie-tools-4.4.0-SNAPSHOT-tools> is not a regular file (it may be a directory). It cannot be attached to the project build for installation or deployment.
[INFO]
[INFO] ------------------------------------------------------------------------
[INFO] Building Apache Oozie MiniOozie 4.4.0-SNAPSHOT
[INFO] ------------------------------------------------------------------------
[INFO]
[INFO] --- maven-remote-resources-plugin:1.5:process (default) @ oozie-mini ---
[INFO]
[INFO] --- maven-resources-plugin:2.5:resources (default-resources) @ oozie-mini ---
[debug] execute contextualize
[INFO] Using 'UTF-8' encoding to copy filtered resources.
[INFO] skip non existing resourceDirectory <https://builds.apache.org/job/oozie-trunk-precommit-build/ws/minitest/src/main/resources>
[INFO] Copying 3 resources
[INFO]
[INFO] --- maven-compiler-plugin:2.3.2:compile (default-compile) @ oozie-mini ---
[INFO] No sources to compile
[INFO]
[INFO] --- maven-resources-plugin:2.5:testResources (default-testResources) @ oozie-mini ---
[debug] execute contextualize
[INFO] Using 'UTF-8' encoding to copy filtered resources.
[INFO] Copying 3 resources
[INFO] Copying 3 resources
[INFO]
[INFO] --- maven-compiler-plugin:2.3.2:testCompile (default-testCompile) @ oozie-mini ---
[INFO] Nothing to compile - all classes are up to date
[INFO]
[INFO] --- maven-surefire-plugin:2.12.2:test (default-test) @ oozie-mini ---
[INFO] Tests are skipped.
[INFO]
[INFO] --- maven-jar-plugin:2.3.1:jar (default-jar) @ oozie-mini ---
[INFO] Building jar: <https://builds.apache.org/job/oozie-trunk-precommit-build/ws/minitest/target/oozie-mini-4.4.0-SNAPSHOT.jar>
[INFO]
[INFO] --- maven-site-plugin:2.0-beta-6:attach-descriptor (attach-descriptor) @ oozie-mini ---
[INFO]
[INFO] --- maven-assembly-plugin:2.2.1:single (default-cli) @ oozie-mini ---
[INFO] Reading assembly descriptor: src/main/assemblies/empty.xml
[INFO]
[INFO] ------------------------------------------------------------------------
[INFO] Building Apache Oozie Distro 4.4.0-SNAPSHOT
[INFO] ------------------------------------------------------------------------
[INFO]
[INFO] --- maven-remote-resources-plugin:1.5:process (default) @ oozie-distro ---
[INFO]
[INFO] --- maven-resources-plugin:2.5:resources (default-resources) @ oozie-distro ---
[debug] execute contextualize
[INFO] Using 'UTF-8' encoding to copy filtered resources.
[INFO] skip non existing resourceDirectory <https://builds.apache.org/job/oozie-trunk-precommit-build/ws/distro/src/main/resources>
[INFO] Copying 3 resources
[INFO]
[INFO] --- maven-compiler-plugin:2.3.2:compile (default-compile) @ oozie-distro ---
[INFO] No sources to compile
[INFO]
[INFO] --- maven-resources-plugin:2.5:testResources (default-testResources) @ oozie-distro ---
[debug] execute contextualize
[INFO] Using 'UTF-8' encoding to copy filtered resources.
[INFO] skip non existing resourceDirectory <https://builds.apache.org/job/oozie-trunk-precommit-build/ws/distro/src/test/resources>
[INFO] Copying 3 resources
[INFO]
[INFO] --- maven-compiler-plugin:2.3.2:testCompile (default-testCompile) @ oozie-distro ---
[INFO] No sources to compile
[INFO]
[INFO] --- maven-surefire-plugin:2.12.2:test (default-test) @ oozie-distro ---
[INFO] Tests are skipped.
[INFO]
[INFO] --- maven-jar-plugin:2.3.1:jar (default-jar) @ oozie-distro ---
[INFO] Building jar: <https://builds.apache.org/job/oozie-trunk-precommit-build/ws/distro/target/oozie-distro-4.4.0-SNAPSHOT.jar>
[INFO]
[INFO] --- maven-site-plugin:2.0-beta-6:attach-descriptor (attach-descriptor) @ oozie-distro ---
[INFO]
[INFO] --- maven-antrun-plugin:1.6:run (default) @ oozie-distro ---
[INFO] Executing tasks
main:
[get] Destination already exists (skipping): <https://builds.apache.org/job/oozie-trunk-precommit-build/ws/distro/downloads/tomcat-6.0.44.tar.gz>
[delete] Deleting directory <https://builds.apache.org/job/oozie-trunk-precommit-build/ws/distro/target/tomcat>
[mkdir] Created dir: <https://builds.apache.org/job/oozie-trunk-precommit-build/ws/distro/target/tomcat>
[gunzip] Expanding <https://builds.apache.org/job/oozie-trunk-precommit-build/ws/distro/downloads/tomcat-6.0.44.tar.gz> to <https://builds.apache.org/job/oozie-trunk-precommit-build/ws/distro/target/tomcat/tomcat-6.0.44.tar>
[untar] Expanding: <https://builds.apache.org/job/oozie-trunk-precommit-build/ws/distro/target/tomcat/tomcat-6.0.44.tar> into <https://builds.apache.org/job/oozie-trunk-precommit-build/ws/distro/target/tomcat>
[delete] Deleting directory <https://builds.apache.org/job/oozie-trunk-precommit-build/ws/distro/target/tomcat/oozie-server/webapps>
[mkdir] Created dir: <https://builds.apache.org/job/oozie-trunk-precommit-build/ws/distro/target/tomcat/oozie-server/webapps>
[delete] Deleting: <https://builds.apache.org/job/oozie-trunk-precommit-build/ws/distro/target/tomcat/oozie-server/conf/server.xml>
[copy] Copying 1 file to <https://builds.apache.org/job/oozie-trunk-precommit-build/ws/distro/target/tomcat/oozie-server/conf>
[copy] Copying 1 file to <https://builds.apache.org/job/oozie-trunk-precommit-build/ws/distro/target/tomcat/oozie-server/conf>
[mkdir] Created dir: <https://builds.apache.org/job/oozie-trunk-precommit-build/ws/distro/target/tomcat/oozie-server/conf/ssl>
[copy] Copying 1 file to <https://builds.apache.org/job/oozie-trunk-precommit-build/ws/distro/target/tomcat/oozie-server/conf/ssl>
[copy] Copying 1 file to <https://builds.apache.org/job/oozie-trunk-precommit-build/ws/distro/target/tomcat/oozie-server/conf/ssl>
[copy] Copying 1 file to <https://builds.apache.org/job/oozie-trunk-precommit-build/ws/distro/target/tomcat/oozie-server/conf/ssl>
[copy] Copying 3 files to <https://builds.apache.org/job/oozie-trunk-precommit-build/ws/distro/target/tomcat/oozie-server/webapps/ROOT>
[INFO] Executed tasks
[INFO]
[INFO] --- maven-assembly-plugin:2.2.1:single (default-cli) @ oozie-distro ---
[INFO] Reading assembly descriptor: ../src/main/assemblies/distro.xml
[INFO] Copying files to <https://builds.apache.org/job/oozie-trunk-precommit-build/ws/distro/target/oozie-4.4.0-SNAPSHOT-distro>
[WARNING] Assembly file: <https://builds.apache.org/job/oozie-trunk-precommit-build/ws/distro/target/oozie-4.4.0-SNAPSHOT-distro> is not a regular file (it may be a directory). It cannot be attached to the project build for installation or deployment.
[INFO] Building tar : <https://builds.apache.org/job/oozie-trunk-precommit-build/ws/distro/target/oozie-4.4.0-SNAPSHOT-distro.tar.gz>
[INFO]
[INFO] ------------------------------------------------------------------------
[INFO] Building Apache Oozie ZooKeeper Security Tests 4.4.0-SNAPSHOT
[INFO] ------------------------------------------------------------------------
[INFO]
[INFO] --- maven-remote-resources-plugin:1.5:process (default) @ oozie-zookeeper-security-tests ---
[INFO]
[INFO] --- maven-resources-plugin:2.5:resources (default-resources) @ oozie-zookeeper-security-tests ---
[debug] execute contextualize
[INFO] Using 'UTF-8' encoding to copy filtered resources.
[INFO] skip non existing resourceDirectory <https://builds.apache.org/job/oozie-trunk-precommit-build/ws/zookeeper-security-tests/src/main/resources>
[INFO] Copying 3 resources
[INFO]
[INFO] --- maven-compiler-plugin:2.3.2:compile (default-compile) @ oozie-zookeeper-security-tests ---
[INFO] No sources to compile
[INFO]
[INFO] --- maven-resources-plugin:2.5:testResources (default-testResources) @ oozie-zookeeper-security-tests ---
[debug] execute contextualize
[INFO] Using 'UTF-8' encoding to copy filtered resources.
[INFO] skip non existing resourceDirectory <https://builds.apache.org/job/oozie-trunk-precommit-build/ws/zookeeper-security-tests/src/test/resources>
[INFO] Copying 3 resources
[INFO]
[INFO] --- maven-compiler-plugin:2.3.2:testCompile (default-testCompile) @ oozie-zookeeper-security-tests ---
[INFO] Nothing to compile - all classes are up to date
[INFO]
[INFO] --- maven-surefire-plugin:2.12.2:test (default-test) @ oozie-zookeeper-security-tests ---
[INFO] Tests are skipped.
[INFO]
[INFO] --- maven-jar-plugin:2.3.1:jar (default-jar) @ oozie-zookeeper-security-tests ---
[INFO] Building jar: <https://builds.apache.org/job/oozie-trunk-precommit-build/ws/zookeeper-security-tests/target/oozie-zookeeper-security-tests-4.4.0-SNAPSHOT.jar>
[INFO]
[INFO] --- maven-site-plugin:2.0-beta-6:attach-descriptor (attach-descriptor) @ oozie-zookeeper-security-tests ---
[INFO]
[INFO] --- maven-assembly-plugin:2.2.1:single (default-cli) @ oozie-zookeeper-security-tests ---
[INFO] Reading assembly descriptor: src/main/assemblies/empty.xml
[INFO] ------------------------------------------------------------------------
[INFO] Reactor Summary:
[INFO]
[INFO] Apache Oozie Main .................................. SUCCESS [ 1.779 s]
[INFO] Apache Oozie Hadoop Utils hadoop-2-4.4.0-SNAPSHOT .. SUCCESS [ 2.297 s]
[INFO] Apache Oozie Hadoop Distcp hadoop-2-4.4.0-SNAPSHOT . SUCCESS [ 0.154 s]
[INFO] Apache Oozie Hadoop Auth hadoop-2-4.4.0-SNAPSHOT Test SUCCESS [ 0.327 s]
[INFO] Apache Oozie Hadoop Libs ........................... SUCCESS [ 0.027 s]
[INFO] Apache Oozie Client ................................ SUCCESS [ 26.053 s]
[INFO] Apache Oozie Share Lib Oozie ....................... SUCCESS [ 2.123 s]
[INFO] Apache Oozie Share Lib HCatalog .................... SUCCESS [ 2.107 s]
[INFO] Apache Oozie Share Lib Distcp ...................... SUCCESS [ 0.374 s]
[INFO] Apache Oozie Core .................................. SUCCESS [ 43.528 s]
[INFO] Apache Oozie Share Lib Streaming ................... SUCCESS [ 3.548 s]
[INFO] Apache Oozie Share Lib Pig ......................... SUCCESS [ 2.636 s]
[INFO] Apache Oozie Share Lib Hive ........................ SUCCESS [ 5.162 s]
[INFO] Apache Oozie Share Lib Hive 2 ...................... SUCCESS [ 4.223 s]
[INFO] Apache Oozie Share Lib Sqoop ....................... SUCCESS [ 0.582 s]
[INFO] Apache Oozie Examples .............................. SUCCESS [ 2.232 s]
[INFO] Apache Oozie Share Lib Spark ....................... SUCCESS [ 5.904 s]
[INFO] Apache Oozie Share Lib ............................. SUCCESS [ 23.265 s]
[INFO] Apache Oozie Docs .................................. SUCCESS [ 13.169 s]
[INFO] Apache Oozie WebApp ................................ SUCCESS [ 35.729 s]
[INFO] Apache Oozie Tools ................................. SUCCESS [ 1.213 s]
[INFO] Apache Oozie MiniOozie ............................. SUCCESS [ 0.678 s]
[INFO] Apache Oozie Distro ................................ SUCCESS [ 41.746 s]
[INFO] Apache Oozie ZooKeeper Security Tests .............. SUCCESS [ 2.638 s]
[INFO] ------------------------------------------------------------------------
[INFO] BUILD SUCCESS
[INFO] ------------------------------------------------------------------------
[INFO] Total time: 03:43 min
[INFO] Finished at: 2016-11-10T17:59:15+00:00
[INFO] Final Memory: 86M/1004M
[INFO] ------------------------------------------------------------------------
Reports
Running test-patch task CLEAN
Running test-patch task RAW_PATCH_ANALYSIS
Running test-patch task RAT
Running test-patch task JAVADOC
Running test-patch task COMPILE
Running test-patch task FINDBUGS_DIFF
[TRACE] Downloading FindBugs diff JAR from https://repo1.maven.org/maven2/me/andrz/findbugs/findbugs-diff/0.1.0/findbugs-diff-0.1.0-all.jar
[TRACE] FindBugs diff JAR downloaded
[ERROR] FindBugs diff JAR has a weird MD5 sum, rejecting
[TRACE] File [<https://builds.apache.org/job/oozie-trunk-precommit-build/ws/test-patch/tmp/FINDBUGS_DIFF/diff/findbugs-diff-0.1.0-all.jar]> removed
[TRACE] File [<https://builds.apache.org/job/oozie-trunk-precommit-build/ws/test-patch/tmp/FINDBUGS_DIFF/diff/findbugs-diff-0.1.0-all.jar.md5]> removed
Running test-patch task BACKWARDS_COMPATIBILITY
Running test-patch task TESTS
Running test-patch task DISTRO
Testing JIRA OOZIE-2731
Cleaning local git workspace
----------------------------
+1 PATCH_APPLIES
+1 CLEAN
+1 RAW_PATCH_ANALYSIS
+1 the patch does not introduce any @author tags
+1 the patch does not introduce any tabs
+1 the patch does not introduce any trailing spaces
+1 the patch does not introduce any line longer than 132
+1 the patch does adds/modifies 1 testcase(s)
+1 RAT
+1 the patch does not seem to introduce new RAT warnings
+1 JAVADOC
+1 the patch does not seem to introduce new Javadoc warnings
+1 COMPILE
+1 HEAD compiles
+1 patch compiles
+1 the patch does not seem to introduce new javac warnings
-1 FindBugs diff JAR has a weird MD5 sum, rejecting.
+1 BACKWARDS_COMPATIBILITY
+1 the patch does not change any JPA Entity/Colum/Basic/Lob/Transient annotations
+1 the patch does not modify JPA files
+1 TESTS
Tests run: 1818
+1 DISTRO
+1 distro tarball builds with the patch
----------------------------
-1 Overall result, please check the reported -1(s)
The full output of the test-patch run is available at
https://builds.apache.org/job/oozie-trunk-precommit-build/3429/
Adding comment to JIRA
Comment added.
test-patch exit code: 1
Build step 'Execute shell' marked build as failure
Archiving artifacts
Recording test results
Build failed in Jenkins: oozie-trunk-precommit-build #3428
Posted by Apache Jenkins Server <je...@builds.apache.org>.
See <https://builds.apache.org/job/oozie-trunk-precommit-build/3428/>
------------------------------------------
[...truncated 12047 lines...]
[INFO] Copying 11 resources
[INFO] Copying 3 resources
[INFO]
[INFO] --- maven-compiler-plugin:2.3.2:testCompile (default-testCompile) @ oozie-tools ---
[INFO] Nothing to compile - all classes are up to date
[INFO]
[INFO] --- maven-surefire-plugin:2.12.2:test (default-test) @ oozie-tools ---
[INFO] Tests are skipped.
[INFO]
[INFO] --- maven-jar-plugin:2.3.1:jar (default-jar) @ oozie-tools ---
[INFO] Building jar: <https://builds.apache.org/job/oozie-trunk-precommit-build/ws/tools/target/oozie-tools-4.4.0-SNAPSHOT.jar>
[INFO]
[INFO] --- maven-site-plugin:2.0-beta-6:attach-descriptor (attach-descriptor) @ oozie-tools ---
[INFO]
[INFO] --- maven-assembly-plugin:2.2.1:single (default-cli) @ oozie-tools ---
[INFO] Reading assembly descriptor: ../src/main/assemblies/tools.xml
[WARNING] The following patterns were never triggered in this artifact exclusion filter:
o '*:*:pom:*'
[INFO] Copying files to <https://builds.apache.org/job/oozie-trunk-precommit-build/ws/tools/target/oozie-tools-4.4.0-SNAPSHOT-tools>
[WARNING] Assembly file: <https://builds.apache.org/job/oozie-trunk-precommit-build/ws/tools/target/oozie-tools-4.4.0-SNAPSHOT-tools> is not a regular file (it may be a directory). It cannot be attached to the project build for installation or deployment.
[INFO]
[INFO] ------------------------------------------------------------------------
[INFO] Building Apache Oozie MiniOozie 4.4.0-SNAPSHOT
[INFO] ------------------------------------------------------------------------
[INFO]
[INFO] --- maven-remote-resources-plugin:1.5:process (default) @ oozie-mini ---
[INFO]
[INFO] --- maven-resources-plugin:2.5:resources (default-resources) @ oozie-mini ---
[debug] execute contextualize
[INFO] Using 'UTF-8' encoding to copy filtered resources.
[INFO] skip non existing resourceDirectory <https://builds.apache.org/job/oozie-trunk-precommit-build/ws/minitest/src/main/resources>
[INFO] Copying 3 resources
[INFO]
[INFO] --- maven-compiler-plugin:2.3.2:compile (default-compile) @ oozie-mini ---
[INFO] No sources to compile
[INFO]
[INFO] --- maven-resources-plugin:2.5:testResources (default-testResources) @ oozie-mini ---
[debug] execute contextualize
[INFO] Using 'UTF-8' encoding to copy filtered resources.
[INFO] Copying 3 resources
[INFO] Copying 3 resources
[INFO]
[INFO] --- maven-compiler-plugin:2.3.2:testCompile (default-testCompile) @ oozie-mini ---
[INFO] Nothing to compile - all classes are up to date
[INFO]
[INFO] --- maven-surefire-plugin:2.12.2:test (default-test) @ oozie-mini ---
[INFO] Tests are skipped.
[INFO]
[INFO] --- maven-jar-plugin:2.3.1:jar (default-jar) @ oozie-mini ---
[INFO] Building jar: <https://builds.apache.org/job/oozie-trunk-precommit-build/ws/minitest/target/oozie-mini-4.4.0-SNAPSHOT.jar>
[INFO]
[INFO] --- maven-site-plugin:2.0-beta-6:attach-descriptor (attach-descriptor) @ oozie-mini ---
[INFO]
[INFO] --- maven-assembly-plugin:2.2.1:single (default-cli) @ oozie-mini ---
[INFO] Reading assembly descriptor: src/main/assemblies/empty.xml
[INFO]
[INFO] ------------------------------------------------------------------------
[INFO] Building Apache Oozie Distro 4.4.0-SNAPSHOT
[INFO] ------------------------------------------------------------------------
[INFO]
[INFO] --- maven-remote-resources-plugin:1.5:process (default) @ oozie-distro ---
[INFO]
[INFO] --- maven-resources-plugin:2.5:resources (default-resources) @ oozie-distro ---
[debug] execute contextualize
[INFO] Using 'UTF-8' encoding to copy filtered resources.
[INFO] skip non existing resourceDirectory <https://builds.apache.org/job/oozie-trunk-precommit-build/ws/distro/src/main/resources>
[INFO] Copying 3 resources
[INFO]
[INFO] --- maven-compiler-plugin:2.3.2:compile (default-compile) @ oozie-distro ---
[INFO] No sources to compile
[INFO]
[INFO] --- maven-resources-plugin:2.5:testResources (default-testResources) @ oozie-distro ---
[debug] execute contextualize
[INFO] Using 'UTF-8' encoding to copy filtered resources.
[INFO] skip non existing resourceDirectory <https://builds.apache.org/job/oozie-trunk-precommit-build/ws/distro/src/test/resources>
[INFO] Copying 3 resources
[INFO]
[INFO] --- maven-compiler-plugin:2.3.2:testCompile (default-testCompile) @ oozie-distro ---
[INFO] No sources to compile
[INFO]
[INFO] --- maven-surefire-plugin:2.12.2:test (default-test) @ oozie-distro ---
[INFO] Tests are skipped.
[INFO]
[INFO] --- maven-jar-plugin:2.3.1:jar (default-jar) @ oozie-distro ---
[INFO] Building jar: <https://builds.apache.org/job/oozie-trunk-precommit-build/ws/distro/target/oozie-distro-4.4.0-SNAPSHOT.jar>
[INFO]
[INFO] --- maven-site-plugin:2.0-beta-6:attach-descriptor (attach-descriptor) @ oozie-distro ---
[INFO]
[INFO] --- maven-antrun-plugin:1.6:run (default) @ oozie-distro ---
[INFO] Executing tasks
main:
[get] Destination already exists (skipping): <https://builds.apache.org/job/oozie-trunk-precommit-build/ws/distro/downloads/tomcat-6.0.44.tar.gz>
[delete] Deleting directory <https://builds.apache.org/job/oozie-trunk-precommit-build/ws/distro/target/tomcat>
[mkdir] Created dir: <https://builds.apache.org/job/oozie-trunk-precommit-build/ws/distro/target/tomcat>
[gunzip] Expanding <https://builds.apache.org/job/oozie-trunk-precommit-build/ws/distro/downloads/tomcat-6.0.44.tar.gz> to <https://builds.apache.org/job/oozie-trunk-precommit-build/ws/distro/target/tomcat/tomcat-6.0.44.tar>
[untar] Expanding: <https://builds.apache.org/job/oozie-trunk-precommit-build/ws/distro/target/tomcat/tomcat-6.0.44.tar> into <https://builds.apache.org/job/oozie-trunk-precommit-build/ws/distro/target/tomcat>
[delete] Deleting directory <https://builds.apache.org/job/oozie-trunk-precommit-build/ws/distro/target/tomcat/oozie-server/webapps>
[mkdir] Created dir: <https://builds.apache.org/job/oozie-trunk-precommit-build/ws/distro/target/tomcat/oozie-server/webapps>
[delete] Deleting: <https://builds.apache.org/job/oozie-trunk-precommit-build/ws/distro/target/tomcat/oozie-server/conf/server.xml>
[copy] Copying 1 file to <https://builds.apache.org/job/oozie-trunk-precommit-build/ws/distro/target/tomcat/oozie-server/conf>
[copy] Copying 1 file to <https://builds.apache.org/job/oozie-trunk-precommit-build/ws/distro/target/tomcat/oozie-server/conf>
[mkdir] Created dir: <https://builds.apache.org/job/oozie-trunk-precommit-build/ws/distro/target/tomcat/oozie-server/conf/ssl>
[copy] Copying 1 file to <https://builds.apache.org/job/oozie-trunk-precommit-build/ws/distro/target/tomcat/oozie-server/conf/ssl>
[copy] Copying 1 file to <https://builds.apache.org/job/oozie-trunk-precommit-build/ws/distro/target/tomcat/oozie-server/conf/ssl>
[copy] Copying 1 file to <https://builds.apache.org/job/oozie-trunk-precommit-build/ws/distro/target/tomcat/oozie-server/conf/ssl>
[copy] Copying 3 files to <https://builds.apache.org/job/oozie-trunk-precommit-build/ws/distro/target/tomcat/oozie-server/webapps/ROOT>
[INFO] Executed tasks
[INFO]
[INFO] --- maven-assembly-plugin:2.2.1:single (default-cli) @ oozie-distro ---
[INFO] Reading assembly descriptor: ../src/main/assemblies/distro.xml
[INFO] Copying files to <https://builds.apache.org/job/oozie-trunk-precommit-build/ws/distro/target/oozie-4.4.0-SNAPSHOT-distro>
[WARNING] Assembly file: <https://builds.apache.org/job/oozie-trunk-precommit-build/ws/distro/target/oozie-4.4.0-SNAPSHOT-distro> is not a regular file (it may be a directory). It cannot be attached to the project build for installation or deployment.
[INFO] Building tar : <https://builds.apache.org/job/oozie-trunk-precommit-build/ws/distro/target/oozie-4.4.0-SNAPSHOT-distro.tar.gz>
[INFO]
[INFO] ------------------------------------------------------------------------
[INFO] Building Apache Oozie ZooKeeper Security Tests 4.4.0-SNAPSHOT
[INFO] ------------------------------------------------------------------------
[INFO]
[INFO] --- maven-remote-resources-plugin:1.5:process (default) @ oozie-zookeeper-security-tests ---
[INFO]
[INFO] --- maven-resources-plugin:2.5:resources (default-resources) @ oozie-zookeeper-security-tests ---
[debug] execute contextualize
[INFO] Using 'UTF-8' encoding to copy filtered resources.
[INFO] skip non existing resourceDirectory <https://builds.apache.org/job/oozie-trunk-precommit-build/ws/zookeeper-security-tests/src/main/resources>
[INFO] Copying 3 resources
[INFO]
[INFO] --- maven-compiler-plugin:2.3.2:compile (default-compile) @ oozie-zookeeper-security-tests ---
[INFO] No sources to compile
[INFO]
[INFO] --- maven-resources-plugin:2.5:testResources (default-testResources) @ oozie-zookeeper-security-tests ---
[debug] execute contextualize
[INFO] Using 'UTF-8' encoding to copy filtered resources.
[INFO] skip non existing resourceDirectory <https://builds.apache.org/job/oozie-trunk-precommit-build/ws/zookeeper-security-tests/src/test/resources>
[INFO] Copying 3 resources
[INFO]
[INFO] --- maven-compiler-plugin:2.3.2:testCompile (default-testCompile) @ oozie-zookeeper-security-tests ---
[INFO] Nothing to compile - all classes are up to date
[INFO]
[INFO] --- maven-surefire-plugin:2.12.2:test (default-test) @ oozie-zookeeper-security-tests ---
[INFO] Tests are skipped.
[INFO]
[INFO] --- maven-jar-plugin:2.3.1:jar (default-jar) @ oozie-zookeeper-security-tests ---
[INFO] Building jar: <https://builds.apache.org/job/oozie-trunk-precommit-build/ws/zookeeper-security-tests/target/oozie-zookeeper-security-tests-4.4.0-SNAPSHOT.jar>
[INFO]
[INFO] --- maven-site-plugin:2.0-beta-6:attach-descriptor (attach-descriptor) @ oozie-zookeeper-security-tests ---
[INFO]
[INFO] --- maven-assembly-plugin:2.2.1:single (default-cli) @ oozie-zookeeper-security-tests ---
[INFO] Reading assembly descriptor: src/main/assemblies/empty.xml
[INFO] ------------------------------------------------------------------------
[INFO] Reactor Summary:
[INFO]
[INFO] Apache Oozie Main .................................. SUCCESS [ 1.595 s]
[INFO] Apache Oozie Hadoop Utils hadoop-2-4.4.0-SNAPSHOT .. SUCCESS [ 2.266 s]
[INFO] Apache Oozie Hadoop Distcp hadoop-2-4.4.0-SNAPSHOT . SUCCESS [ 0.154 s]
[INFO] Apache Oozie Hadoop Auth hadoop-2-4.4.0-SNAPSHOT Test SUCCESS [ 0.288 s]
[INFO] Apache Oozie Hadoop Libs ........................... SUCCESS [ 0.026 s]
[INFO] Apache Oozie Client ................................ SUCCESS [ 25.221 s]
[INFO] Apache Oozie Share Lib Oozie ....................... SUCCESS [ 1.835 s]
[INFO] Apache Oozie Share Lib HCatalog .................... SUCCESS [ 1.915 s]
[INFO] Apache Oozie Share Lib Distcp ...................... SUCCESS [ 0.404 s]
[INFO] Apache Oozie Core .................................. SUCCESS [ 44.573 s]
[INFO] Apache Oozie Share Lib Streaming ................... SUCCESS [ 2.821 s]
[INFO] Apache Oozie Share Lib Pig ......................... SUCCESS [ 2.545 s]
[INFO] Apache Oozie Share Lib Hive ........................ SUCCESS [ 4.866 s]
[INFO] Apache Oozie Share Lib Hive 2 ...................... SUCCESS [ 4.086 s]
[INFO] Apache Oozie Share Lib Sqoop ....................... SUCCESS [ 0.589 s]
[INFO] Apache Oozie Examples .............................. SUCCESS [ 2.296 s]
[INFO] Apache Oozie Share Lib Spark ....................... SUCCESS [ 5.747 s]
[INFO] Apache Oozie Share Lib ............................. SUCCESS [ 23.313 s]
[INFO] Apache Oozie Docs .................................. SUCCESS [ 12.934 s]
[INFO] Apache Oozie WebApp ................................ SUCCESS [ 36.581 s]
[INFO] Apache Oozie Tools ................................. SUCCESS [ 1.362 s]
[INFO] Apache Oozie MiniOozie ............................. SUCCESS [ 0.680 s]
[INFO] Apache Oozie Distro ................................ SUCCESS [ 41.041 s]
[INFO] Apache Oozie ZooKeeper Security Tests .............. SUCCESS [ 2.476 s]
[INFO] ------------------------------------------------------------------------
[INFO] BUILD SUCCESS
[INFO] ------------------------------------------------------------------------
[INFO] Total time: 03:41 min
[INFO] Finished at: 2016-11-10T17:40:38+00:00
[INFO] Final Memory: 86M/976M
[INFO] ------------------------------------------------------------------------
Reports
Running test-patch task CLEAN
Running test-patch task RAW_PATCH_ANALYSIS
Running test-patch task RAT
Running test-patch task JAVADOC
Running test-patch task COMPILE
Running test-patch task FINDBUGS_DIFF
[TRACE] Downloading FindBugs diff JAR from https://repo1.maven.org/maven2/me/andrz/findbugs/findbugs-diff/0.1.0/findbugs-diff-0.1.0-all.jar
[TRACE] FindBugs diff JAR downloaded
[ERROR] FindBugs diff JAR has a weird MD5 sum, rejecting
[TRACE] File [<https://builds.apache.org/job/oozie-trunk-precommit-build/ws/test-patch/tmp/FINDBUGS_DIFF/diff/findbugs-diff-0.1.0-all.jar]> removed
[TRACE] File [<https://builds.apache.org/job/oozie-trunk-precommit-build/ws/test-patch/tmp/FINDBUGS_DIFF/diff/findbugs-diff-0.1.0-all.jar.md5]> removed
Running test-patch task BACKWARDS_COMPATIBILITY
Running test-patch task TESTS
Running test-patch task DISTRO
Testing JIRA OOZIE-2733
Cleaning local git workspace
----------------------------
+1 PATCH_APPLIES
+1 CLEAN
-1 RAW_PATCH_ANALYSIS
+1 the patch does not introduce any @author tags
+1 the patch does not introduce any tabs
+1 the patch does not introduce any trailing spaces
+1 the patch does not introduce any line longer than 132
-1 the patch does not add/modify any testcase
+1 RAT
+1 the patch does not seem to introduce new RAT warnings
+1 JAVADOC
+1 the patch does not seem to introduce new Javadoc warnings
+1 COMPILE
+1 HEAD compiles
+1 patch compiles
+1 the patch does not seem to introduce new javac warnings
-1 FindBugs diff JAR has a weird MD5 sum, rejecting.
+1 BACKWARDS_COMPATIBILITY
+1 the patch does not change any JPA Entity/Colum/Basic/Lob/Transient annotations
+1 the patch does not modify JPA files
+1 TESTS
Tests run: 1818
+1 DISTRO
+1 distro tarball builds with the patch
----------------------------
-1 Overall result, please check the reported -1(s)
The full output of the test-patch run is available at
https://builds.apache.org/job/oozie-trunk-precommit-build/3428/
Adding comment to JIRA
Comment added.
test-patch exit code: 1
Build step 'Execute shell' marked build as failure
Archiving artifacts
Recording test results
Build failed in Jenkins: oozie-trunk-precommit-build #3427
Posted by Apache Jenkins Server <je...@builds.apache.org>.
See <https://builds.apache.org/job/oozie-trunk-precommit-build/3427/>
------------------------------------------
[...truncated 22037 lines...]
[INFO] --- maven-jar-plugin:2.3.1:jar (default-jar) @ oozie-tools ---
[INFO] Building jar: <https://builds.apache.org/job/oozie-trunk-precommit-build/ws/tools/target/oozie-tools-4.4.0-SNAPSHOT.jar>
[INFO]
[INFO] --- maven-site-plugin:2.0-beta-6:attach-descriptor (attach-descriptor) @ oozie-tools ---
[INFO]
[INFO] --- maven-assembly-plugin:2.2.1:single (default-cli) @ oozie-tools ---
[INFO] Reading assembly descriptor: ../src/main/assemblies/tools.xml
[WARNING] The following patterns were never triggered in this artifact exclusion filter:
o '*:*:pom:*'
[INFO] Copying files to <https://builds.apache.org/job/oozie-trunk-precommit-build/ws/tools/target/oozie-tools-4.4.0-SNAPSHOT-tools>
[WARNING] Assembly file: <https://builds.apache.org/job/oozie-trunk-precommit-build/ws/tools/target/oozie-tools-4.4.0-SNAPSHOT-tools> is not a regular file (it may be a directory). It cannot be attached to the project build for installation or deployment.
[INFO]
[INFO] ------------------------------------------------------------------------
[INFO] Building Apache Oozie MiniOozie 4.4.0-SNAPSHOT
[INFO] ------------------------------------------------------------------------
[INFO]
[INFO] --- maven-remote-resources-plugin:1.5:process (default) @ oozie-mini ---
[INFO]
[INFO] --- maven-resources-plugin:2.5:resources (default-resources) @ oozie-mini ---
[debug] execute contextualize
[INFO] Using 'UTF-8' encoding to copy filtered resources.
[INFO] skip non existing resourceDirectory <https://builds.apache.org/job/oozie-trunk-precommit-build/ws/minitest/src/main/resources>
[INFO] Copying 3 resources
[INFO]
[INFO] --- maven-compiler-plugin:2.3.2:compile (default-compile) @ oozie-mini ---
[INFO] No sources to compile
[INFO]
[INFO] --- maven-resources-plugin:2.5:testResources (default-testResources) @ oozie-mini ---
[debug] execute contextualize
[INFO] Using 'UTF-8' encoding to copy filtered resources.
[INFO] Copying 3 resources
[INFO] Copying 3 resources
[INFO]
[INFO] --- maven-compiler-plugin:2.3.2:testCompile (default-testCompile) @ oozie-mini ---
[INFO] Nothing to compile - all classes are up to date
[INFO]
[INFO] --- maven-surefire-plugin:2.12.2:test (default-test) @ oozie-mini ---
[INFO] Tests are skipped.
[INFO]
[INFO] --- maven-jar-plugin:2.3.1:jar (default-jar) @ oozie-mini ---
[INFO] Building jar: <https://builds.apache.org/job/oozie-trunk-precommit-build/ws/minitest/target/oozie-mini-4.4.0-SNAPSHOT.jar>
[INFO]
[INFO] --- maven-site-plugin:2.0-beta-6:attach-descriptor (attach-descriptor) @ oozie-mini ---
[INFO]
[INFO] --- maven-assembly-plugin:2.2.1:single (default-cli) @ oozie-mini ---
[INFO] Reading assembly descriptor: src/main/assemblies/empty.xml
[INFO]
[INFO] ------------------------------------------------------------------------
[INFO] Building Apache Oozie Distro 4.4.0-SNAPSHOT
[INFO] ------------------------------------------------------------------------
[INFO]
[INFO] --- maven-remote-resources-plugin:1.5:process (default) @ oozie-distro ---
[INFO]
[INFO] --- maven-resources-plugin:2.5:resources (default-resources) @ oozie-distro ---
[debug] execute contextualize
[INFO] Using 'UTF-8' encoding to copy filtered resources.
[INFO] skip non existing resourceDirectory <https://builds.apache.org/job/oozie-trunk-precommit-build/ws/distro/src/main/resources>
[INFO] Copying 3 resources
[INFO]
[INFO] --- maven-compiler-plugin:2.3.2:compile (default-compile) @ oozie-distro ---
[INFO] No sources to compile
[INFO]
[INFO] --- maven-resources-plugin:2.5:testResources (default-testResources) @ oozie-distro ---
[debug] execute contextualize
[INFO] Using 'UTF-8' encoding to copy filtered resources.
[INFO] skip non existing resourceDirectory <https://builds.apache.org/job/oozie-trunk-precommit-build/ws/distro/src/test/resources>
[INFO] Copying 3 resources
[INFO]
[INFO] --- maven-compiler-plugin:2.3.2:testCompile (default-testCompile) @ oozie-distro ---
[INFO] No sources to compile
[INFO]
[INFO] --- maven-surefire-plugin:2.12.2:test (default-test) @ oozie-distro ---
[INFO] Tests are skipped.
[INFO]
[INFO] --- maven-jar-plugin:2.3.1:jar (default-jar) @ oozie-distro ---
[INFO] Building jar: <https://builds.apache.org/job/oozie-trunk-precommit-build/ws/distro/target/oozie-distro-4.4.0-SNAPSHOT.jar>
[INFO]
[INFO] --- maven-site-plugin:2.0-beta-6:attach-descriptor (attach-descriptor) @ oozie-distro ---
[INFO]
[INFO] --- maven-antrun-plugin:1.6:run (default) @ oozie-distro ---
[INFO] Executing tasks
main:
[get] Destination already exists (skipping): <https://builds.apache.org/job/oozie-trunk-precommit-build/ws/distro/downloads/tomcat-6.0.44.tar.gz>
[delete] Deleting directory <https://builds.apache.org/job/oozie-trunk-precommit-build/ws/distro/target/tomcat>
[mkdir] Created dir: <https://builds.apache.org/job/oozie-trunk-precommit-build/ws/distro/target/tomcat>
[gunzip] Expanding <https://builds.apache.org/job/oozie-trunk-precommit-build/ws/distro/downloads/tomcat-6.0.44.tar.gz> to <https://builds.apache.org/job/oozie-trunk-precommit-build/ws/distro/target/tomcat/tomcat-6.0.44.tar>
[untar] Expanding: <https://builds.apache.org/job/oozie-trunk-precommit-build/ws/distro/target/tomcat/tomcat-6.0.44.tar> into <https://builds.apache.org/job/oozie-trunk-precommit-build/ws/distro/target/tomcat>
[delete] Deleting directory <https://builds.apache.org/job/oozie-trunk-precommit-build/ws/distro/target/tomcat/oozie-server/webapps>
[mkdir] Created dir: <https://builds.apache.org/job/oozie-trunk-precommit-build/ws/distro/target/tomcat/oozie-server/webapps>
[delete] Deleting: <https://builds.apache.org/job/oozie-trunk-precommit-build/ws/distro/target/tomcat/oozie-server/conf/server.xml>
[copy] Copying 1 file to <https://builds.apache.org/job/oozie-trunk-precommit-build/ws/distro/target/tomcat/oozie-server/conf>
[copy] Copying 1 file to <https://builds.apache.org/job/oozie-trunk-precommit-build/ws/distro/target/tomcat/oozie-server/conf>
[mkdir] Created dir: <https://builds.apache.org/job/oozie-trunk-precommit-build/ws/distro/target/tomcat/oozie-server/conf/ssl>
[copy] Copying 1 file to <https://builds.apache.org/job/oozie-trunk-precommit-build/ws/distro/target/tomcat/oozie-server/conf/ssl>
[copy] Copying 1 file to <https://builds.apache.org/job/oozie-trunk-precommit-build/ws/distro/target/tomcat/oozie-server/conf/ssl>
[copy] Copying 1 file to <https://builds.apache.org/job/oozie-trunk-precommit-build/ws/distro/target/tomcat/oozie-server/conf/ssl>
[copy] Copying 3 files to <https://builds.apache.org/job/oozie-trunk-precommit-build/ws/distro/target/tomcat/oozie-server/webapps/ROOT>
[INFO] Executed tasks
[INFO]
[INFO] --- maven-assembly-plugin:2.2.1:single (default-cli) @ oozie-distro ---
[INFO] Reading assembly descriptor: ../src/main/assemblies/distro.xml
[INFO] Copying files to <https://builds.apache.org/job/oozie-trunk-precommit-build/ws/distro/target/oozie-4.4.0-SNAPSHOT-distro>
[WARNING] Assembly file: <https://builds.apache.org/job/oozie-trunk-precommit-build/ws/distro/target/oozie-4.4.0-SNAPSHOT-distro> is not a regular file (it may be a directory). It cannot be attached to the project build for installation or deployment.
[INFO] Building tar : <https://builds.apache.org/job/oozie-trunk-precommit-build/ws/distro/target/oozie-4.4.0-SNAPSHOT-distro.tar.gz>
[INFO]
[INFO] ------------------------------------------------------------------------
[INFO] Building Apache Oozie ZooKeeper Security Tests 4.4.0-SNAPSHOT
[INFO] ------------------------------------------------------------------------
[INFO]
[INFO] --- maven-remote-resources-plugin:1.5:process (default) @ oozie-zookeeper-security-tests ---
[INFO]
[INFO] --- maven-resources-plugin:2.5:resources (default-resources) @ oozie-zookeeper-security-tests ---
[debug] execute contextualize
[INFO] Using 'UTF-8' encoding to copy filtered resources.
[INFO] skip non existing resourceDirectory <https://builds.apache.org/job/oozie-trunk-precommit-build/ws/zookeeper-security-tests/src/main/resources>
[INFO] Copying 3 resources
[INFO]
[INFO] --- maven-compiler-plugin:2.3.2:compile (default-compile) @ oozie-zookeeper-security-tests ---
[INFO] No sources to compile
[INFO]
[INFO] --- maven-resources-plugin:2.5:testResources (default-testResources) @ oozie-zookeeper-security-tests ---
[debug] execute contextualize
[INFO] Using 'UTF-8' encoding to copy filtered resources.
[INFO] skip non existing resourceDirectory <https://builds.apache.org/job/oozie-trunk-precommit-build/ws/zookeeper-security-tests/src/test/resources>
[INFO] Copying 3 resources
[INFO]
[INFO] --- maven-compiler-plugin:2.3.2:testCompile (default-testCompile) @ oozie-zookeeper-security-tests ---
[INFO] Nothing to compile - all classes are up to date
[INFO]
[INFO] --- maven-surefire-plugin:2.12.2:test (default-test) @ oozie-zookeeper-security-tests ---
[INFO] Tests are skipped.
[INFO]
[INFO] --- maven-jar-plugin:2.3.1:jar (default-jar) @ oozie-zookeeper-security-tests ---
[INFO] Building jar: <https://builds.apache.org/job/oozie-trunk-precommit-build/ws/zookeeper-security-tests/target/oozie-zookeeper-security-tests-4.4.0-SNAPSHOT.jar>
[INFO]
[INFO] --- maven-site-plugin:2.0-beta-6:attach-descriptor (attach-descriptor) @ oozie-zookeeper-security-tests ---
[INFO]
[INFO] --- maven-assembly-plugin:2.2.1:single (default-cli) @ oozie-zookeeper-security-tests ---
[INFO] Reading assembly descriptor: src/main/assemblies/empty.xml
[INFO] ------------------------------------------------------------------------
[INFO] Reactor Summary:
[INFO]
[INFO] Apache Oozie Main .................................. SUCCESS [ 1.458 s]
[INFO] Apache Oozie Hadoop Utils hadoop-2-4.4.0-SNAPSHOT .. SUCCESS [ 2.365 s]
[INFO] Apache Oozie Hadoop Distcp hadoop-2-4.4.0-SNAPSHOT . SUCCESS [ 0.152 s]
[INFO] Apache Oozie Hadoop Auth hadoop-2-4.4.0-SNAPSHOT Test SUCCESS [ 0.324 s]
[INFO] Apache Oozie Hadoop Libs ........................... SUCCESS [ 0.025 s]
[INFO] Apache Oozie Client ................................ SUCCESS [ 27.053 s]
[INFO] Apache Oozie Share Lib Oozie ....................... SUCCESS [ 1.799 s]
[INFO] Apache Oozie Share Lib HCatalog .................... SUCCESS [ 2.119 s]
[INFO] Apache Oozie Share Lib Distcp ...................... SUCCESS [ 0.396 s]
[INFO] Apache Oozie Core .................................. SUCCESS [ 45.222 s]
[INFO] Apache Oozie Share Lib Streaming ................... SUCCESS [ 3.221 s]
[INFO] Apache Oozie Share Lib Pig ......................... SUCCESS [ 2.383 s]
[INFO] Apache Oozie Share Lib Hive ........................ SUCCESS [ 4.288 s]
[INFO] Apache Oozie Share Lib Hive 2 ...................... SUCCESS [ 3.445 s]
[INFO] Apache Oozie Share Lib Sqoop ....................... SUCCESS [ 0.562 s]
[INFO] Apache Oozie Examples .............................. SUCCESS [ 2.059 s]
[INFO] Apache Oozie Share Lib Spark ....................... SUCCESS [ 5.410 s]
[INFO] Apache Oozie Share Lib ............................. SUCCESS [ 21.894 s]
[INFO] Apache Oozie Docs .................................. SUCCESS [ 11.811 s]
[INFO] Apache Oozie WebApp ................................ SUCCESS [ 38.516 s]
[INFO] Apache Oozie Tools ................................. SUCCESS [ 1.224 s]
[INFO] Apache Oozie MiniOozie ............................. SUCCESS [ 0.657 s]
[INFO] Apache Oozie Distro ................................ SUCCESS [ 37.868 s]
[INFO] Apache Oozie ZooKeeper Security Tests .............. SUCCESS [ 2.304 s]
[INFO] ------------------------------------------------------------------------
[INFO] BUILD SUCCESS
[INFO] ------------------------------------------------------------------------
[INFO] Total time: 03:38 min
[INFO] Finished at: 2016-11-10T02:25:46+00:00
[INFO] Final Memory: 86M/923M
[INFO] ------------------------------------------------------------------------
Reports
Running test-patch task CLEAN
Running test-patch task RAW_PATCH_ANALYSIS
Running test-patch task RAT
Running test-patch task JAVADOC
Running test-patch task COMPILE
Running test-patch task FINDBUGS_DIFF
[TRACE] Downloading FindBugs diff JAR from https://repo1.maven.org/maven2/me/andrz/findbugs/findbugs-diff/0.1.0/findbugs-diff-0.1.0-all.jar
[TRACE] FindBugs diff JAR downloaded
[ERROR] FindBugs diff JAR has a weird MD5 sum, rejecting
[TRACE] File [<https://builds.apache.org/job/oozie-trunk-precommit-build/ws/test-patch/tmp/FINDBUGS_DIFF/diff/findbugs-diff-0.1.0-all.jar]> removed
[TRACE] File [<https://builds.apache.org/job/oozie-trunk-precommit-build/ws/test-patch/tmp/FINDBUGS_DIFF/diff/findbugs-diff-0.1.0-all.jar.md5]> removed
Running test-patch task BACKWARDS_COMPATIBILITY
Running test-patch task TESTS
Running test-patch task DISTRO
Testing JIRA OOZIE-2726
Cleaning local git workspace
----------------------------
+1 PATCH_APPLIES
+1 CLEAN
+1 RAW_PATCH_ANALYSIS
+1 the patch does not introduce any @author tags
+1 the patch does not introduce any tabs
+1 the patch does not introduce any trailing spaces
+1 the patch does not introduce any line longer than 132
+1 the patch does adds/modifies 1 testcase(s)
+1 RAT
+1 the patch does not seem to introduce new RAT warnings
+1 JAVADOC
+1 the patch does not seem to introduce new Javadoc warnings
+1 COMPILE
+1 HEAD compiles
+1 patch compiles
+1 the patch does not seem to introduce new javac warnings
-1 FindBugs diff JAR has a weird MD5 sum, rejecting.
+1 BACKWARDS_COMPATIBILITY
+1 the patch does not change any JPA Entity/Colum/Basic/Lob/Transient annotations
+1 the patch does not modify JPA files
-1 TESTS
Tests run: 1818
Tests failed: 3
Tests errors: 0
The patch failed the following testcases:
testActionKillCommandActionNumbers(org.apache.oozie.command.coord.TestCoordActionsKillXCommand)
testActionMaterWithDST1(org.apache.oozie.command.coord.TestCoordMaterializeTransitionXCommand)
testActionMaterWithDST2(org.apache.oozie.command.coord.TestCoordMaterializeTransitionXCommand)
+1 DISTRO
+1 distro tarball builds with the patch
----------------------------
-1 Overall result, please check the reported -1(s)
The full output of the test-patch run is available at
https://builds.apache.org/job/oozie-trunk-precommit-build/3427/
Adding comment to JIRA
Comment added.
test-patch exit code: 1
Build step 'Execute shell' marked build as failure
Archiving artifacts
Recording test results
Build failed in Jenkins: oozie-trunk-precommit-build #3426
Posted by Apache Jenkins Server <je...@builds.apache.org>.
See <https://builds.apache.org/job/oozie-trunk-precommit-build/3426/>
------------------------------------------
[...truncated 14611 lines...]
[WARNING] Entry: oozie-4.4.0-SNAPSHOT/embedded-oozie-server/webapp/docs/core/apidocs/src-html/org/apache/oozie/command/coord/CoordActionTimeOutXCommand.html longer than 100 characters.
[WARNING] Entry: oozie-4.4.0-SNAPSHOT/embedded-oozie-server/webapp/docs/core/apidocs/src-html/org/apache/oozie/command/coord/CoordCommandUtils.html longer than 100 characters.
[WARNING] Entry: oozie-4.4.0-SNAPSHOT/embedded-oozie-server/webapp/docs/core/apidocs/src-html/org/apache/oozie/command/coord/CoordPauseXCommand.html longer than 100 characters.
[WARNING] Entry: oozie-4.4.0-SNAPSHOT/embedded-oozie-server/webapp/docs/core/apidocs/src-html/org/apache/oozie/command/coord/CoordRerunXCommand.html longer than 100 characters.
[WARNING] Entry: oozie-4.4.0-SNAPSHOT/embedded-oozie-server/webapp/docs/core/apidocs/src-html/org/apache/oozie/command/coord/CoordPushDependencyCheckXCommand.html longer than 100 characters.
[WARNING] Entry: oozie-4.4.0-SNAPSHOT/embedded-oozie-server/webapp/docs/core/apidocs/src-html/org/apache/oozie/command/coord/CoordStatusTransitXCommand.html longer than 100 characters.
[WARNING] Entry: oozie-4.4.0-SNAPSHOT/embedded-oozie-server/webapp/docs/core/apidocs/src-html/org/apache/oozie/command/coord/CoordUpdateXCommand.html longer than 100 characters.
[WARNING] Entry: oozie-4.4.0-SNAPSHOT/embedded-oozie-server/webapp/docs/core/apidocs/src-html/org/apache/oozie/command/coord/CoordSubmitXCommand.html longer than 100 characters.
[WARNING] Entry: oozie-4.4.0-SNAPSHOT/embedded-oozie-server/webapp/docs/core/apidocs/src-html/org/apache/oozie/command/coord/SLAEventsXCommand.html longer than 100 characters.
[WARNING] Entry: oozie-4.4.0-SNAPSHOT/embedded-oozie-server/webapp/docs/core/apidocs/src-html/org/apache/oozie/command/coord/CoordSLAChangeXCommand.html longer than 100 characters.
[WARNING] Entry: oozie-4.4.0-SNAPSHOT/embedded-oozie-server/webapp/docs/core/apidocs/src-html/org/apache/oozie/command/coord/CoordChangeXCommand.html longer than 100 characters.
[WARNING] Entry: oozie-4.4.0-SNAPSHOT/embedded-oozie-server/webapp/docs/core/apidocs/src-html/org/apache/oozie/command/coord/CoordJobXCommand.html longer than 100 characters.
[WARNING] Entry: oozie-4.4.0-SNAPSHOT/embedded-oozie-server/webapp/docs/core/apidocs/src-html/org/apache/oozie/command/coord/CoordSLAAlertsDisableXCommand.html longer than 100 characters.
[WARNING] Entry: oozie-4.4.0-SNAPSHOT/embedded-oozie-server/webapp/docs/core/apidocs/src-html/org/apache/oozie/command/coord/CoordinatorXCommand.html longer than 100 characters.
[WARNING] Entry: oozie-4.4.0-SNAPSHOT/embedded-oozie-server/webapp/docs/core/apidocs/src-html/org/apache/oozie/command/coord/CoordActionInputCheckXCommand.html longer than 100 characters.
[WARNING] Entry: oozie-4.4.0-SNAPSHOT/embedded-oozie-server/webapp/docs/core/apidocs/src-html/org/apache/oozie/command/coord/CoordResumeXCommand.html longer than 100 characters.
[WARNING] Entry: oozie-4.4.0-SNAPSHOT/embedded-oozie-server/webapp/docs/core/apidocs/src-html/org/apache/oozie/command/coord/CoordSLAAlertsXCommand.html longer than 100 characters.
[WARNING] Entry: oozie-4.4.0-SNAPSHOT/embedded-oozie-server/webapp/docs/core/apidocs/src-html/org/apache/oozie/command/coord/CoordSLAAlertsEnableXCommand.html longer than 100 characters.
[WARNING] Entry: oozie-4.4.0-SNAPSHOT/embedded-oozie-server/webapp/docs/core/apidocs/src-html/org/apache/oozie/command/coord/CoordActionCheckXCommand.html longer than 100 characters.
[WARNING] Entry: oozie-4.4.0-SNAPSHOT/embedded-oozie-server/webapp/docs/core/apidocs/src-html/org/apache/oozie/command/coord/CoordActionsKillXCommand.html longer than 100 characters.
[WARNING] Entry: oozie-4.4.0-SNAPSHOT/embedded-oozie-server/webapp/docs/core/apidocs/src-html/org/apache/oozie/command/coord/CoordUnpauseXCommand.html longer than 100 characters.
[WARNING] Entry: oozie-4.4.0-SNAPSHOT/embedded-oozie-server/webapp/docs/core/apidocs/src-html/org/apache/oozie/command/coord/CoordSuspendXCommand.html longer than 100 characters.
[WARNING] Entry: oozie-4.4.0-SNAPSHOT/embedded-oozie-server/webapp/docs/core/apidocs/src-html/org/apache/oozie/command/coord/CoordActionReadyXCommand.html longer than 100 characters.
[WARNING] Entry: oozie-4.4.0-SNAPSHOT/embedded-oozie-server/webapp/docs/core/apidocs/src-html/org/apache/oozie/command/coord/CoordActionStartXCommand.html longer than 100 characters.
[WARNING] Entry: oozie-4.4.0-SNAPSHOT/embedded-oozie-server/webapp/docs/core/apidocs/src-html/org/apache/oozie/command/coord/CoordActionUpdateXCommand.html longer than 100 characters.
[WARNING] Entry: oozie-4.4.0-SNAPSHOT/embedded-oozie-server/webapp/docs/core/apidocs/src-html/org/apache/oozie/command/coord/CoordKillXCommand.html longer than 100 characters.
[WARNING] Entry: oozie-4.4.0-SNAPSHOT/embedded-oozie-server/webapp/docs/core/apidocs/src-html/org/apache/oozie/command/coord/CoordActionSkipXCommand.html longer than 100 characters.
[WARNING] Entry: oozie-4.4.0-SNAPSHOT/embedded-oozie-server/webapp/docs/core/apidocs/src-html/org/apache/oozie/command/TransitionXCommand.html longer than 100 characters.
[WARNING] Entry: oozie-4.4.0-SNAPSHOT/embedded-oozie-server/webapp/docs/core/apidocs/src-html/org/apache/oozie/command/IgnoreTransitionXCommand.html longer than 100 characters.
[WARNING] Entry: oozie-4.4.0-SNAPSHOT/embedded-oozie-server/webapp/docs/core/apidocs/src-html/org/apache/oozie/command/BulkJobsXCommand.html longer than 100 characters.
[WARNING] Entry: oozie-4.4.0-SNAPSHOT/embedded-oozie-server/webapp/docs/core/apidocs/src-html/org/apache/oozie/command/RerunTransitionXCommand.html longer than 100 characters.
[WARNING] Entry: oozie-4.4.0-SNAPSHOT/embedded-oozie-server/webapp/docs/core/apidocs/src-html/org/apache/oozie/command/KillTransitionXCommand.html longer than 100 characters.
[WARNING] Entry: oozie-4.4.0-SNAPSHOT/embedded-oozie-server/webapp/docs/core/apidocs/src-html/org/apache/oozie/command/SuspendTransitionXCommand.html longer than 100 characters.
[WARNING] Entry: oozie-4.4.0-SNAPSHOT/embedded-oozie-server/webapp/docs/core/apidocs/src-html/org/apache/oozie/command/StatusTransitXCommand.html longer than 100 characters.
[WARNING] Entry: oozie-4.4.0-SNAPSHOT/embedded-oozie-server/webapp/docs/core/apidocs/src-html/org/apache/oozie/command/PreconditionException.html longer than 100 characters.
[WARNING] Entry: oozie-4.4.0-SNAPSHOT/embedded-oozie-server/webapp/docs/core/apidocs/src-html/org/apache/oozie/command/PauseTransitionXCommand.html longer than 100 characters.
[WARNING] Entry: oozie-4.4.0-SNAPSHOT/embedded-oozie-server/webapp/docs/core/apidocs/src-html/org/apache/oozie/LocalOozieClient.html longer than 100 characters.
[WARNING] Entry: oozie-4.4.0-SNAPSHOT/embedded-oozie-server/webapp/docs/core/apidocs/src-html/org/apache/oozie/test/EmbeddedServletContainer.html longer than 100 characters.
[WARNING] Entry: oozie-4.4.0-SNAPSHOT/embedded-oozie-server/webapp/docs/core/apidocs/src-html/org/apache/oozie/action/decision/DecisionActionExecutor.html longer than 100 characters.
[WARNING] Entry: oozie-4.4.0-SNAPSHOT/embedded-oozie-server/webapp/docs/core/apidocs/src-html/org/apache/oozie/action/ActionExecutorException.ErrorType.html longer than 100 characters.
[WARNING] Entry: oozie-4.4.0-SNAPSHOT/embedded-oozie-server/webapp/docs/core/apidocs/src-html/org/apache/oozie/action/oozie/SubWorkflowActionExecutor.html longer than 100 characters.
[WARNING] Entry: oozie-4.4.0-SNAPSHOT/embedded-oozie-server/webapp/docs/core/apidocs/src-html/org/apache/oozie/action/ActionExecutorException.html longer than 100 characters.
[WARNING] Entry: oozie-4.4.0-SNAPSHOT/embedded-oozie-server/webapp/docs/core/apidocs/src-html/org/apache/oozie/action/ActionExecutor.html longer than 100 characters.
[WARNING] Entry: oozie-4.4.0-SNAPSHOT/embedded-oozie-server/webapp/docs/core/apidocs/src-html/org/apache/oozie/action/ssh/SshActionExecutor.html longer than 100 characters.
[WARNING] Entry: oozie-4.4.0-SNAPSHOT/embedded-oozie-server/webapp/docs/core/apidocs/src-html/org/apache/oozie/action/ActionExecutor.RETRYPOLICY.html longer than 100 characters.
[WARNING] Entry: oozie-4.4.0-SNAPSHOT/embedded-oozie-server/webapp/docs/core/apidocs/src-html/org/apache/oozie/action/email/EmailActionExecutor.html longer than 100 characters.
[WARNING] Entry: oozie-4.4.0-SNAPSHOT/embedded-oozie-server/webapp/docs/core/apidocs/src-html/org/apache/oozie/action/email/EmailActionExecutor.JavaMailAuthenticator.html longer than 100 characters.
[WARNING] Entry: oozie-4.4.0-SNAPSHOT/embedded-oozie-server/webapp/docs/core/apidocs/src-html/org/apache/oozie/action/control/ControlNodeActionExecutor.html longer than 100 characters.
[WARNING] Entry: oozie-4.4.0-SNAPSHOT/embedded-oozie-server/webapp/docs/core/apidocs/src-html/org/apache/oozie/action/control/ForkActionExecutor.html longer than 100 characters.
[WARNING] Entry: oozie-4.4.0-SNAPSHOT/embedded-oozie-server/webapp/docs/core/apidocs/src-html/org/apache/oozie/action/control/EndActionExecutor.html longer than 100 characters.
[WARNING] Entry: oozie-4.4.0-SNAPSHOT/embedded-oozie-server/webapp/docs/core/apidocs/src-html/org/apache/oozie/action/control/StartActionExecutor.html longer than 100 characters.
[WARNING] Entry: oozie-4.4.0-SNAPSHOT/embedded-oozie-server/webapp/docs/core/apidocs/src-html/org/apache/oozie/action/control/JoinActionExecutor.html longer than 100 characters.
[WARNING] Entry: oozie-4.4.0-SNAPSHOT/embedded-oozie-server/webapp/docs/core/apidocs/src-html/org/apache/oozie/action/control/KillActionExecutor.html longer than 100 characters.
[WARNING] Entry: oozie-4.4.0-SNAPSHOT/embedded-oozie-server/webapp/docs/core/apidocs/src-html/org/apache/oozie/action/hadoop/SqoopActionExecutor.html longer than 100 characters.
[WARNING] Entry: oozie-4.4.0-SNAPSHOT/embedded-oozie-server/webapp/docs/core/apidocs/src-html/org/apache/oozie/action/hadoop/Hive2Credentials.html longer than 100 characters.
[WARNING] Entry: oozie-4.4.0-SNAPSHOT/embedded-oozie-server/webapp/docs/core/apidocs/src-html/org/apache/oozie/action/hadoop/HCatCredentialHelper.html longer than 100 characters.
[WARNING] Entry: oozie-4.4.0-SNAPSHOT/embedded-oozie-server/webapp/docs/core/apidocs/src-html/org/apache/oozie/action/hadoop/LauncherMapperHelper.html longer than 100 characters.
[WARNING] Entry: oozie-4.4.0-SNAPSHOT/embedded-oozie-server/webapp/docs/core/apidocs/src-html/org/apache/oozie/action/hadoop/Credentials.html longer than 100 characters.
[WARNING] Entry: oozie-4.4.0-SNAPSHOT/embedded-oozie-server/webapp/docs/core/apidocs/src-html/org/apache/oozie/action/hadoop/ShellActionExecutor.html longer than 100 characters.
[WARNING] Entry: oozie-4.4.0-SNAPSHOT/embedded-oozie-server/webapp/docs/core/apidocs/src-html/org/apache/oozie/action/hadoop/ScriptLanguageActionExecutor.html longer than 100 characters.
[WARNING] Entry: oozie-4.4.0-SNAPSHOT/embedded-oozie-server/webapp/docs/core/apidocs/src-html/org/apache/oozie/action/hadoop/PigActionExecutor.html longer than 100 characters.
[WARNING] Entry: oozie-4.4.0-SNAPSHOT/embedded-oozie-server/webapp/docs/core/apidocs/src-html/org/apache/oozie/action/hadoop/HCatCredentials.html longer than 100 characters.
[WARNING] Entry: oozie-4.4.0-SNAPSHOT/embedded-oozie-server/webapp/docs/core/apidocs/src-html/org/apache/oozie/action/hadoop/JavaActionExecutor.html longer than 100 characters.
[WARNING] Entry: oozie-4.4.0-SNAPSHOT/embedded-oozie-server/webapp/docs/core/apidocs/src-html/org/apache/oozie/action/hadoop/CredentialException.html longer than 100 characters.
[WARNING] Entry: oozie-4.4.0-SNAPSHOT/embedded-oozie-server/webapp/docs/core/apidocs/src-html/org/apache/oozie/action/hadoop/FsELFunctions.html longer than 100 characters.
[WARNING] Entry: oozie-4.4.0-SNAPSHOT/embedded-oozie-server/webapp/docs/core/apidocs/src-html/org/apache/oozie/action/hadoop/DistcpActionExecutor.html longer than 100 characters.
[WARNING] Entry: oozie-4.4.0-SNAPSHOT/embedded-oozie-server/webapp/docs/core/apidocs/src-html/org/apache/oozie/action/hadoop/HadoopELFunctions.html longer than 100 characters.
[WARNING] Entry: oozie-4.4.0-SNAPSHOT/embedded-oozie-server/webapp/docs/core/apidocs/src-html/org/apache/oozie/action/hadoop/CredentialsProperties.html longer than 100 characters.
[WARNING] Entry: oozie-4.4.0-SNAPSHOT/embedded-oozie-server/webapp/docs/core/apidocs/src-html/org/apache/oozie/action/hadoop/MapReduceActionExecutor.html longer than 100 characters.
[WARNING] Entry: oozie-4.4.0-SNAPSHOT/embedded-oozie-server/webapp/docs/core/apidocs/src-html/org/apache/oozie/action/hadoop/CredentialsProvider.html longer than 100 characters.
[WARNING] Entry: oozie-4.4.0-SNAPSHOT/embedded-oozie-server/webapp/docs/core/apidocs/src-html/org/apache/oozie/action/hadoop/HbaseCredentials.html longer than 100 characters.
[WARNING] Entry: oozie-4.4.0-SNAPSHOT/embedded-oozie-server/webapp/docs/core/apidocs/src-html/org/apache/oozie/action/hadoop/FsActionExecutor.html longer than 100 characters.
[WARNING] Entry: oozie-4.4.0-SNAPSHOT/embedded-oozie-server/webapp/docs/core/apidocs/src-html/org/apache/oozie/action/hadoop/Hive2ActionExecutor.html longer than 100 characters.
[WARNING] Entry: oozie-4.4.0-SNAPSHOT/embedded-oozie-server/webapp/docs/core/apidocs/src-html/org/apache/oozie/action/hadoop/SparkActionExecutor.html longer than 100 characters.
[WARNING] Entry: oozie-4.4.0-SNAPSHOT/embedded-oozie-server/webapp/docs/core/apidocs/src-html/org/apache/oozie/action/hadoop/HiveActionExecutor.html longer than 100 characters.
[WARNING] Entry: oozie-4.4.0-SNAPSHOT/embedded-oozie-server/webapp/docs/core/apidocs/src-html/org/apache/oozie/action/hadoop/OozieJobInfo.html longer than 100 characters.
[WARNING] Entry: oozie-4.4.0-SNAPSHOT/embedded-oozie-server/webapp/docs/core/apidocs/src-html/org/apache/oozie/action/ActionExecutor.Context.html longer than 100 characters.
[WARNING] Entry: oozie-4.4.0-SNAPSHOT/embedded-oozie-server/webapp/docs/core/apidocs/src-html/org/apache/oozie/CoordinatorEngine.html longer than 100 characters.
[WARNING] Entry: oozie-4.4.0-SNAPSHOT/embedded-oozie-server/webapp/docs/core/apidocs/src-html/org/apache/oozie/jms/MessageReceiver.html longer than 100 characters.
[WARNING] Entry: oozie-4.4.0-SNAPSHOT/embedded-oozie-server/webapp/docs/core/apidocs/src-html/org/apache/oozie/jms/DefaultConnectionContext.html longer than 100 characters.
[WARNING] Entry: oozie-4.4.0-SNAPSHOT/embedded-oozie-server/webapp/docs/core/apidocs/src-html/org/apache/oozie/jms/ConnectionContext.html longer than 100 characters.
[WARNING] Entry: oozie-4.4.0-SNAPSHOT/embedded-oozie-server/webapp/docs/core/apidocs/src-html/org/apache/oozie/jms/JMSExceptionListener.html longer than 100 characters.
[WARNING] Entry: oozie-4.4.0-SNAPSHOT/embedded-oozie-server/webapp/docs/core/apidocs/src-html/org/apache/oozie/jms/JMSConnectionInfo.html longer than 100 characters.
[WARNING] Entry: oozie-4.4.0-SNAPSHOT/embedded-oozie-server/webapp/docs/core/apidocs/src-html/org/apache/oozie/jms/JMSJobEventListener.html longer than 100 characters.
[WARNING] Entry: oozie-4.4.0-SNAPSHOT/embedded-oozie-server/webapp/docs/core/apidocs/src-html/org/apache/oozie/jms/MessageHandler.html longer than 100 characters.
[WARNING] Entry: oozie-4.4.0-SNAPSHOT/embedded-oozie-server/webapp/docs/core/apidocs/src-html/org/apache/oozie/jms/JMSSLAEventListener.html longer than 100 characters.
[WARNING] Entry: oozie-4.4.0-SNAPSHOT/embedded-oozie-server/webapp/docs/core/apidocs/src-html/org/apache/oozie/dependency/URIHandlerException.html longer than 100 characters.
[WARNING] Entry: oozie-4.4.0-SNAPSHOT/embedded-oozie-server/webapp/docs/core/apidocs/src-html/org/apache/oozie/dependency/URIHandler.html longer than 100 characters.
[WARNING] Entry: oozie-4.4.0-SNAPSHOT/embedded-oozie-server/webapp/docs/core/apidocs/src-html/org/apache/oozie/dependency/DependencyChecker.html longer than 100 characters.
[WARNING] Entry: oozie-4.4.0-SNAPSHOT/embedded-oozie-server/webapp/docs/core/apidocs/src-html/org/apache/oozie/dependency/hcat/WaitingActions.html longer than 100 characters.
[WARNING] Entry: oozie-4.4.0-SNAPSHOT/embedded-oozie-server/webapp/docs/core/apidocs/src-html/org/apache/oozie/dependency/hcat/SimpleHCatDependencyCache.html longer than 100 characters.
[WARNING] Entry: oozie-4.4.0-SNAPSHOT/embedded-oozie-server/webapp/docs/core/apidocs/src-html/org/apache/oozie/dependency/hcat/EhcacheHCatDependencyCache.html longer than 100 characters.
[WARNING] Entry: oozie-4.4.0-SNAPSHOT/embedded-oozie-server/webapp/docs/core/apidocs/src-html/org/apache/oozie/dependency/hcat/HCatDependencyCache.html longer than 100 characters.
[WARNING] Entry: oozie-4.4.0-SNAPSHOT/embedded-oozie-server/webapp/docs/core/apidocs/src-html/org/apache/oozie/dependency/hcat/HCatMessageHandler.html longer than 100 characters.
[WARNING] Entry: oozie-4.4.0-SNAPSHOT/embedded-oozie-server/webapp/docs/core/apidocs/src-html/org/apache/oozie/dependency/hcat/WaitingAction.html longer than 100 characters.
[WARNING] Entry: oozie-4.4.0-SNAPSHOT/embedded-oozie-server/webapp/docs/core/apidocs/src-html/org/apache/oozie/dependency/ActionDependency.html longer than 100 characters.
[WARNING] Entry: oozie-4.4.0-SNAPSHOT/embedded-oozie-server/webapp/docs/core/apidocs/src-html/org/apache/oozie/dependency/FSURIHandler.html longer than 100 characters.
[WARNING] Entry: oozie-4.4.0-SNAPSHOT/embedded-oozie-server/webapp/docs/core/apidocs/src-html/org/apache/oozie/dependency/URIHandler.Context.html longer than 100 characters.
[WARNING] Entry: oozie-4.4.0-SNAPSHOT/embedded-oozie-server/webapp/docs/core/apidocs/src-html/org/apache/oozie/dependency/HCatURIHandler.html longer than 100 characters.
[WARNING] Entry: oozie-4.4.0-SNAPSHOT/embedded-oozie-server/webapp/docs/core/apidocs/src-html/org/apache/oozie/dependency/URIHandler.DependencyType.html longer than 100 characters.
[WARNING] Entry: oozie-4.4.0-SNAPSHOT/embedded-oozie-server/webapp/docs/core/apidocs/src-html/org/apache/oozie/DagEngine.html longer than 100 characters.
[WARNING] Entry: oozie-4.4.0-SNAPSHOT/embedded-oozie-server/webapp/docs/core/apidocs/src-html/org/apache/oozie/WorkflowActionBean.html longer than 100 characters.
[WARNING] Entry: oozie-4.4.0-SNAPSHOT/embedded-oozie-server/webapp/docs/core/apidocs/src-html/org/apache/oozie/XException.html longer than 100 characters.
[WARNING] Entry: oozie-4.4.0-SNAPSHOT/embedded-oozie-server/webapp/docs/core/apidocs/src-html/org/apache/oozie/BaseEngine.html longer than 100 characters.
[WARNING] Entry: oozie-4.4.0-SNAPSHOT/embedded-oozie-server/webapp/docs/core/apidocs/src-html/org/apache/oozie/WorkflowJobBean.html longer than 100 characters.
[WARNING] Entry: oozie-4.4.0-SNAPSHOT/embedded-oozie-server/webapp/console/sla/js/table/jquery-ui-timepicker-addon.js longer than 100 characters.
[WARNING] Entry: oozie-4.4.0-SNAPSHOT/embedded-oozie-server/webapp/console/sla/js/table/jquery-ui-1.10.3.custom.min.js longer than 100 characters.
[WARNING] Entry: oozie-4.4.0-SNAPSHOT/embedded-oozie-server/webapp/console/sla/css/images/ui-bg_glass_100_f6f6f6_1x400.png longer than 100 characters.
[WARNING] Entry: oozie-4.4.0-SNAPSHOT/embedded-oozie-server/webapp/console/sla/css/images/ui-bg_flat_100_DEECFD_40x100.png longer than 100 characters.
[WARNING] Entry: oozie-4.4.0-SNAPSHOT/embedded-oozie-server/webapp/console/sla/css/images/ui-icons_222222_256x240.png longer than 100 characters.
[WARNING] Entry: oozie-4.4.0-SNAPSHOT/embedded-oozie-server/webapp/console/sla/css/images/ui-bg_glass_65_ffffff_1x400.png longer than 100 characters.
[WARNING] Entry: oozie-4.4.0-SNAPSHOT/embedded-oozie-server/webapp/console/sla/css/images/ui-bg_highlight-soft_100_eeeeee_1x100.png longer than 100 characters.
[INFO]
[INFO] ------------------------------------------------------------------------
[INFO] Building Apache Oozie ZooKeeper Security Tests 4.4.0-SNAPSHOT
[INFO] ------------------------------------------------------------------------
[INFO]
[INFO] --- maven-remote-resources-plugin:1.5:process (default) @ oozie-zookeeper-security-tests ---
[INFO]
[INFO] --- maven-resources-plugin:2.5:resources (default-resources) @ oozie-zookeeper-security-tests ---
[debug] execute contextualize
[INFO] Using 'UTF-8' encoding to copy filtered resources.
[INFO] skip non existing resourceDirectory <https://builds.apache.org/job/oozie-trunk-precommit-build/ws/zookeeper-security-tests/src/main/resources>
[INFO] Copying 3 resources
[INFO]
[INFO] --- maven-compiler-plugin:2.3.2:compile (default-compile) @ oozie-zookeeper-security-tests ---
[INFO] No sources to compile
[INFO]
[INFO] --- maven-resources-plugin:2.5:testResources (default-testResources) @ oozie-zookeeper-security-tests ---
[debug] execute contextualize
[INFO] Using 'UTF-8' encoding to copy filtered resources.
[INFO] skip non existing resourceDirectory <https://builds.apache.org/job/oozie-trunk-precommit-build/ws/zookeeper-security-tests/src/test/resources>
[INFO] Copying 3 resources
[INFO]
[INFO] --- maven-compiler-plugin:2.3.2:testCompile (default-testCompile) @ oozie-zookeeper-security-tests ---
[INFO] Nothing to compile - all classes are up to date
[INFO]
[INFO] --- maven-surefire-plugin:2.12.2:test (default-test) @ oozie-zookeeper-security-tests ---
[INFO] Tests are skipped.
[INFO]
[INFO] --- maven-jar-plugin:2.3.1:jar (default-jar) @ oozie-zookeeper-security-tests ---
[INFO] Building jar: <https://builds.apache.org/job/oozie-trunk-precommit-build/ws/zookeeper-security-tests/target/oozie-zookeeper-security-tests-4.4.0-SNAPSHOT.jar>
[INFO]
[INFO] --- maven-site-plugin:2.0-beta-6:attach-descriptor (attach-descriptor) @ oozie-zookeeper-security-tests ---
[INFO]
[INFO] --- maven-assembly-plugin:2.2.1:single (default-cli) @ oozie-zookeeper-security-tests ---
[INFO] Reading assembly descriptor: src/main/assemblies/empty.xml
[INFO] ------------------------------------------------------------------------
[INFO] Reactor Summary:
[INFO]
[INFO] Apache Oozie Main .................................. SUCCESS [ 1.465 s]
[INFO] Apache Oozie Hadoop Utils hadoop-2-4.4.0-SNAPSHOT .. SUCCESS [ 2.336 s]
[INFO] Apache Oozie Hadoop Distcp hadoop-2-4.4.0-SNAPSHOT . SUCCESS [ 0.171 s]
[INFO] Apache Oozie Hadoop Auth hadoop-2-4.4.0-SNAPSHOT Test SUCCESS [ 0.334 s]
[INFO] Apache Oozie Hadoop Libs ........................... SUCCESS [ 0.024 s]
[INFO] Apache Oozie Client ................................ SUCCESS [ 24.874 s]
[INFO] Apache Oozie Share Lib Oozie ....................... SUCCESS [ 1.920 s]
[INFO] Apache Oozie Share Lib HCatalog .................... SUCCESS [ 2.113 s]
[INFO] Apache Oozie Share Lib Distcp ...................... SUCCESS [ 0.374 s]
[INFO] Apache Oozie Core .................................. SUCCESS [ 38.081 s]
[INFO] Apache Oozie Share Lib Streaming ................... SUCCESS [ 3.078 s]
[INFO] Apache Oozie Share Lib Pig ......................... SUCCESS [ 2.434 s]
[INFO] Apache Oozie Share Lib Hive ........................ SUCCESS [ 5.009 s]
[INFO] Apache Oozie Share Lib Hive 2 ...................... SUCCESS [ 3.835 s]
[INFO] Apache Oozie Share Lib Sqoop ....................... SUCCESS [ 0.558 s]
[INFO] Apache Oozie Examples .............................. SUCCESS [ 2.316 s]
[INFO] Apache Oozie Share Lib Spark ....................... SUCCESS [ 5.835 s]
[INFO] Apache Oozie Share Lib ............................. SUCCESS [ 22.624 s]
[INFO] Apache Oozie Docs .................................. SUCCESS [ 11.646 s]
[INFO] Apache Oozie WebApp ................................ SUCCESS [ 35.454 s]
[INFO] Apache Oozie Tools ................................. SUCCESS [ 1.590 s]
[INFO] Apache Oozie MiniOozie ............................. SUCCESS [ 0.670 s]
[INFO] Apache Oozie Server ................................ SUCCESS [ 3.311 s]
[INFO] Apache Oozie Distro ................................ SUCCESS [ 53.922 s]
[INFO] Apache Oozie ZooKeeper Security Tests .............. SUCCESS [ 2.487 s]
[INFO] ------------------------------------------------------------------------
[INFO] BUILD SUCCESS
[INFO] ------------------------------------------------------------------------
[INFO] Total time: 03:48 min
[INFO] Finished at: 2016-11-09T18:51:56+00:00
[INFO] Final Memory: 90M/1068M
[INFO] ------------------------------------------------------------------------
Reports
Running test-patch task CLEAN
Running test-patch task RAW_PATCH_ANALYSIS
Running test-patch task RAT
Running test-patch task JAVADOC
Running test-patch task COMPILE
Running test-patch task FINDBUGS_DIFF
[TRACE] Folder [<https://builds.apache.org/job/oozie-trunk-precommit-build/ws/test-patch/tmp/FINDBUGS_DIFF/pre/server/target/findbugs/]> does not exist, creating
[TRACE] XML file [<https://builds.apache.org/job/oozie-trunk-precommit-build/ws/test-patch/tmp/FINDBUGS_DIFF/pre/server/target/findbugs/findbugsXml.xml]> does not exist, creating
[TRACE] Downloading FindBugs diff JAR from https://repo1.maven.org/maven2/me/andrz/findbugs/findbugs-diff/0.1.0/findbugs-diff-0.1.0-all.jar
[TRACE] FindBugs diff JAR downloaded
[ERROR] FindBugs diff JAR has a weird MD5 sum, rejecting
[TRACE] File [<https://builds.apache.org/job/oozie-trunk-precommit-build/ws/test-patch/tmp/FINDBUGS_DIFF/diff/findbugs-diff-0.1.0-all.jar]> removed
[TRACE] File [<https://builds.apache.org/job/oozie-trunk-precommit-build/ws/test-patch/tmp/FINDBUGS_DIFF/diff/findbugs-diff-0.1.0-all.jar.md5]> removed
Running test-patch task BACKWARDS_COMPATIBILITY
Running test-patch task TESTS
Running test-patch task DISTRO
Testing JIRA OOZIE-2666
Cleaning local git workspace
----------------------------
+1 PATCH_APPLIES
+1 CLEAN
-1 RAW_PATCH_ANALYSIS
+1 the patch does not introduce any @author tags
+1 the patch does not introduce any tabs
+1 the patch does not introduce any trailing spaces
-1 the patch contains 9 line(s) longer than 132 characters
+1 the patch does adds/modifies 3 testcase(s)
+1 RAT
+1 the patch does not seem to introduce new RAT warnings
+1 JAVADOC
+1 the patch does not seem to introduce new Javadoc warnings
+1 COMPILE
+1 HEAD compiles
+1 patch compiles
+1 the patch does not seem to introduce new javac warnings
-1 FindBugs diff JAR has a weird MD5 sum, rejecting.
+1 BACKWARDS_COMPATIBILITY
+1 the patch does not change any JPA Entity/Colum/Basic/Lob/Transient annotations
+1 the patch does not modify JPA files
+1 TESTS
Tests run: 1828
+1 DISTRO
+1 distro tarball builds with the patch
----------------------------
-1 Overall result, please check the reported -1(s)
The full output of the test-patch run is available at
https://builds.apache.org/job/oozie-trunk-precommit-build/3426/
Adding comment to JIRA
Comment added.
test-patch exit code: 1
Build step 'Execute shell' marked build as failure
Archiving artifacts
Recording test results
Build failed in Jenkins: oozie-trunk-precommit-build #3425
Posted by Apache Jenkins Server <je...@builds.apache.org>.
See <https://builds.apache.org/job/oozie-trunk-precommit-build/3425/>
------------------------------------------
[...truncated 12080 lines...]
[INFO] Building jar: <https://builds.apache.org/job/oozie-trunk-precommit-build/ws/tools/target/oozie-tools-4.4.0-SNAPSHOT.jar>
[INFO]
[INFO] --- maven-site-plugin:2.0-beta-6:attach-descriptor (attach-descriptor) @ oozie-tools ---
[INFO]
[INFO] --- maven-assembly-plugin:2.2.1:single (default-cli) @ oozie-tools ---
[INFO] Reading assembly descriptor: ../src/main/assemblies/tools.xml
[WARNING] The following patterns were never triggered in this artifact exclusion filter:
o '*:*:pom:*'
[INFO] Copying files to <https://builds.apache.org/job/oozie-trunk-precommit-build/ws/tools/target/oozie-tools-4.4.0-SNAPSHOT-tools>
[WARNING] Assembly file: <https://builds.apache.org/job/oozie-trunk-precommit-build/ws/tools/target/oozie-tools-4.4.0-SNAPSHOT-tools> is not a regular file (it may be a directory). It cannot be attached to the project build for installation or deployment.
[INFO]
[INFO] ------------------------------------------------------------------------
[INFO] Building Apache Oozie MiniOozie 4.4.0-SNAPSHOT
[INFO] ------------------------------------------------------------------------
[INFO]
[INFO] --- maven-remote-resources-plugin:1.5:process (default) @ oozie-mini ---
[INFO]
[INFO] --- maven-resources-plugin:2.5:resources (default-resources) @ oozie-mini ---
[debug] execute contextualize
[INFO] Using 'UTF-8' encoding to copy filtered resources.
[INFO] skip non existing resourceDirectory <https://builds.apache.org/job/oozie-trunk-precommit-build/ws/minitest/src/main/resources>
[INFO] Copying 3 resources
[INFO]
[INFO] --- maven-compiler-plugin:2.3.2:compile (default-compile) @ oozie-mini ---
[INFO] No sources to compile
[INFO]
[INFO] --- maven-resources-plugin:2.5:testResources (default-testResources) @ oozie-mini ---
[debug] execute contextualize
[INFO] Using 'UTF-8' encoding to copy filtered resources.
[INFO] Copying 3 resources
[INFO] Copying 3 resources
[INFO]
[INFO] --- maven-compiler-plugin:2.3.2:testCompile (default-testCompile) @ oozie-mini ---
[INFO] Nothing to compile - all classes are up to date
[INFO]
[INFO] --- maven-surefire-plugin:2.12.2:test (default-test) @ oozie-mini ---
[INFO] Tests are skipped.
[INFO]
[INFO] --- maven-jar-plugin:2.3.1:jar (default-jar) @ oozie-mini ---
[INFO] Building jar: <https://builds.apache.org/job/oozie-trunk-precommit-build/ws/minitest/target/oozie-mini-4.4.0-SNAPSHOT.jar>
[INFO]
[INFO] --- maven-site-plugin:2.0-beta-6:attach-descriptor (attach-descriptor) @ oozie-mini ---
[INFO]
[INFO] --- maven-assembly-plugin:2.2.1:single (default-cli) @ oozie-mini ---
[INFO] Reading assembly descriptor: src/main/assemblies/empty.xml
[INFO]
[INFO] ------------------------------------------------------------------------
[INFO] Building Apache Oozie Distro 4.4.0-SNAPSHOT
[INFO] ------------------------------------------------------------------------
[INFO]
[INFO] --- maven-remote-resources-plugin:1.5:process (default) @ oozie-distro ---
[INFO]
[INFO] --- maven-resources-plugin:2.5:resources (default-resources) @ oozie-distro ---
[debug] execute contextualize
[INFO] Using 'UTF-8' encoding to copy filtered resources.
[INFO] skip non existing resourceDirectory <https://builds.apache.org/job/oozie-trunk-precommit-build/ws/distro/src/main/resources>
[INFO] Copying 3 resources
[INFO]
[INFO] --- maven-compiler-plugin:2.3.2:compile (default-compile) @ oozie-distro ---
[INFO] No sources to compile
[INFO]
[INFO] --- maven-resources-plugin:2.5:testResources (default-testResources) @ oozie-distro ---
[debug] execute contextualize
[INFO] Using 'UTF-8' encoding to copy filtered resources.
[INFO] skip non existing resourceDirectory <https://builds.apache.org/job/oozie-trunk-precommit-build/ws/distro/src/test/resources>
[INFO] Copying 3 resources
[INFO]
[INFO] --- maven-compiler-plugin:2.3.2:testCompile (default-testCompile) @ oozie-distro ---
[INFO] No sources to compile
[INFO]
[INFO] --- maven-surefire-plugin:2.12.2:test (default-test) @ oozie-distro ---
[INFO] Tests are skipped.
[INFO]
[INFO] --- maven-jar-plugin:2.3.1:jar (default-jar) @ oozie-distro ---
[INFO] Building jar: <https://builds.apache.org/job/oozie-trunk-precommit-build/ws/distro/target/oozie-distro-4.4.0-SNAPSHOT.jar>
[INFO]
[INFO] --- maven-site-plugin:2.0-beta-6:attach-descriptor (attach-descriptor) @ oozie-distro ---
[INFO]
[INFO] --- maven-antrun-plugin:1.6:run (default) @ oozie-distro ---
[INFO] Executing tasks
main:
[get] Destination already exists (skipping): <https://builds.apache.org/job/oozie-trunk-precommit-build/ws/distro/downloads/tomcat-6.0.47.tar.gz>
[delete] Deleting directory <https://builds.apache.org/job/oozie-trunk-precommit-build/ws/distro/target/tomcat>
[mkdir] Created dir: <https://builds.apache.org/job/oozie-trunk-precommit-build/ws/distro/target/tomcat>
[gunzip] Expanding <https://builds.apache.org/job/oozie-trunk-precommit-build/ws/distro/downloads/tomcat-6.0.47.tar.gz> to <https://builds.apache.org/job/oozie-trunk-precommit-build/ws/distro/target/tomcat/tomcat-6.0.47.tar>
[untar] Expanding: <https://builds.apache.org/job/oozie-trunk-precommit-build/ws/distro/target/tomcat/tomcat-6.0.47.tar> into <https://builds.apache.org/job/oozie-trunk-precommit-build/ws/distro/target/tomcat>
[delete] Deleting directory <https://builds.apache.org/job/oozie-trunk-precommit-build/ws/distro/target/tomcat/oozie-server/webapps>
[mkdir] Created dir: <https://builds.apache.org/job/oozie-trunk-precommit-build/ws/distro/target/tomcat/oozie-server/webapps>
[delete] Deleting: <https://builds.apache.org/job/oozie-trunk-precommit-build/ws/distro/target/tomcat/oozie-server/conf/server.xml>
[copy] Copying 1 file to <https://builds.apache.org/job/oozie-trunk-precommit-build/ws/distro/target/tomcat/oozie-server/conf>
[mkdir] Created dir: <https://builds.apache.org/job/oozie-trunk-precommit-build/ws/distro/target/tomcat/oozie-server/conf/ssl>
[copy] Copying 1 file to <https://builds.apache.org/job/oozie-trunk-precommit-build/ws/distro/target/tomcat/oozie-server/conf/ssl>
[copy] Copying 1 file to <https://builds.apache.org/job/oozie-trunk-precommit-build/ws/distro/target/tomcat/oozie-server/conf/ssl>
[copy] Copying 1 file to <https://builds.apache.org/job/oozie-trunk-precommit-build/ws/distro/target/tomcat/oozie-server/conf/ssl>
[copy] Copying 3 files to <https://builds.apache.org/job/oozie-trunk-precommit-build/ws/distro/target/tomcat/oozie-server/webapps/ROOT>
[INFO] Executed tasks
[INFO]
[INFO] --- maven-assembly-plugin:2.2.1:single (default-cli) @ oozie-distro ---
[INFO] Reading assembly descriptor: ../src/main/assemblies/distro.xml
[INFO] Copying files to <https://builds.apache.org/job/oozie-trunk-precommit-build/ws/distro/target/oozie-4.4.0-SNAPSHOT-distro>
[WARNING] Assembly file: <https://builds.apache.org/job/oozie-trunk-precommit-build/ws/distro/target/oozie-4.4.0-SNAPSHOT-distro> is not a regular file (it may be a directory). It cannot be attached to the project build for installation or deployment.
[INFO] Building tar : <https://builds.apache.org/job/oozie-trunk-precommit-build/ws/distro/target/oozie-4.4.0-SNAPSHOT-distro.tar.gz>
[INFO]
[INFO] ------------------------------------------------------------------------
[INFO] Building Apache Oozie ZooKeeper Security Tests 4.4.0-SNAPSHOT
[INFO] ------------------------------------------------------------------------
[INFO]
[INFO] --- maven-remote-resources-plugin:1.5:process (default) @ oozie-zookeeper-security-tests ---
[INFO]
[INFO] --- maven-resources-plugin:2.5:resources (default-resources) @ oozie-zookeeper-security-tests ---
[debug] execute contextualize
[INFO] Using 'UTF-8' encoding to copy filtered resources.
[INFO] skip non existing resourceDirectory <https://builds.apache.org/job/oozie-trunk-precommit-build/ws/zookeeper-security-tests/src/main/resources>
[INFO] Copying 3 resources
[INFO]
[INFO] --- maven-compiler-plugin:2.3.2:compile (default-compile) @ oozie-zookeeper-security-tests ---
[INFO] No sources to compile
[INFO]
[INFO] --- maven-resources-plugin:2.5:testResources (default-testResources) @ oozie-zookeeper-security-tests ---
[debug] execute contextualize
[INFO] Using 'UTF-8' encoding to copy filtered resources.
[INFO] skip non existing resourceDirectory <https://builds.apache.org/job/oozie-trunk-precommit-build/ws/zookeeper-security-tests/src/test/resources>
[INFO] Copying 3 resources
[INFO]
[INFO] --- maven-compiler-plugin:2.3.2:testCompile (default-testCompile) @ oozie-zookeeper-security-tests ---
[INFO] Nothing to compile - all classes are up to date
[INFO]
[INFO] --- maven-surefire-plugin:2.12.2:test (default-test) @ oozie-zookeeper-security-tests ---
[INFO] Tests are skipped.
[INFO]
[INFO] --- maven-jar-plugin:2.3.1:jar (default-jar) @ oozie-zookeeper-security-tests ---
[INFO] Building jar: <https://builds.apache.org/job/oozie-trunk-precommit-build/ws/zookeeper-security-tests/target/oozie-zookeeper-security-tests-4.4.0-SNAPSHOT.jar>
[INFO]
[INFO] --- maven-site-plugin:2.0-beta-6:attach-descriptor (attach-descriptor) @ oozie-zookeeper-security-tests ---
[INFO]
[INFO] --- maven-assembly-plugin:2.2.1:single (default-cli) @ oozie-zookeeper-security-tests ---
[INFO] Reading assembly descriptor: src/main/assemblies/empty.xml
[INFO] ------------------------------------------------------------------------
[INFO] Reactor Summary:
[INFO]
[INFO] Apache Oozie Main .................................. SUCCESS [ 1.551 s]
[INFO] Apache Oozie Hadoop Utils hadoop-2-4.4.0-SNAPSHOT .. SUCCESS [ 2.393 s]
[INFO] Apache Oozie Hadoop Distcp hadoop-2-4.4.0-SNAPSHOT . SUCCESS [ 0.146 s]
[INFO] Apache Oozie Hadoop Auth hadoop-2-4.4.0-SNAPSHOT Test SUCCESS [ 0.319 s]
[INFO] Apache Oozie Hadoop Libs ........................... SUCCESS [ 0.026 s]
[INFO] Apache Oozie Client ................................ SUCCESS [ 24.908 s]
[INFO] Apache Oozie Share Lib Oozie ....................... SUCCESS [ 1.866 s]
[INFO] Apache Oozie Share Lib HCatalog .................... SUCCESS [ 1.922 s]
[INFO] Apache Oozie Share Lib Distcp ...................... SUCCESS [ 0.372 s]
[INFO] Apache Oozie Core .................................. SUCCESS [ 39.843 s]
[INFO] Apache Oozie Share Lib Streaming ................... SUCCESS [ 3.091 s]
[INFO] Apache Oozie Share Lib Pig ......................... SUCCESS [ 2.647 s]
[INFO] Apache Oozie Share Lib Hive ........................ SUCCESS [ 5.086 s]
[INFO] Apache Oozie Share Lib Hive 2 ...................... SUCCESS [ 3.977 s]
[INFO] Apache Oozie Share Lib Sqoop ....................... SUCCESS [ 0.585 s]
[INFO] Apache Oozie Examples .............................. SUCCESS [ 2.369 s]
[INFO] Apache Oozie Share Lib Spark ....................... SUCCESS [ 6.453 s]
[INFO] Apache Oozie Share Lib ............................. SUCCESS [ 23.756 s]
[INFO] Apache Oozie Docs .................................. SUCCESS [ 12.081 s]
[INFO] Apache Oozie WebApp ................................ SUCCESS [ 35.089 s]
[INFO] Apache Oozie Tools ................................. SUCCESS [ 1.311 s]
[INFO] Apache Oozie MiniOozie ............................. SUCCESS [ 0.683 s]
[INFO] Apache Oozie Distro ................................ SUCCESS [ 40.173 s]
[INFO] Apache Oozie ZooKeeper Security Tests .............. SUCCESS [ 2.491 s]
[INFO] ------------------------------------------------------------------------
[INFO] BUILD SUCCESS
[INFO] ------------------------------------------------------------------------
[INFO] Total time: 03:35 min
[INFO] Finished at: 2016-11-09T12:25:00+00:00
[INFO] Final Memory: 86M/891M
[INFO] ------------------------------------------------------------------------
Reports
Running test-patch task CLEAN
Running test-patch task RAW_PATCH_ANALYSIS
Running test-patch task RAT
Running test-patch task JAVADOC
Running test-patch task COMPILE
Running test-patch task FINDBUGS_DIFF
[TRACE] Downloading FindBugs diff JAR from https://repo1.maven.org/maven2/me/andrz/findbugs/findbugs-diff/0.1.0/findbugs-diff-0.1.0-all.jar
[TRACE] FindBugs diff JAR downloaded
[ERROR] FindBugs diff JAR has a weird MD5 sum, rejecting
[TRACE] File [<https://builds.apache.org/job/oozie-trunk-precommit-build/ws/test-patch/tmp/FINDBUGS_DIFF/diff/findbugs-diff-0.1.0-all.jar]> removed
[TRACE] File [<https://builds.apache.org/job/oozie-trunk-precommit-build/ws/test-patch/tmp/FINDBUGS_DIFF/diff/findbugs-diff-0.1.0-all.jar.md5]> removed
Running test-patch task BACKWARDS_COMPATIBILITY
Running test-patch task TESTS
Running test-patch task DISTRO
Testing JIRA OOZIE-2725
Cleaning local git workspace
----------------------------
+1 PATCH_APPLIES
+1 CLEAN
-1 RAW_PATCH_ANALYSIS
+1 the patch does not introduce any @author tags
+1 the patch does not introduce any tabs
+1 the patch does not introduce any trailing spaces
+1 the patch does not introduce any line longer than 132
-1 the patch does not add/modify any testcase
+1 RAT
+1 the patch does not seem to introduce new RAT warnings
+1 JAVADOC
+1 the patch does not seem to introduce new Javadoc warnings
+1 COMPILE
+1 HEAD compiles
+1 patch compiles
+1 the patch does not seem to introduce new javac warnings
-1 FindBugs diff JAR has a weird MD5 sum, rejecting.
+1 BACKWARDS_COMPATIBILITY
+1 the patch does not change any JPA Entity/Colum/Basic/Lob/Transient annotations
+1 the patch does not modify JPA files
-1 TESTS
Tests run: 1818
Tests failed: 5
Tests errors: 3
The patch failed the following testcases:
testMain(org.apache.oozie.action.hadoop.TestHiveMain)
testPigScript(org.apache.oozie.action.hadoop.TestPigMain)
testEmbeddedPigWithinPython(org.apache.oozie.action.hadoop.TestPigMain)
testPig_withNullExternalID(org.apache.oozie.action.hadoop.TestPigMain)
testPigScript(org.apache.oozie.action.hadoop.TestPigMainWithOldAPI)
+1 DISTRO
+1 distro tarball builds with the patch
----------------------------
-1 Overall result, please check the reported -1(s)
The full output of the test-patch run is available at
https://builds.apache.org/job/oozie-trunk-precommit-build/3425/
Adding comment to JIRA
Comment added.
test-patch exit code: 1
Build step 'Execute shell' marked build as failure
Archiving artifacts
Recording test results
Build failed in Jenkins: oozie-trunk-precommit-build #3424
Posted by Apache Jenkins Server <je...@builds.apache.org>.
See <https://builds.apache.org/job/oozie-trunk-precommit-build/3424/changes>
Changes:
[rkanter] Revert "Test case failure (abhishekbafna via jaydeepvishwakarma)"
[rkanter] OOZIE-2719 Test case failure (abhishekbafna via jaydeepvishwakarma)
------------------------------------------
[...truncated 12041 lines...]
[INFO] Using 'UTF-8' encoding to copy filtered resources.
[INFO] Copying 11 resources
[INFO] Copying 3 resources
[INFO]
[INFO] --- maven-compiler-plugin:2.3.2:testCompile (default-testCompile) @ oozie-tools ---
[INFO] Nothing to compile - all classes are up to date
[INFO]
[INFO] --- maven-surefire-plugin:2.12.2:test (default-test) @ oozie-tools ---
[INFO] Tests are skipped.
[INFO]
[INFO] --- maven-jar-plugin:2.3.1:jar (default-jar) @ oozie-tools ---
[INFO] Building jar: <https://builds.apache.org/job/oozie-trunk-precommit-build/ws/tools/target/oozie-tools-4.4.0-SNAPSHOT.jar>
[INFO]
[INFO] --- maven-site-plugin:2.0-beta-6:attach-descriptor (attach-descriptor) @ oozie-tools ---
[INFO]
[INFO] --- maven-assembly-plugin:2.2.1:single (default-cli) @ oozie-tools ---
[INFO] Reading assembly descriptor: ../src/main/assemblies/tools.xml
[WARNING] The following patterns were never triggered in this artifact exclusion filter:
o '*:*:pom:*'
[INFO] Copying files to <https://builds.apache.org/job/oozie-trunk-precommit-build/ws/tools/target/oozie-tools-4.4.0-SNAPSHOT-tools>
[WARNING] Assembly file: <https://builds.apache.org/job/oozie-trunk-precommit-build/ws/tools/target/oozie-tools-4.4.0-SNAPSHOT-tools> is not a regular file (it may be a directory). It cannot be attached to the project build for installation or deployment.
[INFO]
[INFO] ------------------------------------------------------------------------
[INFO] Building Apache Oozie MiniOozie 4.4.0-SNAPSHOT
[INFO] ------------------------------------------------------------------------
[INFO]
[INFO] --- maven-remote-resources-plugin:1.5:process (default) @ oozie-mini ---
[INFO]
[INFO] --- maven-resources-plugin:2.5:resources (default-resources) @ oozie-mini ---
[debug] execute contextualize
[INFO] Using 'UTF-8' encoding to copy filtered resources.
[INFO] skip non existing resourceDirectory <https://builds.apache.org/job/oozie-trunk-precommit-build/ws/minitest/src/main/resources>
[INFO] Copying 3 resources
[INFO]
[INFO] --- maven-compiler-plugin:2.3.2:compile (default-compile) @ oozie-mini ---
[INFO] No sources to compile
[INFO]
[INFO] --- maven-resources-plugin:2.5:testResources (default-testResources) @ oozie-mini ---
[debug] execute contextualize
[INFO] Using 'UTF-8' encoding to copy filtered resources.
[INFO] Copying 3 resources
[INFO] Copying 3 resources
[INFO]
[INFO] --- maven-compiler-plugin:2.3.2:testCompile (default-testCompile) @ oozie-mini ---
[INFO] Nothing to compile - all classes are up to date
[INFO]
[INFO] --- maven-surefire-plugin:2.12.2:test (default-test) @ oozie-mini ---
[INFO] Tests are skipped.
[INFO]
[INFO] --- maven-jar-plugin:2.3.1:jar (default-jar) @ oozie-mini ---
[INFO] Building jar: <https://builds.apache.org/job/oozie-trunk-precommit-build/ws/minitest/target/oozie-mini-4.4.0-SNAPSHOT.jar>
[INFO]
[INFO] --- maven-site-plugin:2.0-beta-6:attach-descriptor (attach-descriptor) @ oozie-mini ---
[INFO]
[INFO] --- maven-assembly-plugin:2.2.1:single (default-cli) @ oozie-mini ---
[INFO] Reading assembly descriptor: src/main/assemblies/empty.xml
[INFO]
[INFO] ------------------------------------------------------------------------
[INFO] Building Apache Oozie Distro 4.4.0-SNAPSHOT
[INFO] ------------------------------------------------------------------------
[INFO]
[INFO] --- maven-remote-resources-plugin:1.5:process (default) @ oozie-distro ---
[INFO]
[INFO] --- maven-resources-plugin:2.5:resources (default-resources) @ oozie-distro ---
[debug] execute contextualize
[INFO] Using 'UTF-8' encoding to copy filtered resources.
[INFO] skip non existing resourceDirectory <https://builds.apache.org/job/oozie-trunk-precommit-build/ws/distro/src/main/resources>
[INFO] Copying 3 resources
[INFO]
[INFO] --- maven-compiler-plugin:2.3.2:compile (default-compile) @ oozie-distro ---
[INFO] No sources to compile
[INFO]
[INFO] --- maven-resources-plugin:2.5:testResources (default-testResources) @ oozie-distro ---
[debug] execute contextualize
[INFO] Using 'UTF-8' encoding to copy filtered resources.
[INFO] skip non existing resourceDirectory <https://builds.apache.org/job/oozie-trunk-precommit-build/ws/distro/src/test/resources>
[INFO] Copying 3 resources
[INFO]
[INFO] --- maven-compiler-plugin:2.3.2:testCompile (default-testCompile) @ oozie-distro ---
[INFO] No sources to compile
[INFO]
[INFO] --- maven-surefire-plugin:2.12.2:test (default-test) @ oozie-distro ---
[INFO] Tests are skipped.
[INFO]
[INFO] --- maven-jar-plugin:2.3.1:jar (default-jar) @ oozie-distro ---
[INFO] Building jar: <https://builds.apache.org/job/oozie-trunk-precommit-build/ws/distro/target/oozie-distro-4.4.0-SNAPSHOT.jar>
[INFO]
[INFO] --- maven-site-plugin:2.0-beta-6:attach-descriptor (attach-descriptor) @ oozie-distro ---
[INFO]
[INFO] --- maven-antrun-plugin:1.6:run (default) @ oozie-distro ---
[INFO] Executing tasks
main:
[get] Destination already exists (skipping): <https://builds.apache.org/job/oozie-trunk-precommit-build/ws/distro/downloads/tomcat-6.0.47.tar.gz>
[delete] Deleting directory <https://builds.apache.org/job/oozie-trunk-precommit-build/ws/distro/target/tomcat>
[mkdir] Created dir: <https://builds.apache.org/job/oozie-trunk-precommit-build/ws/distro/target/tomcat>
[gunzip] Expanding <https://builds.apache.org/job/oozie-trunk-precommit-build/ws/distro/downloads/tomcat-6.0.47.tar.gz> to <https://builds.apache.org/job/oozie-trunk-precommit-build/ws/distro/target/tomcat/tomcat-6.0.47.tar>
[untar] Expanding: <https://builds.apache.org/job/oozie-trunk-precommit-build/ws/distro/target/tomcat/tomcat-6.0.47.tar> into <https://builds.apache.org/job/oozie-trunk-precommit-build/ws/distro/target/tomcat>
[delete] Deleting directory <https://builds.apache.org/job/oozie-trunk-precommit-build/ws/distro/target/tomcat/oozie-server/webapps>
[mkdir] Created dir: <https://builds.apache.org/job/oozie-trunk-precommit-build/ws/distro/target/tomcat/oozie-server/webapps>
[delete] Deleting: <https://builds.apache.org/job/oozie-trunk-precommit-build/ws/distro/target/tomcat/oozie-server/conf/server.xml>
[copy] Copying 1 file to <https://builds.apache.org/job/oozie-trunk-precommit-build/ws/distro/target/tomcat/oozie-server/conf>
[mkdir] Created dir: <https://builds.apache.org/job/oozie-trunk-precommit-build/ws/distro/target/tomcat/oozie-server/conf/ssl>
[copy] Copying 1 file to <https://builds.apache.org/job/oozie-trunk-precommit-build/ws/distro/target/tomcat/oozie-server/conf/ssl>
[copy] Copying 1 file to <https://builds.apache.org/job/oozie-trunk-precommit-build/ws/distro/target/tomcat/oozie-server/conf/ssl>
[copy] Copying 1 file to <https://builds.apache.org/job/oozie-trunk-precommit-build/ws/distro/target/tomcat/oozie-server/conf/ssl>
[copy] Copying 3 files to <https://builds.apache.org/job/oozie-trunk-precommit-build/ws/distro/target/tomcat/oozie-server/webapps/ROOT>
[INFO] Executed tasks
[INFO]
[INFO] --- maven-assembly-plugin:2.2.1:single (default-cli) @ oozie-distro ---
[INFO] Reading assembly descriptor: ../src/main/assemblies/distro.xml
[INFO] Copying files to <https://builds.apache.org/job/oozie-trunk-precommit-build/ws/distro/target/oozie-4.4.0-SNAPSHOT-distro>
[WARNING] Assembly file: <https://builds.apache.org/job/oozie-trunk-precommit-build/ws/distro/target/oozie-4.4.0-SNAPSHOT-distro> is not a regular file (it may be a directory). It cannot be attached to the project build for installation or deployment.
[INFO] Building tar : <https://builds.apache.org/job/oozie-trunk-precommit-build/ws/distro/target/oozie-4.4.0-SNAPSHOT-distro.tar.gz>
[INFO]
[INFO] ------------------------------------------------------------------------
[INFO] Building Apache Oozie ZooKeeper Security Tests 4.4.0-SNAPSHOT
[INFO] ------------------------------------------------------------------------
[INFO]
[INFO] --- maven-remote-resources-plugin:1.5:process (default) @ oozie-zookeeper-security-tests ---
[INFO]
[INFO] --- maven-resources-plugin:2.5:resources (default-resources) @ oozie-zookeeper-security-tests ---
[debug] execute contextualize
[INFO] Using 'UTF-8' encoding to copy filtered resources.
[INFO] skip non existing resourceDirectory <https://builds.apache.org/job/oozie-trunk-precommit-build/ws/zookeeper-security-tests/src/main/resources>
[INFO] Copying 3 resources
[INFO]
[INFO] --- maven-compiler-plugin:2.3.2:compile (default-compile) @ oozie-zookeeper-security-tests ---
[INFO] No sources to compile
[INFO]
[INFO] --- maven-resources-plugin:2.5:testResources (default-testResources) @ oozie-zookeeper-security-tests ---
[debug] execute contextualize
[INFO] Using 'UTF-8' encoding to copy filtered resources.
[INFO] skip non existing resourceDirectory <https://builds.apache.org/job/oozie-trunk-precommit-build/ws/zookeeper-security-tests/src/test/resources>
[INFO] Copying 3 resources
[INFO]
[INFO] --- maven-compiler-plugin:2.3.2:testCompile (default-testCompile) @ oozie-zookeeper-security-tests ---
[INFO] Nothing to compile - all classes are up to date
[INFO]
[INFO] --- maven-surefire-plugin:2.12.2:test (default-test) @ oozie-zookeeper-security-tests ---
[INFO] Tests are skipped.
[INFO]
[INFO] --- maven-jar-plugin:2.3.1:jar (default-jar) @ oozie-zookeeper-security-tests ---
[INFO] Building jar: <https://builds.apache.org/job/oozie-trunk-precommit-build/ws/zookeeper-security-tests/target/oozie-zookeeper-security-tests-4.4.0-SNAPSHOT.jar>
[INFO]
[INFO] --- maven-site-plugin:2.0-beta-6:attach-descriptor (attach-descriptor) @ oozie-zookeeper-security-tests ---
[INFO]
[INFO] --- maven-assembly-plugin:2.2.1:single (default-cli) @ oozie-zookeeper-security-tests ---
[INFO] Reading assembly descriptor: src/main/assemblies/empty.xml
[INFO] ------------------------------------------------------------------------
[INFO] Reactor Summary:
[INFO]
[INFO] Apache Oozie Main .................................. SUCCESS [ 1.676 s]
[INFO] Apache Oozie Hadoop Utils hadoop-2-4.4.0-SNAPSHOT .. SUCCESS [ 2.274 s]
[INFO] Apache Oozie Hadoop Distcp hadoop-2-4.4.0-SNAPSHOT . SUCCESS [ 0.163 s]
[INFO] Apache Oozie Hadoop Auth hadoop-2-4.4.0-SNAPSHOT Test SUCCESS [ 0.334 s]
[INFO] Apache Oozie Hadoop Libs ........................... SUCCESS [ 0.026 s]
[INFO] Apache Oozie Client ................................ SUCCESS [ 25.114 s]
[INFO] Apache Oozie Share Lib Oozie ....................... SUCCESS [ 1.835 s]
[INFO] Apache Oozie Share Lib HCatalog .................... SUCCESS [ 1.956 s]
[INFO] Apache Oozie Share Lib Distcp ...................... SUCCESS [ 0.382 s]
[INFO] Apache Oozie Core .................................. SUCCESS [ 44.043 s]
[INFO] Apache Oozie Share Lib Streaming ................... SUCCESS [ 2.988 s]
[INFO] Apache Oozie Share Lib Pig ......................... SUCCESS [ 2.637 s]
[INFO] Apache Oozie Share Lib Hive ........................ SUCCESS [ 5.234 s]
[INFO] Apache Oozie Share Lib Hive 2 ...................... SUCCESS [ 3.751 s]
[INFO] Apache Oozie Share Lib Sqoop ....................... SUCCESS [ 0.570 s]
[INFO] Apache Oozie Examples .............................. SUCCESS [ 2.375 s]
[INFO] Apache Oozie Share Lib Spark ....................... SUCCESS [ 6.095 s]
[INFO] Apache Oozie Share Lib ............................. SUCCESS [ 23.973 s]
[INFO] Apache Oozie Docs .................................. SUCCESS [ 13.157 s]
[INFO] Apache Oozie WebApp ................................ SUCCESS [ 37.040 s]
[INFO] Apache Oozie Tools ................................. SUCCESS [ 1.430 s]
[INFO] Apache Oozie MiniOozie ............................. SUCCESS [ 0.690 s]
[INFO] Apache Oozie Distro ................................ SUCCESS [ 41.075 s]
[INFO] Apache Oozie ZooKeeper Security Tests .............. SUCCESS [ 2.492 s]
[INFO] ------------------------------------------------------------------------
[INFO] BUILD SUCCESS
[INFO] ------------------------------------------------------------------------
[INFO] Total time: 03:43 min
[INFO] Finished at: 2016-11-09T12:10:18+00:00
[INFO] Final Memory: 86M/911M
[INFO] ------------------------------------------------------------------------
Reports
Running test-patch task CLEAN
Running test-patch task RAW_PATCH_ANALYSIS
Running test-patch task RAT
Running test-patch task JAVADOC
Running test-patch task COMPILE
Running test-patch task FINDBUGS_DIFF
[TRACE] Downloading FindBugs diff JAR from https://repo1.maven.org/maven2/me/andrz/findbugs/findbugs-diff/0.1.0/findbugs-diff-0.1.0-all.jar
[TRACE] FindBugs diff JAR downloaded
[ERROR] FindBugs diff JAR has a weird MD5 sum, rejecting
[TRACE] File [<https://builds.apache.org/job/oozie-trunk-precommit-build/ws/test-patch/tmp/FINDBUGS_DIFF/diff/findbugs-diff-0.1.0-all.jar]> removed
[TRACE] File [<https://builds.apache.org/job/oozie-trunk-precommit-build/ws/test-patch/tmp/FINDBUGS_DIFF/diff/findbugs-diff-0.1.0-all.jar.md5]> removed
Running test-patch task BACKWARDS_COMPATIBILITY
Running test-patch task TESTS
Running test-patch task DISTRO
Testing JIRA OOZIE-2725
Cleaning local git workspace
----------------------------
+1 PATCH_APPLIES
+1 CLEAN
-1 RAW_PATCH_ANALYSIS
+1 the patch does not introduce any @author tags
+1 the patch does not introduce any tabs
+1 the patch does not introduce any trailing spaces
+1 the patch does not introduce any line longer than 132
-1 the patch does not add/modify any testcase
+1 RAT
+1 the patch does not seem to introduce new RAT warnings
+1 JAVADOC
+1 the patch does not seem to introduce new Javadoc warnings
+1 COMPILE
+1 HEAD compiles
+1 patch compiles
+1 the patch does not seem to introduce new javac warnings
-1 FindBugs diff JAR has a weird MD5 sum, rejecting.
+1 BACKWARDS_COMPATIBILITY
+1 the patch does not change any JPA Entity/Colum/Basic/Lob/Transient annotations
+1 the patch does not modify JPA files
+1 TESTS
Tests run: 1818
+1 DISTRO
+1 distro tarball builds with the patch
----------------------------
-1 Overall result, please check the reported -1(s)
The full output of the test-patch run is available at
https://builds.apache.org/job/oozie-trunk-precommit-build/3424/
Adding comment to JIRA
Comment added.
test-patch exit code: 1
Build step 'Execute shell' marked build as failure
Archiving artifacts
Recording test results
Build failed in Jenkins: oozie-trunk-precommit-build #3423
Posted by Apache Jenkins Server <je...@builds.apache.org>.
See <https://builds.apache.org/job/oozie-trunk-precommit-build/3423/>
------------------------------------------
[...truncated 4475 lines...]
[INFO] skip non existing resourceDirectory <https://builds.apache.org/job/oozie-trunk-precommit-build/ws/distro/src/test/resources>
[INFO] Copying 3 resources
[INFO]
[INFO] --- maven-compiler-plugin:2.3.2:testCompile (default-testCompile) @ oozie-distro ---
[INFO] No sources to compile
[INFO]
[INFO] --- maven-surefire-plugin:2.12.2:test (default-test) @ oozie-distro ---
[INFO] Tests are skipped.
[INFO]
[INFO] --- maven-jar-plugin:2.3.1:jar (default-jar) @ oozie-distro ---
[INFO] Building jar: <https://builds.apache.org/job/oozie-trunk-precommit-build/ws/distro/target/oozie-distro-4.4.0-SNAPSHOT.jar>
[INFO]
[INFO] --- maven-site-plugin:2.0-beta-6:attach-descriptor (attach-descriptor) @ oozie-distro ---
[INFO]
[INFO] --- maven-antrun-plugin:1.6:run (default) @ oozie-distro ---
[INFO] Executing tasks
main:
[get] Getting: http://archive.apache.org/dist/tomcat/tomcat-6/v6.0.44/bin/apache-tomcat-6.0.44.tar.gz
[get] To: <https://builds.apache.org/job/oozie-trunk-precommit-build/ws/distro/downloads/tomcat-6.0.44.tar.gz>
..........................................................................................................................................................................................................................................................................................................................................
[mkdir] Created dir: <https://builds.apache.org/job/oozie-trunk-precommit-build/ws/distro/target/tomcat>
[gunzip] Expanding <https://builds.apache.org/job/oozie-trunk-precommit-build/ws/distro/downloads/tomcat-6.0.44.tar.gz> to <https://builds.apache.org/job/oozie-trunk-precommit-build/ws/distro/target/tomcat/tomcat-6.0.44.tar>
[untar] Expanding: <https://builds.apache.org/job/oozie-trunk-precommit-build/ws/distro/target/tomcat/tomcat-6.0.44.tar> into <https://builds.apache.org/job/oozie-trunk-precommit-build/ws/distro/target/tomcat>
[delete] Deleting directory <https://builds.apache.org/job/oozie-trunk-precommit-build/ws/distro/target/tomcat/oozie-server/webapps>
[mkdir] Created dir: <https://builds.apache.org/job/oozie-trunk-precommit-build/ws/distro/target/tomcat/oozie-server/webapps>
[delete] Deleting: <https://builds.apache.org/job/oozie-trunk-precommit-build/ws/distro/target/tomcat/oozie-server/conf/server.xml>
[copy] Copying 1 file to <https://builds.apache.org/job/oozie-trunk-precommit-build/ws/distro/target/tomcat/oozie-server/conf>
[copy] Copying 1 file to <https://builds.apache.org/job/oozie-trunk-precommit-build/ws/distro/target/tomcat/oozie-server/conf>
[mkdir] Created dir: <https://builds.apache.org/job/oozie-trunk-precommit-build/ws/distro/target/tomcat/oozie-server/conf/ssl>
[copy] Copying 1 file to <https://builds.apache.org/job/oozie-trunk-precommit-build/ws/distro/target/tomcat/oozie-server/conf/ssl>
[copy] Copying 1 file to <https://builds.apache.org/job/oozie-trunk-precommit-build/ws/distro/target/tomcat/oozie-server/conf/ssl>
[copy] Copying 1 file to <https://builds.apache.org/job/oozie-trunk-precommit-build/ws/distro/target/tomcat/oozie-server/conf/ssl>
[copy] Copying 3 files to <https://builds.apache.org/job/oozie-trunk-precommit-build/ws/distro/target/tomcat/oozie-server/webapps/ROOT>
[INFO] Executed tasks
[INFO]
[INFO] >>> findbugs-maven-plugin:3.0.0:check (findbug) > :findbugs @ oozie-distro >>>
[INFO]
[INFO] --- findbugs-maven-plugin:3.0.0:findbugs (findbugs) @ oozie-distro ---
[INFO]
[INFO] <<< findbugs-maven-plugin:3.0.0:check (findbug) < :findbugs @ oozie-distro <<<
[INFO]
[INFO] --- findbugs-maven-plugin:3.0.0:check (findbug) @ oozie-distro ---
[INFO]
[INFO] --- xml-maven-plugin:1.0:transform (default) @ oozie-distro ---
[WARNING] The directory <https://builds.apache.org/job/oozie-trunk-precommit-build/ws/distro/target/findbugs,> which is a base directory of a ValidationSet or TransformationSet, does not exist.
[WARNING] No files found for transformation by stylesheet fancy-hist.xsl
[INFO]
[INFO] --- maven-checkstyle-plugin:2.9.1:check (default) @ oozie-distro ---
[INFO] Starting audit...
Audit done.
[INFO]
[INFO] ------------------------------------------------------------------------
[INFO] Building Apache Oozie ZooKeeper Security Tests 4.4.0-SNAPSHOT
[INFO] ------------------------------------------------------------------------
[INFO]
[INFO] --- maven-clean-plugin:2.5:clean (default-clean) @ oozie-zookeeper-security-tests ---
[INFO] Deleting <https://builds.apache.org/job/oozie-trunk-precommit-build/ws/zookeeper-security-tests/target>
[INFO]
[INFO] --- maven-remote-resources-plugin:1.5:process (default) @ oozie-zookeeper-security-tests ---
[INFO]
[INFO] --- maven-resources-plugin:2.5:resources (default-resources) @ oozie-zookeeper-security-tests ---
[debug] execute contextualize
[INFO] Using 'UTF-8' encoding to copy filtered resources.
[INFO] skip non existing resourceDirectory <https://builds.apache.org/job/oozie-trunk-precommit-build/ws/zookeeper-security-tests/src/main/resources>
[INFO] Copying 3 resources
[INFO]
[INFO] --- maven-compiler-plugin:2.3.2:compile (default-compile) @ oozie-zookeeper-security-tests ---
[INFO] No sources to compile
[INFO]
[INFO] --- maven-resources-plugin:2.5:testResources (default-testResources) @ oozie-zookeeper-security-tests ---
[debug] execute contextualize
[INFO] Using 'UTF-8' encoding to copy filtered resources.
[INFO] skip non existing resourceDirectory <https://builds.apache.org/job/oozie-trunk-precommit-build/ws/zookeeper-security-tests/src/test/resources>
[INFO] Copying 3 resources
[INFO]
[INFO] --- maven-compiler-plugin:2.3.2:testCompile (default-testCompile) @ oozie-zookeeper-security-tests ---
[INFO] Compiling 2 source files to <https://builds.apache.org/job/oozie-trunk-precommit-build/ws/zookeeper-security-tests/target/test-classes>
[INFO]
[INFO] --- maven-surefire-plugin:2.12.2:test (default-test) @ oozie-zookeeper-security-tests ---
[INFO] Tests are skipped.
[INFO]
[INFO] --- maven-jar-plugin:2.3.1:jar (default-jar) @ oozie-zookeeper-security-tests ---
[INFO] Building jar: <https://builds.apache.org/job/oozie-trunk-precommit-build/ws/zookeeper-security-tests/target/oozie-zookeeper-security-tests-4.4.0-SNAPSHOT.jar>
[INFO]
[INFO] --- maven-site-plugin:2.0-beta-6:attach-descriptor (attach-descriptor) @ oozie-zookeeper-security-tests ---
[INFO]
[INFO] >>> findbugs-maven-plugin:3.0.0:check (findbug) > :findbugs @ oozie-zookeeper-security-tests >>>
[INFO]
[INFO] --- findbugs-maven-plugin:3.0.0:findbugs (findbugs) @ oozie-zookeeper-security-tests ---
[INFO]
[INFO] <<< findbugs-maven-plugin:3.0.0:check (findbug) < :findbugs @ oozie-zookeeper-security-tests <<<
[INFO]
[INFO] --- findbugs-maven-plugin:3.0.0:check (findbug) @ oozie-zookeeper-security-tests ---
[INFO]
[INFO] --- xml-maven-plugin:1.0:transform (default) @ oozie-zookeeper-security-tests ---
[WARNING] The directory <https://builds.apache.org/job/oozie-trunk-precommit-build/ws/zookeeper-security-tests/target/findbugs,> which is a base directory of a ValidationSet or TransformationSet, does not exist.
[WARNING] No files found for transformation by stylesheet fancy-hist.xsl
[INFO]
[INFO] --- maven-checkstyle-plugin:2.9.1:check (default) @ oozie-zookeeper-security-tests ---
[INFO] Starting audit...
Audit done.
[INFO] ------------------------------------------------------------------------
[INFO] Reactor Summary:
[INFO]
[INFO] Apache Oozie Main .................................. SUCCESS [ 4.273 s]
[INFO] Apache Oozie Hadoop Utils hadoop-2-4.4.0-SNAPSHOT .. SUCCESS [ 12.872 s]
[INFO] Apache Oozie Hadoop Distcp hadoop-2-4.4.0-SNAPSHOT . SUCCESS [ 0.189 s]
[INFO] Apache Oozie Hadoop Auth hadoop-2-4.4.0-SNAPSHOT Test SUCCESS [ 0.346 s]
[INFO] Apache Oozie Hadoop Libs ........................... SUCCESS [ 0.061 s]
[INFO] Apache Oozie Client ................................ SUCCESS [ 25.456 s]
[INFO] Apache Oozie Share Lib Oozie ....................... SUCCESS [ 15.208 s]
[INFO] Apache Oozie Share Lib HCatalog .................... SUCCESS [ 10.302 s]
[INFO] Apache Oozie Share Lib Distcp ...................... SUCCESS [ 9.073 s]
[INFO] Apache Oozie Core .................................. SUCCESS [01:29 min]
[INFO] Apache Oozie Share Lib Streaming ................... SUCCESS [ 16.457 s]
[INFO] Apache Oozie Share Lib Pig ......................... SUCCESS [ 14.399 s]
[INFO] Apache Oozie Share Lib Hive ........................ SUCCESS [ 13.389 s]
[INFO] Apache Oozie Share Lib Hive 2 ...................... SUCCESS [ 12.753 s]
[INFO] Apache Oozie Share Lib Sqoop ....................... SUCCESS [ 10.247 s]
[INFO] Apache Oozie Examples .............................. SUCCESS [ 16.649 s]
[INFO] Apache Oozie Share Lib Spark ....................... SUCCESS [ 14.166 s]
[INFO] Apache Oozie Share Lib ............................. SUCCESS [ 0.057 s]
[INFO] Apache Oozie Docs .................................. SUCCESS [ 5.509 s]
[INFO] Apache Oozie WebApp ................................ SUCCESS [ 9.272 s]
[INFO] Apache Oozie Tools ................................. SUCCESS [ 16.818 s]
[INFO] Apache Oozie MiniOozie ............................. SUCCESS [ 1.542 s]
[INFO] Apache Oozie Distro ................................ SUCCESS [ 4.051 s]
[INFO] Apache Oozie ZooKeeper Security Tests .............. SUCCESS [ 7.049 s]
[INFO] ------------------------------------------------------------------------
[INFO] BUILD SUCCESS
[INFO] ------------------------------------------------------------------------
[INFO] Total time: 05:11 min
[INFO] Finished at: 2016-11-08T22:51:09+00:00
[INFO] Final Memory: 100M/1794M
[INFO] ------------------------------------------------------------------------
[TRACE] FindBugs output in HEAD verified and saved
Running test-patch task BACKWARDS_COMPATIBILITY
Running test-patch task TESTS
Running test-patch task DISTRO
Applying patch
Checking patch bin/mkdistro.sh...
Checking patch core/src/main/conf/oozie-env.sh...
Checking patch core/src/main/java/org/apache/oozie/util/ConfigUtils.java...
Checking patch core/src/main/java/org/apache/oozie/util/Instrumentation.java...
Checking patch core/src/main/resources/oozie-default.xml...
Checking patch distro/pom.xml...
error: while searching for:
<configuration>
<finalName>oozie-${project.version}</finalName>
<descriptors>
<descriptor>../src/main/assemblies/distro.xml</descriptor>
</descriptors>
</configuration>
</plugin>
<!-- Downloading Tomcat TAR.GZ, using downloads/ dir to avoid downloading over an over -->
<plugin>
<groupId>org.apache.maven.plugins</groupId>
<artifactId>maven-antrun-plugin</artifactId>
<version>1.6</version>
<executions>
<execution>
<configuration>
<target>
<mkdir dir="downloads"/>
<get src="http://archive.apache.org/dist/tomcat/tomcat-6/v${tomcat.version}/bin/apache-tomcat-${tomcat.version}.tar.gz"
dest="downloads/tomcat-${tomcat.version}.tar.gz" verbose="true" skipexisting="true"/>
<delete dir="target/tomcat"/>
<mkdir dir="target/tomcat"/>
<gunzip src="downloads/tomcat-${tomcat.version}.tar.gz"
dest="target/tomcat/tomcat-${tomcat.version}.tar"/>
<untar src="target/tomcat/tomcat-${tomcat.version}.tar" dest="target/tomcat"/>
<move file="target/tomcat/apache-tomcat-${tomcat.version}" tofile="target/tomcat/oozie-server"/>
<delete dir="target/tomcat/oozie-server/webapps"/>
<mkdir dir="target/tomcat/oozie-server/webapps"/>
<delete file="target/tomcat/oozie-server/conf/server.xml"/>
<copy file="src/main/tomcat/server.xml" toDir="target/tomcat/oozie-server/conf"/>
<copy file="src/main/tomcat/logging.properties"
toDir="target/tomcat/oozie-server/conf"/>
<mkdir dir="target/tomcat/oozie-server/conf/ssl"/>
<copy file="src/main/tomcat/server.xml" toDir="target/tomcat/oozie-server/conf/ssl"/>
<copy file="src/main/tomcat/ssl-server.xml" toDir="target/tomcat/oozie-server/conf/ssl"/>
<copy file="src/main/tomcat/ssl-web.xml" toDir="target/tomcat/oozie-server/conf/ssl"/>
<copy todir="target/tomcat/oozie-server/webapps/ROOT">
<fileset dir="src/main/tomcat/ROOT"/>
</copy>
</target>
</configuration>
<goals>
<goal>run</goal>
</goals>
<phase>package</phase>
</execution>
</executions>
</plugin>
<plugin>
<groupId>org.apache.maven.plugins</groupId>
<artifactId>maven-deploy-plugin</artifactId>
error: patch failed: distro/pom.xml:74
error: distro/pom.xml: patch does not apply
Checking patch distro/src/main/bin/oozie-jetty-server.sh...
Checking patch distro/src/main/bin/oozie-setup.sh...
Checking patch distro/src/main/bin/oozie-sys.sh...
Checking patch distro/src/main/bin/oozie-tomcat-server.sh...
Checking patch distro/src/main/bin/oozied.sh...
Checking patch pom.xml...
Checking patch server/pom.xml...
Checking patch server/src/main/assemblies/empty.xml...
Checking patch server/src/main/java/org/apache/oozie/server/EmbeddedOozieServer.java...
Checking patch server/src/main/java/org/apache/oozie/server/FilterMapper.java...
Checking patch server/src/main/java/org/apache/oozie/server/HttpConfigurationWrapper.java...
Checking patch server/src/main/java/org/apache/oozie/server/JspHandler.java...
Checking patch server/src/main/java/org/apache/oozie/server/SSLServerConnectorFactory.java...
Checking patch server/src/main/java/org/apache/oozie/server/ServletMapper.java...
Checking patch server/src/main/java/org/apache/oozie/server/WebRootResourceLocator.java...
Checking patch server/src/main/java/org/apache/oozie/server/guice/ConstraintSecurityHandlerProvider.java...
Checking patch server/src/main/java/org/apache/oozie/server/guice/JettyServerProvider.java...
Checking patch server/src/main/java/org/apache/oozie/server/guice/JspHandlerProvider.java...
Checking patch server/src/main/java/org/apache/oozie/server/guice/OozieGuiceModule.java...
Checking patch server/src/main/java/org/apache/oozie/server/guice/RewriteHandlerProvider.java...
Checking patch server/src/main/java/org/apache/oozie/server/guice/ServicesProvider.java...
Checking patch server/src/main/resources/checkstyle-header.txt...
Checking patch server/src/main/resources/checkstyle.xml...
Checking patch server/src/test/java/org/apache/oozie/server/TestEmbeddedOozieServer.java...
Checking patch server/src/test/java/org/apache/oozie/server/TestJspHandler.java...
Checking patch server/src/test/java/org/apache/oozie/server/TestSSLServerConnectorFactory.java...
Checking patch src/main/assemblies/distro-jetty.xml...
Checking patch src/main/assemblies/distro-tomcat.xml...
Checking patch src/main/assemblies/distro.xml...
Checking patch webapp/src/main/webapp/403.html...
Checking patch webapp/src/main/webapp/404.html...
fatal: git diff header lacks filename information when removing 1 leading pathname component (line 1180)
Patch failed to apply to head of branch
Adding comment to JIRA
Comment added.
test-patch exit code: 1
Build step 'Execute shell' marked build as failure
Archiving artifacts
Recording test results
ERROR: Step ?Publish JUnit test result report? failed: No test report files were found. Configuration error?
Build failed in Jenkins: oozie-trunk-precommit-build #3422
Posted by Apache Jenkins Server <je...@builds.apache.org>.
See <https://builds.apache.org/job/oozie-trunk-precommit-build/3422/>
------------------------------------------
[...truncated 12072 lines...]
[INFO]
[INFO] --- maven-jar-plugin:2.3.1:jar (default-jar) @ oozie-tools ---
[INFO] Building jar: <https://builds.apache.org/job/oozie-trunk-precommit-build/ws/tools/target/oozie-tools-4.4.0-SNAPSHOT.jar>
[INFO]
[INFO] --- maven-site-plugin:2.0-beta-6:attach-descriptor (attach-descriptor) @ oozie-tools ---
[INFO]
[INFO] --- maven-assembly-plugin:2.2.1:single (default-cli) @ oozie-tools ---
[INFO] Reading assembly descriptor: ../src/main/assemblies/tools.xml
[WARNING] The following patterns were never triggered in this artifact exclusion filter:
o '*:*:pom:*'
[INFO] Copying files to <https://builds.apache.org/job/oozie-trunk-precommit-build/ws/tools/target/oozie-tools-4.4.0-SNAPSHOT-tools>
[WARNING] Assembly file: <https://builds.apache.org/job/oozie-trunk-precommit-build/ws/tools/target/oozie-tools-4.4.0-SNAPSHOT-tools> is not a regular file (it may be a directory). It cannot be attached to the project build for installation or deployment.
[INFO]
[INFO] ------------------------------------------------------------------------
[INFO] Building Apache Oozie MiniOozie 4.4.0-SNAPSHOT
[INFO] ------------------------------------------------------------------------
[INFO]
[INFO] --- maven-remote-resources-plugin:1.5:process (default) @ oozie-mini ---
[INFO]
[INFO] --- maven-resources-plugin:2.5:resources (default-resources) @ oozie-mini ---
[debug] execute contextualize
[INFO] Using 'UTF-8' encoding to copy filtered resources.
[INFO] skip non existing resourceDirectory <https://builds.apache.org/job/oozie-trunk-precommit-build/ws/minitest/src/main/resources>
[INFO] Copying 3 resources
[INFO]
[INFO] --- maven-compiler-plugin:2.3.2:compile (default-compile) @ oozie-mini ---
[INFO] No sources to compile
[INFO]
[INFO] --- maven-resources-plugin:2.5:testResources (default-testResources) @ oozie-mini ---
[debug] execute contextualize
[INFO] Using 'UTF-8' encoding to copy filtered resources.
[INFO] Copying 3 resources
[INFO] Copying 3 resources
[INFO]
[INFO] --- maven-compiler-plugin:2.3.2:testCompile (default-testCompile) @ oozie-mini ---
[INFO] Nothing to compile - all classes are up to date
[INFO]
[INFO] --- maven-surefire-plugin:2.12.2:test (default-test) @ oozie-mini ---
[INFO] Tests are skipped.
[INFO]
[INFO] --- maven-jar-plugin:2.3.1:jar (default-jar) @ oozie-mini ---
[INFO] Building jar: <https://builds.apache.org/job/oozie-trunk-precommit-build/ws/minitest/target/oozie-mini-4.4.0-SNAPSHOT.jar>
[INFO]
[INFO] --- maven-site-plugin:2.0-beta-6:attach-descriptor (attach-descriptor) @ oozie-mini ---
[INFO]
[INFO] --- maven-assembly-plugin:2.2.1:single (default-cli) @ oozie-mini ---
[INFO] Reading assembly descriptor: src/main/assemblies/empty.xml
[INFO]
[INFO] ------------------------------------------------------------------------
[INFO] Building Apache Oozie Distro 4.4.0-SNAPSHOT
[INFO] ------------------------------------------------------------------------
[INFO]
[INFO] --- maven-remote-resources-plugin:1.5:process (default) @ oozie-distro ---
[INFO]
[INFO] --- maven-resources-plugin:2.5:resources (default-resources) @ oozie-distro ---
[debug] execute contextualize
[INFO] Using 'UTF-8' encoding to copy filtered resources.
[INFO] skip non existing resourceDirectory <https://builds.apache.org/job/oozie-trunk-precommit-build/ws/distro/src/main/resources>
[INFO] Copying 3 resources
[INFO]
[INFO] --- maven-compiler-plugin:2.3.2:compile (default-compile) @ oozie-distro ---
[INFO] No sources to compile
[INFO]
[INFO] --- maven-resources-plugin:2.5:testResources (default-testResources) @ oozie-distro ---
[debug] execute contextualize
[INFO] Using 'UTF-8' encoding to copy filtered resources.
[INFO] skip non existing resourceDirectory <https://builds.apache.org/job/oozie-trunk-precommit-build/ws/distro/src/test/resources>
[INFO] Copying 3 resources
[INFO]
[INFO] --- maven-compiler-plugin:2.3.2:testCompile (default-testCompile) @ oozie-distro ---
[INFO] No sources to compile
[INFO]
[INFO] --- maven-surefire-plugin:2.12.2:test (default-test) @ oozie-distro ---
[INFO] Tests are skipped.
[INFO]
[INFO] --- maven-jar-plugin:2.3.1:jar (default-jar) @ oozie-distro ---
[INFO] Building jar: <https://builds.apache.org/job/oozie-trunk-precommit-build/ws/distro/target/oozie-distro-4.4.0-SNAPSHOT.jar>
[INFO]
[INFO] --- maven-site-plugin:2.0-beta-6:attach-descriptor (attach-descriptor) @ oozie-distro ---
[INFO]
[INFO] --- maven-antrun-plugin:1.6:run (default) @ oozie-distro ---
[INFO] Executing tasks
main:
[get] Destination already exists (skipping): <https://builds.apache.org/job/oozie-trunk-precommit-build/ws/distro/downloads/tomcat-6.0.44.tar.gz>
[delete] Deleting directory <https://builds.apache.org/job/oozie-trunk-precommit-build/ws/distro/target/tomcat>
[mkdir] Created dir: <https://builds.apache.org/job/oozie-trunk-precommit-build/ws/distro/target/tomcat>
[gunzip] Expanding <https://builds.apache.org/job/oozie-trunk-precommit-build/ws/distro/downloads/tomcat-6.0.44.tar.gz> to <https://builds.apache.org/job/oozie-trunk-precommit-build/ws/distro/target/tomcat/tomcat-6.0.44.tar>
[untar] Expanding: <https://builds.apache.org/job/oozie-trunk-precommit-build/ws/distro/target/tomcat/tomcat-6.0.44.tar> into <https://builds.apache.org/job/oozie-trunk-precommit-build/ws/distro/target/tomcat>
[delete] Deleting directory <https://builds.apache.org/job/oozie-trunk-precommit-build/ws/distro/target/tomcat/oozie-server/webapps>
[mkdir] Created dir: <https://builds.apache.org/job/oozie-trunk-precommit-build/ws/distro/target/tomcat/oozie-server/webapps>
[delete] Deleting: <https://builds.apache.org/job/oozie-trunk-precommit-build/ws/distro/target/tomcat/oozie-server/conf/server.xml>
[copy] Copying 1 file to <https://builds.apache.org/job/oozie-trunk-precommit-build/ws/distro/target/tomcat/oozie-server/conf>
[copy] Copying 1 file to <https://builds.apache.org/job/oozie-trunk-precommit-build/ws/distro/target/tomcat/oozie-server/conf>
[mkdir] Created dir: <https://builds.apache.org/job/oozie-trunk-precommit-build/ws/distro/target/tomcat/oozie-server/conf/ssl>
[copy] Copying 1 file to <https://builds.apache.org/job/oozie-trunk-precommit-build/ws/distro/target/tomcat/oozie-server/conf/ssl>
[copy] Copying 1 file to <https://builds.apache.org/job/oozie-trunk-precommit-build/ws/distro/target/tomcat/oozie-server/conf/ssl>
[copy] Copying 1 file to <https://builds.apache.org/job/oozie-trunk-precommit-build/ws/distro/target/tomcat/oozie-server/conf/ssl>
[copy] Copying 3 files to <https://builds.apache.org/job/oozie-trunk-precommit-build/ws/distro/target/tomcat/oozie-server/webapps/ROOT>
[INFO] Executed tasks
[INFO]
[INFO] --- maven-assembly-plugin:2.2.1:single (default-cli) @ oozie-distro ---
[INFO] Reading assembly descriptor: ../src/main/assemblies/distro.xml
[INFO] Copying files to <https://builds.apache.org/job/oozie-trunk-precommit-build/ws/distro/target/oozie-4.4.0-SNAPSHOT-distro>
[WARNING] Assembly file: <https://builds.apache.org/job/oozie-trunk-precommit-build/ws/distro/target/oozie-4.4.0-SNAPSHOT-distro> is not a regular file (it may be a directory). It cannot be attached to the project build for installation or deployment.
[INFO] Building tar : <https://builds.apache.org/job/oozie-trunk-precommit-build/ws/distro/target/oozie-4.4.0-SNAPSHOT-distro.tar.gz>
[INFO]
[INFO] ------------------------------------------------------------------------
[INFO] Building Apache Oozie ZooKeeper Security Tests 4.4.0-SNAPSHOT
[INFO] ------------------------------------------------------------------------
[INFO]
[INFO] --- maven-remote-resources-plugin:1.5:process (default) @ oozie-zookeeper-security-tests ---
[INFO]
[INFO] --- maven-resources-plugin:2.5:resources (default-resources) @ oozie-zookeeper-security-tests ---
[debug] execute contextualize
[INFO] Using 'UTF-8' encoding to copy filtered resources.
[INFO] skip non existing resourceDirectory <https://builds.apache.org/job/oozie-trunk-precommit-build/ws/zookeeper-security-tests/src/main/resources>
[INFO] Copying 3 resources
[INFO]
[INFO] --- maven-compiler-plugin:2.3.2:compile (default-compile) @ oozie-zookeeper-security-tests ---
[INFO] No sources to compile
[INFO]
[INFO] --- maven-resources-plugin:2.5:testResources (default-testResources) @ oozie-zookeeper-security-tests ---
[debug] execute contextualize
[INFO] Using 'UTF-8' encoding to copy filtered resources.
[INFO] skip non existing resourceDirectory <https://builds.apache.org/job/oozie-trunk-precommit-build/ws/zookeeper-security-tests/src/test/resources>
[INFO] Copying 3 resources
[INFO]
[INFO] --- maven-compiler-plugin:2.3.2:testCompile (default-testCompile) @ oozie-zookeeper-security-tests ---
[INFO] Nothing to compile - all classes are up to date
[INFO]
[INFO] --- maven-surefire-plugin:2.12.2:test (default-test) @ oozie-zookeeper-security-tests ---
[INFO] Tests are skipped.
[INFO]
[INFO] --- maven-jar-plugin:2.3.1:jar (default-jar) @ oozie-zookeeper-security-tests ---
[INFO] Building jar: <https://builds.apache.org/job/oozie-trunk-precommit-build/ws/zookeeper-security-tests/target/oozie-zookeeper-security-tests-4.4.0-SNAPSHOT.jar>
[INFO]
[INFO] --- maven-site-plugin:2.0-beta-6:attach-descriptor (attach-descriptor) @ oozie-zookeeper-security-tests ---
[INFO]
[INFO] --- maven-assembly-plugin:2.2.1:single (default-cli) @ oozie-zookeeper-security-tests ---
[INFO] Reading assembly descriptor: src/main/assemblies/empty.xml
[INFO] ------------------------------------------------------------------------
[INFO] Reactor Summary:
[INFO]
[INFO] Apache Oozie Main .................................. SUCCESS [ 1.690 s]
[INFO] Apache Oozie Hadoop Utils hadoop-2-4.4.0-SNAPSHOT .. SUCCESS [ 2.252 s]
[INFO] Apache Oozie Hadoop Distcp hadoop-2-4.4.0-SNAPSHOT . SUCCESS [ 0.160 s]
[INFO] Apache Oozie Hadoop Auth hadoop-2-4.4.0-SNAPSHOT Test SUCCESS [ 0.319 s]
[INFO] Apache Oozie Hadoop Libs ........................... SUCCESS [ 0.025 s]
[INFO] Apache Oozie Client ................................ SUCCESS [ 24.011 s]
[INFO] Apache Oozie Share Lib Oozie ....................... SUCCESS [ 1.883 s]
[INFO] Apache Oozie Share Lib HCatalog .................... SUCCESS [ 1.898 s]
[INFO] Apache Oozie Share Lib Distcp ...................... SUCCESS [ 0.391 s]
[INFO] Apache Oozie Core .................................. SUCCESS [ 37.256 s]
[INFO] Apache Oozie Share Lib Streaming ................... SUCCESS [ 2.912 s]
[INFO] Apache Oozie Share Lib Pig ......................... SUCCESS [ 2.823 s]
[INFO] Apache Oozie Share Lib Hive ........................ SUCCESS [ 5.120 s]
[INFO] Apache Oozie Share Lib Hive 2 ...................... SUCCESS [ 3.968 s]
[INFO] Apache Oozie Share Lib Sqoop ....................... SUCCESS [ 0.600 s]
[INFO] Apache Oozie Examples .............................. SUCCESS [ 2.407 s]
[INFO] Apache Oozie Share Lib Spark ....................... SUCCESS [ 6.004 s]
[INFO] Apache Oozie Share Lib ............................. SUCCESS [ 22.956 s]
[INFO] Apache Oozie Docs .................................. SUCCESS [ 12.488 s]
[INFO] Apache Oozie WebApp ................................ SUCCESS [ 36.120 s]
[INFO] Apache Oozie Tools ................................. SUCCESS [ 1.314 s]
[INFO] Apache Oozie MiniOozie ............................. SUCCESS [ 0.684 s]
[INFO] Apache Oozie Distro ................................ SUCCESS [ 40.198 s]
[INFO] Apache Oozie ZooKeeper Security Tests .............. SUCCESS [ 2.476 s]
[INFO] ------------------------------------------------------------------------
[INFO] BUILD SUCCESS
[INFO] ------------------------------------------------------------------------
[INFO] Total time: 03:31 min
[INFO] Finished at: 2016-11-08T14:23:17+00:00
[INFO] Final Memory: 83M/1073M
[INFO] ------------------------------------------------------------------------
Reports
Running test-patch task CLEAN
Running test-patch task RAW_PATCH_ANALYSIS
Running test-patch task RAT
Running test-patch task JAVADOC
Running test-patch task COMPILE
Running test-patch task FINDBUGS_DIFF
[TRACE] Downloading FindBugs diff JAR from https://repo1.maven.org/maven2/me/andrz/findbugs/findbugs-diff/0.1.0/findbugs-diff-0.1.0-all.jar
[TRACE] FindBugs diff JAR downloaded
[ERROR] FindBugs diff JAR has a weird MD5 sum, rejecting
[TRACE] File [<https://builds.apache.org/job/oozie-trunk-precommit-build/ws/test-patch/tmp/FINDBUGS_DIFF/diff/findbugs-diff-0.1.0-all.jar]> removed
[TRACE] File [<https://builds.apache.org/job/oozie-trunk-precommit-build/ws/test-patch/tmp/FINDBUGS_DIFF/diff/findbugs-diff-0.1.0-all.jar.md5]> removed
Running test-patch task BACKWARDS_COMPATIBILITY
Running test-patch task TESTS
Running test-patch task DISTRO
Testing JIRA OOZIE-2723
Cleaning local git workspace
----------------------------
+1 PATCH_APPLIES
+1 CLEAN
+1 RAW_PATCH_ANALYSIS
+1 the patch does not introduce any @author tags
+1 the patch does not introduce any tabs
+1 the patch does not introduce any trailing spaces
+1 the patch does not introduce any line longer than 132
+1 the patch does adds/modifies 1 testcase(s)
+1 RAT
+1 the patch does not seem to introduce new RAT warnings
+1 JAVADOC
+1 the patch does not seem to introduce new Javadoc warnings
+1 COMPILE
+1 HEAD compiles
+1 patch compiles
+1 the patch does not seem to introduce new javac warnings
-1 FindBugs diff JAR has a weird MD5 sum, rejecting.
+1 BACKWARDS_COMPATIBILITY
+1 the patch does not change any JPA Entity/Colum/Basic/Lob/Transient annotations
+1 the patch does not modify JPA files
-1 TESTS
Tests run: 1818
Tests failed: 2
Tests errors: 0
The patch failed the following testcases:
testMaterizationLookup(org.apache.oozie.command.coord.TestCoordMaterializeTransitionXCommand)
testHive2Action(org.apache.oozie.action.hadoop.TestHive2ActionExecutor)
+1 DISTRO
+1 distro tarball builds with the patch
----------------------------
-1 Overall result, please check the reported -1(s)
The full output of the test-patch run is available at
https://builds.apache.org/job/oozie-trunk-precommit-build/3422/
Adding comment to JIRA
Comment added.
test-patch exit code: 1
Build step 'Execute shell' marked build as failure
Archiving artifacts
Recording test results
Build failed in Jenkins: oozie-trunk-precommit-build #3421
Posted by Apache Jenkins Server <je...@builds.apache.org>.
See <https://builds.apache.org/job/oozie-trunk-precommit-build/3421/>
------------------------------------------
[...truncated 12094 lines...]
[INFO] --- maven-site-plugin:2.0-beta-6:attach-descriptor (attach-descriptor) @ oozie-tools ---
[INFO]
[INFO] --- maven-assembly-plugin:2.2.1:single (default-cli) @ oozie-tools ---
[INFO] Reading assembly descriptor: ../src/main/assemblies/tools.xml
[WARNING] The following patterns were never triggered in this artifact exclusion filter:
o '*:*:pom:*'
[INFO] Copying files to <https://builds.apache.org/job/oozie-trunk-precommit-build/ws/tools/target/oozie-tools-4.4.0-SNAPSHOT-tools>
[WARNING] Assembly file: <https://builds.apache.org/job/oozie-trunk-precommit-build/ws/tools/target/oozie-tools-4.4.0-SNAPSHOT-tools> is not a regular file (it may be a directory). It cannot be attached to the project build for installation or deployment.
[INFO]
[INFO] ------------------------------------------------------------------------
[INFO] Building Apache Oozie MiniOozie 4.4.0-SNAPSHOT
[INFO] ------------------------------------------------------------------------
[INFO]
[INFO] --- maven-remote-resources-plugin:1.5:process (default) @ oozie-mini ---
[INFO]
[INFO] --- maven-resources-plugin:2.5:resources (default-resources) @ oozie-mini ---
[debug] execute contextualize
[INFO] Using 'UTF-8' encoding to copy filtered resources.
[INFO] skip non existing resourceDirectory <https://builds.apache.org/job/oozie-trunk-precommit-build/ws/minitest/src/main/resources>
[INFO] Copying 3 resources
[INFO]
[INFO] --- maven-compiler-plugin:2.3.2:compile (default-compile) @ oozie-mini ---
[INFO] No sources to compile
[INFO]
[INFO] --- maven-resources-plugin:2.5:testResources (default-testResources) @ oozie-mini ---
[debug] execute contextualize
[INFO] Using 'UTF-8' encoding to copy filtered resources.
[INFO] Copying 3 resources
[INFO] Copying 3 resources
[INFO]
[INFO] --- maven-compiler-plugin:2.3.2:testCompile (default-testCompile) @ oozie-mini ---
[INFO] Nothing to compile - all classes are up to date
[INFO]
[INFO] --- maven-surefire-plugin:2.12.2:test (default-test) @ oozie-mini ---
[INFO] Tests are skipped.
[INFO]
[INFO] --- maven-jar-plugin:2.3.1:jar (default-jar) @ oozie-mini ---
[INFO] Building jar: <https://builds.apache.org/job/oozie-trunk-precommit-build/ws/minitest/target/oozie-mini-4.4.0-SNAPSHOT.jar>
[INFO]
[INFO] --- maven-site-plugin:2.0-beta-6:attach-descriptor (attach-descriptor) @ oozie-mini ---
[INFO]
[INFO] --- maven-assembly-plugin:2.2.1:single (default-cli) @ oozie-mini ---
[INFO] Reading assembly descriptor: src/main/assemblies/empty.xml
[INFO]
[INFO] ------------------------------------------------------------------------
[INFO] Building Apache Oozie Distro 4.4.0-SNAPSHOT
[INFO] ------------------------------------------------------------------------
[INFO]
[INFO] --- maven-remote-resources-plugin:1.5:process (default) @ oozie-distro ---
[INFO]
[INFO] --- maven-resources-plugin:2.5:resources (default-resources) @ oozie-distro ---
[debug] execute contextualize
[INFO] Using 'UTF-8' encoding to copy filtered resources.
[INFO] skip non existing resourceDirectory <https://builds.apache.org/job/oozie-trunk-precommit-build/ws/distro/src/main/resources>
[INFO] Copying 3 resources
[INFO]
[INFO] --- maven-compiler-plugin:2.3.2:compile (default-compile) @ oozie-distro ---
[INFO] No sources to compile
[INFO]
[INFO] --- maven-resources-plugin:2.5:testResources (default-testResources) @ oozie-distro ---
[debug] execute contextualize
[INFO] Using 'UTF-8' encoding to copy filtered resources.
[INFO] skip non existing resourceDirectory <https://builds.apache.org/job/oozie-trunk-precommit-build/ws/distro/src/test/resources>
[INFO] Copying 3 resources
[INFO]
[INFO] --- maven-compiler-plugin:2.3.2:testCompile (default-testCompile) @ oozie-distro ---
[INFO] No sources to compile
[INFO]
[INFO] --- maven-surefire-plugin:2.12.2:test (default-test) @ oozie-distro ---
[INFO] Tests are skipped.
[INFO]
[INFO] --- maven-jar-plugin:2.3.1:jar (default-jar) @ oozie-distro ---
[INFO] Building jar: <https://builds.apache.org/job/oozie-trunk-precommit-build/ws/distro/target/oozie-distro-4.4.0-SNAPSHOT.jar>
[INFO]
[INFO] --- maven-site-plugin:2.0-beta-6:attach-descriptor (attach-descriptor) @ oozie-distro ---
[INFO]
[INFO] --- maven-antrun-plugin:1.6:run (default) @ oozie-distro ---
[INFO] Executing tasks
main:
[get] Destination already exists (skipping): <https://builds.apache.org/job/oozie-trunk-precommit-build/ws/distro/downloads/tomcat-6.0.44.tar.gz>
[delete] Deleting directory <https://builds.apache.org/job/oozie-trunk-precommit-build/ws/distro/target/tomcat>
[mkdir] Created dir: <https://builds.apache.org/job/oozie-trunk-precommit-build/ws/distro/target/tomcat>
[gunzip] Expanding <https://builds.apache.org/job/oozie-trunk-precommit-build/ws/distro/downloads/tomcat-6.0.44.tar.gz> to <https://builds.apache.org/job/oozie-trunk-precommit-build/ws/distro/target/tomcat/tomcat-6.0.44.tar>
[untar] Expanding: <https://builds.apache.org/job/oozie-trunk-precommit-build/ws/distro/target/tomcat/tomcat-6.0.44.tar> into <https://builds.apache.org/job/oozie-trunk-precommit-build/ws/distro/target/tomcat>
[delete] Deleting directory <https://builds.apache.org/job/oozie-trunk-precommit-build/ws/distro/target/tomcat/oozie-server/webapps>
[mkdir] Created dir: <https://builds.apache.org/job/oozie-trunk-precommit-build/ws/distro/target/tomcat/oozie-server/webapps>
[delete] Deleting: <https://builds.apache.org/job/oozie-trunk-precommit-build/ws/distro/target/tomcat/oozie-server/conf/server.xml>
[copy] Copying 1 file to <https://builds.apache.org/job/oozie-trunk-precommit-build/ws/distro/target/tomcat/oozie-server/conf>
[copy] Copying 1 file to <https://builds.apache.org/job/oozie-trunk-precommit-build/ws/distro/target/tomcat/oozie-server/conf>
[mkdir] Created dir: <https://builds.apache.org/job/oozie-trunk-precommit-build/ws/distro/target/tomcat/oozie-server/conf/ssl>
[copy] Copying 1 file to <https://builds.apache.org/job/oozie-trunk-precommit-build/ws/distro/target/tomcat/oozie-server/conf/ssl>
[copy] Copying 1 file to <https://builds.apache.org/job/oozie-trunk-precommit-build/ws/distro/target/tomcat/oozie-server/conf/ssl>
[copy] Copying 1 file to <https://builds.apache.org/job/oozie-trunk-precommit-build/ws/distro/target/tomcat/oozie-server/conf/ssl>
[copy] Copying 3 files to <https://builds.apache.org/job/oozie-trunk-precommit-build/ws/distro/target/tomcat/oozie-server/webapps/ROOT>
[INFO] Executed tasks
[INFO]
[INFO] --- maven-assembly-plugin:2.2.1:single (default-cli) @ oozie-distro ---
[INFO] Reading assembly descriptor: ../src/main/assemblies/distro.xml
[INFO] Copying files to <https://builds.apache.org/job/oozie-trunk-precommit-build/ws/distro/target/oozie-4.4.0-SNAPSHOT-distro>
[WARNING] Assembly file: <https://builds.apache.org/job/oozie-trunk-precommit-build/ws/distro/target/oozie-4.4.0-SNAPSHOT-distro> is not a regular file (it may be a directory). It cannot be attached to the project build for installation or deployment.
[INFO] Building tar : <https://builds.apache.org/job/oozie-trunk-precommit-build/ws/distro/target/oozie-4.4.0-SNAPSHOT-distro.tar.gz>
[INFO]
[INFO] ------------------------------------------------------------------------
[INFO] Building Apache Oozie ZooKeeper Security Tests 4.4.0-SNAPSHOT
[INFO] ------------------------------------------------------------------------
[INFO]
[INFO] --- maven-remote-resources-plugin:1.5:process (default) @ oozie-zookeeper-security-tests ---
[INFO]
[INFO] --- maven-resources-plugin:2.5:resources (default-resources) @ oozie-zookeeper-security-tests ---
[debug] execute contextualize
[INFO] Using 'UTF-8' encoding to copy filtered resources.
[INFO] skip non existing resourceDirectory <https://builds.apache.org/job/oozie-trunk-precommit-build/ws/zookeeper-security-tests/src/main/resources>
[INFO] Copying 3 resources
[INFO]
[INFO] --- maven-compiler-plugin:2.3.2:compile (default-compile) @ oozie-zookeeper-security-tests ---
[INFO] No sources to compile
[INFO]
[INFO] --- maven-resources-plugin:2.5:testResources (default-testResources) @ oozie-zookeeper-security-tests ---
[debug] execute contextualize
[INFO] Using 'UTF-8' encoding to copy filtered resources.
[INFO] skip non existing resourceDirectory <https://builds.apache.org/job/oozie-trunk-precommit-build/ws/zookeeper-security-tests/src/test/resources>
[INFO] Copying 3 resources
[INFO]
[INFO] --- maven-compiler-plugin:2.3.2:testCompile (default-testCompile) @ oozie-zookeeper-security-tests ---
[INFO] Nothing to compile - all classes are up to date
[INFO]
[INFO] --- maven-surefire-plugin:2.12.2:test (default-test) @ oozie-zookeeper-security-tests ---
[INFO] Tests are skipped.
[INFO]
[INFO] --- maven-jar-plugin:2.3.1:jar (default-jar) @ oozie-zookeeper-security-tests ---
[INFO] Building jar: <https://builds.apache.org/job/oozie-trunk-precommit-build/ws/zookeeper-security-tests/target/oozie-zookeeper-security-tests-4.4.0-SNAPSHOT.jar>
[INFO]
[INFO] --- maven-site-plugin:2.0-beta-6:attach-descriptor (attach-descriptor) @ oozie-zookeeper-security-tests ---
[INFO]
[INFO] --- maven-assembly-plugin:2.2.1:single (default-cli) @ oozie-zookeeper-security-tests ---
[INFO] Reading assembly descriptor: src/main/assemblies/empty.xml
[INFO] ------------------------------------------------------------------------
[INFO] Reactor Summary:
[INFO]
[INFO] Apache Oozie Main .................................. SUCCESS [ 1.549 s]
[INFO] Apache Oozie Hadoop Utils hadoop-2-4.4.0-SNAPSHOT .. SUCCESS [ 2.639 s]
[INFO] Apache Oozie Hadoop Distcp hadoop-2-4.4.0-SNAPSHOT . SUCCESS [ 0.157 s]
[INFO] Apache Oozie Hadoop Auth hadoop-2-4.4.0-SNAPSHOT Test SUCCESS [ 0.329 s]
[INFO] Apache Oozie Hadoop Libs ........................... SUCCESS [ 0.025 s]
[INFO] Apache Oozie Client ................................ SUCCESS [ 23.585 s]
[INFO] Apache Oozie Share Lib Oozie ....................... SUCCESS [ 1.856 s]
[INFO] Apache Oozie Share Lib HCatalog .................... SUCCESS [ 1.992 s]
[INFO] Apache Oozie Share Lib Distcp ...................... SUCCESS [ 0.370 s]
[INFO] Apache Oozie Core .................................. SUCCESS [ 37.155 s]
[INFO] Apache Oozie Share Lib Streaming ................... SUCCESS [ 3.099 s]
[INFO] Apache Oozie Share Lib Pig ......................... SUCCESS [ 2.556 s]
[INFO] Apache Oozie Share Lib Hive ........................ SUCCESS [ 5.064 s]
[INFO] Apache Oozie Share Lib Hive 2 ...................... SUCCESS [ 3.999 s]
[INFO] Apache Oozie Share Lib Sqoop ....................... SUCCESS [ 0.602 s]
[INFO] Apache Oozie Examples .............................. SUCCESS [ 2.391 s]
[INFO] Apache Oozie Share Lib Spark ....................... SUCCESS [ 5.983 s]
[INFO] Apache Oozie Share Lib ............................. SUCCESS [ 22.657 s]
[INFO] Apache Oozie Docs .................................. SUCCESS [ 11.688 s]
[INFO] Apache Oozie WebApp ................................ SUCCESS [ 35.142 s]
[INFO] Apache Oozie Tools ................................. SUCCESS [ 1.267 s]
[INFO] Apache Oozie MiniOozie ............................. SUCCESS [ 0.681 s]
[INFO] Apache Oozie Distro ................................ SUCCESS [ 38.545 s]
[INFO] Apache Oozie ZooKeeper Security Tests .............. SUCCESS [ 2.432 s]
[INFO] ------------------------------------------------------------------------
[INFO] BUILD SUCCESS
[INFO] ------------------------------------------------------------------------
[INFO] Total time: 03:27 min
[INFO] Finished at: 2016-11-08T01:54:20+00:00
[INFO] Final Memory: 86M/1033M
[INFO] ------------------------------------------------------------------------
Reports
Running test-patch task CLEAN
Running test-patch task RAW_PATCH_ANALYSIS
Running test-patch task RAT
Running test-patch task JAVADOC
Running test-patch task COMPILE
Running test-patch task FINDBUGS_DIFF
[TRACE] Downloading FindBugs diff JAR from https://repo1.maven.org/maven2/me/andrz/findbugs/findbugs-diff/0.1.0/findbugs-diff-0.1.0-all.jar
[TRACE] FindBugs diff JAR downloaded
[ERROR] FindBugs diff JAR has a weird MD5 sum, rejecting
[TRACE] File [<https://builds.apache.org/job/oozie-trunk-precommit-build/ws/test-patch/tmp/FINDBUGS_DIFF/diff/findbugs-diff-0.1.0-all.jar]> removed
[TRACE] File [<https://builds.apache.org/job/oozie-trunk-precommit-build/ws/test-patch/tmp/FINDBUGS_DIFF/diff/findbugs-diff-0.1.0-all.jar.md5]> removed
Running test-patch task BACKWARDS_COMPATIBILITY
Running test-patch task TESTS
Running test-patch task DISTRO
Testing JIRA OOZIE-2724
Cleaning local git workspace
----------------------------
+1 PATCH_APPLIES
+1 CLEAN
+1 RAW_PATCH_ANALYSIS
+1 the patch does not introduce any @author tags
+1 the patch does not introduce any tabs
+1 the patch does not introduce any trailing spaces
+1 the patch does not introduce any line longer than 132
+1 the patch does adds/modifies 1 testcase(s)
+1 RAT
+1 the patch does not seem to introduce new RAT warnings
+1 JAVADOC
+1 the patch does not seem to introduce new Javadoc warnings
+1 COMPILE
+1 HEAD compiles
+1 patch compiles
+1 the patch does not seem to introduce new javac warnings
-1 FindBugs diff JAR has a weird MD5 sum, rejecting.
+1 BACKWARDS_COMPATIBILITY
+1 the patch does not change any JPA Entity/Colum/Basic/Lob/Transient annotations
+1 the patch does not modify JPA files
-1 TESTS
Tests run: 1818
Tests failed: 6
Tests errors: 3
The patch failed the following testcases:
testMaterizationLookup(org.apache.oozie.command.coord.TestCoordMaterializeTransitionXCommand)
testMain(org.apache.oozie.action.hadoop.TestHiveMain)
testPigScript(org.apache.oozie.action.hadoop.TestPigMain)
testEmbeddedPigWithinPython(org.apache.oozie.action.hadoop.TestPigMain)
testPig_withNullExternalID(org.apache.oozie.action.hadoop.TestPigMain)
testPigScript(org.apache.oozie.action.hadoop.TestPigMainWithOldAPI)
+1 DISTRO
+1 distro tarball builds with the patch
----------------------------
-1 Overall result, please check the reported -1(s)
The full output of the test-patch run is available at
https://builds.apache.org/job/oozie-trunk-precommit-build/3421/
Adding comment to JIRA
Comment added.
test-patch exit code: 1
Build step 'Execute shell' marked build as failure
Archiving artifacts
Recording test results
Build failed in Jenkins: oozie-trunk-precommit-build #3420
Posted by Apache Jenkins Server <je...@builds.apache.org>.
See <https://builds.apache.org/job/oozie-trunk-precommit-build/3420/>
------------------------------------------
[...truncated 12057 lines...]
[INFO] Tests are skipped.
[INFO]
[INFO] --- maven-jar-plugin:2.3.1:jar (default-jar) @ oozie-tools ---
[INFO] Building jar: <https://builds.apache.org/job/oozie-trunk-precommit-build/ws/tools/target/oozie-tools-4.4.0-SNAPSHOT.jar>
[INFO]
[INFO] --- maven-site-plugin:2.0-beta-6:attach-descriptor (attach-descriptor) @ oozie-tools ---
[INFO]
[INFO] --- maven-assembly-plugin:2.2.1:single (default-cli) @ oozie-tools ---
[INFO] Reading assembly descriptor: ../src/main/assemblies/tools.xml
[WARNING] The following patterns were never triggered in this artifact exclusion filter:
o '*:*:pom:*'
[INFO] Copying files to <https://builds.apache.org/job/oozie-trunk-precommit-build/ws/tools/target/oozie-tools-4.4.0-SNAPSHOT-tools>
[WARNING] Assembly file: <https://builds.apache.org/job/oozie-trunk-precommit-build/ws/tools/target/oozie-tools-4.4.0-SNAPSHOT-tools> is not a regular file (it may be a directory). It cannot be attached to the project build for installation or deployment.
[INFO]
[INFO] ------------------------------------------------------------------------
[INFO] Building Apache Oozie MiniOozie 4.4.0-SNAPSHOT
[INFO] ------------------------------------------------------------------------
[INFO]
[INFO] --- maven-remote-resources-plugin:1.5:process (default) @ oozie-mini ---
[INFO]
[INFO] --- maven-resources-plugin:2.5:resources (default-resources) @ oozie-mini ---
[debug] execute contextualize
[INFO] Using 'UTF-8' encoding to copy filtered resources.
[INFO] skip non existing resourceDirectory <https://builds.apache.org/job/oozie-trunk-precommit-build/ws/minitest/src/main/resources>
[INFO] Copying 3 resources
[INFO]
[INFO] --- maven-compiler-plugin:2.3.2:compile (default-compile) @ oozie-mini ---
[INFO] No sources to compile
[INFO]
[INFO] --- maven-resources-plugin:2.5:testResources (default-testResources) @ oozie-mini ---
[debug] execute contextualize
[INFO] Using 'UTF-8' encoding to copy filtered resources.
[INFO] Copying 3 resources
[INFO] Copying 3 resources
[INFO]
[INFO] --- maven-compiler-plugin:2.3.2:testCompile (default-testCompile) @ oozie-mini ---
[INFO] Nothing to compile - all classes are up to date
[INFO]
[INFO] --- maven-surefire-plugin:2.12.2:test (default-test) @ oozie-mini ---
[INFO] Tests are skipped.
[INFO]
[INFO] --- maven-jar-plugin:2.3.1:jar (default-jar) @ oozie-mini ---
[INFO] Building jar: <https://builds.apache.org/job/oozie-trunk-precommit-build/ws/minitest/target/oozie-mini-4.4.0-SNAPSHOT.jar>
[INFO]
[INFO] --- maven-site-plugin:2.0-beta-6:attach-descriptor (attach-descriptor) @ oozie-mini ---
[INFO]
[INFO] --- maven-assembly-plugin:2.2.1:single (default-cli) @ oozie-mini ---
[INFO] Reading assembly descriptor: src/main/assemblies/empty.xml
[INFO]
[INFO] ------------------------------------------------------------------------
[INFO] Building Apache Oozie Distro 4.4.0-SNAPSHOT
[INFO] ------------------------------------------------------------------------
[INFO]
[INFO] --- maven-remote-resources-plugin:1.5:process (default) @ oozie-distro ---
[INFO]
[INFO] --- maven-resources-plugin:2.5:resources (default-resources) @ oozie-distro ---
[debug] execute contextualize
[INFO] Using 'UTF-8' encoding to copy filtered resources.
[INFO] skip non existing resourceDirectory <https://builds.apache.org/job/oozie-trunk-precommit-build/ws/distro/src/main/resources>
[INFO] Copying 3 resources
[INFO]
[INFO] --- maven-compiler-plugin:2.3.2:compile (default-compile) @ oozie-distro ---
[INFO] No sources to compile
[INFO]
[INFO] --- maven-resources-plugin:2.5:testResources (default-testResources) @ oozie-distro ---
[debug] execute contextualize
[INFO] Using 'UTF-8' encoding to copy filtered resources.
[INFO] skip non existing resourceDirectory <https://builds.apache.org/job/oozie-trunk-precommit-build/ws/distro/src/test/resources>
[INFO] Copying 3 resources
[INFO]
[INFO] --- maven-compiler-plugin:2.3.2:testCompile (default-testCompile) @ oozie-distro ---
[INFO] No sources to compile
[INFO]
[INFO] --- maven-surefire-plugin:2.12.2:test (default-test) @ oozie-distro ---
[INFO] Tests are skipped.
[INFO]
[INFO] --- maven-jar-plugin:2.3.1:jar (default-jar) @ oozie-distro ---
[INFO] Building jar: <https://builds.apache.org/job/oozie-trunk-precommit-build/ws/distro/target/oozie-distro-4.4.0-SNAPSHOT.jar>
[INFO]
[INFO] --- maven-site-plugin:2.0-beta-6:attach-descriptor (attach-descriptor) @ oozie-distro ---
[INFO]
[INFO] --- maven-antrun-plugin:1.6:run (default) @ oozie-distro ---
[INFO] Executing tasks
main:
[get] Destination already exists (skipping): <https://builds.apache.org/job/oozie-trunk-precommit-build/ws/distro/downloads/tomcat-6.0.44.tar.gz>
[delete] Deleting directory <https://builds.apache.org/job/oozie-trunk-precommit-build/ws/distro/target/tomcat>
[mkdir] Created dir: <https://builds.apache.org/job/oozie-trunk-precommit-build/ws/distro/target/tomcat>
[gunzip] Expanding <https://builds.apache.org/job/oozie-trunk-precommit-build/ws/distro/downloads/tomcat-6.0.44.tar.gz> to <https://builds.apache.org/job/oozie-trunk-precommit-build/ws/distro/target/tomcat/tomcat-6.0.44.tar>
[untar] Expanding: <https://builds.apache.org/job/oozie-trunk-precommit-build/ws/distro/target/tomcat/tomcat-6.0.44.tar> into <https://builds.apache.org/job/oozie-trunk-precommit-build/ws/distro/target/tomcat>
[delete] Deleting directory <https://builds.apache.org/job/oozie-trunk-precommit-build/ws/distro/target/tomcat/oozie-server/webapps>
[mkdir] Created dir: <https://builds.apache.org/job/oozie-trunk-precommit-build/ws/distro/target/tomcat/oozie-server/webapps>
[delete] Deleting: <https://builds.apache.org/job/oozie-trunk-precommit-build/ws/distro/target/tomcat/oozie-server/conf/server.xml>
[copy] Copying 1 file to <https://builds.apache.org/job/oozie-trunk-precommit-build/ws/distro/target/tomcat/oozie-server/conf>
[copy] Copying 1 file to <https://builds.apache.org/job/oozie-trunk-precommit-build/ws/distro/target/tomcat/oozie-server/conf>
[mkdir] Created dir: <https://builds.apache.org/job/oozie-trunk-precommit-build/ws/distro/target/tomcat/oozie-server/conf/ssl>
[copy] Copying 1 file to <https://builds.apache.org/job/oozie-trunk-precommit-build/ws/distro/target/tomcat/oozie-server/conf/ssl>
[copy] Copying 1 file to <https://builds.apache.org/job/oozie-trunk-precommit-build/ws/distro/target/tomcat/oozie-server/conf/ssl>
[copy] Copying 1 file to <https://builds.apache.org/job/oozie-trunk-precommit-build/ws/distro/target/tomcat/oozie-server/conf/ssl>
[copy] Copying 3 files to <https://builds.apache.org/job/oozie-trunk-precommit-build/ws/distro/target/tomcat/oozie-server/webapps/ROOT>
[INFO] Executed tasks
[INFO]
[INFO] --- maven-assembly-plugin:2.2.1:single (default-cli) @ oozie-distro ---
[INFO] Reading assembly descriptor: ../src/main/assemblies/distro.xml
[INFO] Copying files to <https://builds.apache.org/job/oozie-trunk-precommit-build/ws/distro/target/oozie-4.4.0-SNAPSHOT-distro>
[WARNING] Assembly file: <https://builds.apache.org/job/oozie-trunk-precommit-build/ws/distro/target/oozie-4.4.0-SNAPSHOT-distro> is not a regular file (it may be a directory). It cannot be attached to the project build for installation or deployment.
[INFO] Building tar : <https://builds.apache.org/job/oozie-trunk-precommit-build/ws/distro/target/oozie-4.4.0-SNAPSHOT-distro.tar.gz>
[INFO]
[INFO] ------------------------------------------------------------------------
[INFO] Building Apache Oozie ZooKeeper Security Tests 4.4.0-SNAPSHOT
[INFO] ------------------------------------------------------------------------
[INFO]
[INFO] --- maven-remote-resources-plugin:1.5:process (default) @ oozie-zookeeper-security-tests ---
[INFO]
[INFO] --- maven-resources-plugin:2.5:resources (default-resources) @ oozie-zookeeper-security-tests ---
[debug] execute contextualize
[INFO] Using 'UTF-8' encoding to copy filtered resources.
[INFO] skip non existing resourceDirectory <https://builds.apache.org/job/oozie-trunk-precommit-build/ws/zookeeper-security-tests/src/main/resources>
[INFO] Copying 3 resources
[INFO]
[INFO] --- maven-compiler-plugin:2.3.2:compile (default-compile) @ oozie-zookeeper-security-tests ---
[INFO] No sources to compile
[INFO]
[INFO] --- maven-resources-plugin:2.5:testResources (default-testResources) @ oozie-zookeeper-security-tests ---
[debug] execute contextualize
[INFO] Using 'UTF-8' encoding to copy filtered resources.
[INFO] skip non existing resourceDirectory <https://builds.apache.org/job/oozie-trunk-precommit-build/ws/zookeeper-security-tests/src/test/resources>
[INFO] Copying 3 resources
[INFO]
[INFO] --- maven-compiler-plugin:2.3.2:testCompile (default-testCompile) @ oozie-zookeeper-security-tests ---
[INFO] Nothing to compile - all classes are up to date
[INFO]
[INFO] --- maven-surefire-plugin:2.12.2:test (default-test) @ oozie-zookeeper-security-tests ---
[INFO] Tests are skipped.
[INFO]
[INFO] --- maven-jar-plugin:2.3.1:jar (default-jar) @ oozie-zookeeper-security-tests ---
[INFO] Building jar: <https://builds.apache.org/job/oozie-trunk-precommit-build/ws/zookeeper-security-tests/target/oozie-zookeeper-security-tests-4.4.0-SNAPSHOT.jar>
[INFO]
[INFO] --- maven-site-plugin:2.0-beta-6:attach-descriptor (attach-descriptor) @ oozie-zookeeper-security-tests ---
[INFO]
[INFO] --- maven-assembly-plugin:2.2.1:single (default-cli) @ oozie-zookeeper-security-tests ---
[INFO] Reading assembly descriptor: src/main/assemblies/empty.xml
[INFO] ------------------------------------------------------------------------
[INFO] Reactor Summary:
[INFO]
[INFO] Apache Oozie Main .................................. SUCCESS [ 1.832 s]
[INFO] Apache Oozie Hadoop Utils hadoop-2-4.4.0-SNAPSHOT .. SUCCESS [ 2.459 s]
[INFO] Apache Oozie Hadoop Distcp hadoop-2-4.4.0-SNAPSHOT . SUCCESS [ 0.171 s]
[INFO] Apache Oozie Hadoop Auth hadoop-2-4.4.0-SNAPSHOT Test SUCCESS [ 0.324 s]
[INFO] Apache Oozie Hadoop Libs ........................... SUCCESS [ 0.026 s]
[INFO] Apache Oozie Client ................................ SUCCESS [ 27.614 s]
[INFO] Apache Oozie Share Lib Oozie ....................... SUCCESS [ 2.162 s]
[INFO] Apache Oozie Share Lib HCatalog .................... SUCCESS [ 2.570 s]
[INFO] Apache Oozie Share Lib Distcp ...................... SUCCESS [ 0.467 s]
[INFO] Apache Oozie Core .................................. SUCCESS [ 46.026 s]
[INFO] Apache Oozie Share Lib Streaming ................... SUCCESS [ 3.392 s]
[INFO] Apache Oozie Share Lib Pig ......................... SUCCESS [ 2.589 s]
[INFO] Apache Oozie Share Lib Hive ........................ SUCCESS [ 4.782 s]
[INFO] Apache Oozie Share Lib Hive 2 ...................... SUCCESS [ 4.159 s]
[INFO] Apache Oozie Share Lib Sqoop ....................... SUCCESS [ 0.606 s]
[INFO] Apache Oozie Examples .............................. SUCCESS [ 2.363 s]
[INFO] Apache Oozie Share Lib Spark ....................... SUCCESS [ 5.763 s]
[INFO] Apache Oozie Share Lib ............................. SUCCESS [ 23.341 s]
[INFO] Apache Oozie Docs .................................. SUCCESS [ 13.304 s]
[INFO] Apache Oozie WebApp ................................ SUCCESS [ 36.661 s]
[INFO] Apache Oozie Tools ................................. SUCCESS [ 1.276 s]
[INFO] Apache Oozie MiniOozie ............................. SUCCESS [ 0.724 s]
[INFO] Apache Oozie Distro ................................ SUCCESS [ 41.406 s]
[INFO] Apache Oozie ZooKeeper Security Tests .............. SUCCESS [ 2.566 s]
[INFO] ------------------------------------------------------------------------
[INFO] BUILD SUCCESS
[INFO] ------------------------------------------------------------------------
[INFO] Total time: 03:48 min
[INFO] Finished at: 2016-11-08T01:32:20+00:00
[INFO] Final Memory: 86M/977M
[INFO] ------------------------------------------------------------------------
Reports
Running test-patch task CLEAN
Running test-patch task RAW_PATCH_ANALYSIS
Running test-patch task RAT
Running test-patch task JAVADOC
Running test-patch task COMPILE
Running test-patch task FINDBUGS_DIFF
[TRACE] Downloading FindBugs diff JAR from https://repo1.maven.org/maven2/me/andrz/findbugs/findbugs-diff/0.1.0/findbugs-diff-0.1.0-all.jar
[TRACE] FindBugs diff JAR downloaded
[ERROR] FindBugs diff JAR has a weird MD5 sum, rejecting
[TRACE] File [<https://builds.apache.org/job/oozie-trunk-precommit-build/ws/test-patch/tmp/FINDBUGS_DIFF/diff/findbugs-diff-0.1.0-all.jar]> removed
[TRACE] File [<https://builds.apache.org/job/oozie-trunk-precommit-build/ws/test-patch/tmp/FINDBUGS_DIFF/diff/findbugs-diff-0.1.0-all.jar.md5]> removed
Running test-patch task BACKWARDS_COMPATIBILITY
Running test-patch task TESTS
Running test-patch task DISTRO
Testing JIRA OOZIE-2724
Cleaning local git workspace
----------------------------
+1 PATCH_APPLIES
+1 CLEAN
+1 RAW_PATCH_ANALYSIS
+1 the patch does not introduce any @author tags
+1 the patch does not introduce any tabs
+1 the patch does not introduce any trailing spaces
+1 the patch does not introduce any line longer than 132
+1 the patch does adds/modifies 1 testcase(s)
+1 RAT
+1 the patch does not seem to introduce new RAT warnings
+1 JAVADOC
+1 the patch does not seem to introduce new Javadoc warnings
+1 COMPILE
+1 HEAD compiles
+1 patch compiles
+1 the patch does not seem to introduce new javac warnings
-1 FindBugs diff JAR has a weird MD5 sum, rejecting.
+1 BACKWARDS_COMPATIBILITY
+1 the patch does not change any JPA Entity/Colum/Basic/Lob/Transient annotations
+1 the patch does not modify JPA files
-1 TESTS
Tests run: 1818
Tests failed: 1
Tests errors: 0
The patch failed the following testcases:
testMaterizationLookup(org.apache.oozie.command.coord.TestCoordMaterializeTransitionXCommand)
+1 DISTRO
+1 distro tarball builds with the patch
----------------------------
-1 Overall result, please check the reported -1(s)
The full output of the test-patch run is available at
https://builds.apache.org/job/oozie-trunk-precommit-build/3420/
Adding comment to JIRA
Comment added.
test-patch exit code: 1
Build step 'Execute shell' marked build as failure
Archiving artifacts
Recording test results
Build failed in Jenkins: oozie-trunk-precommit-build #3419
Posted by Apache Jenkins Server <je...@builds.apache.org>.
See <https://builds.apache.org/job/oozie-trunk-precommit-build/3419/>
------------------------------------------
[...truncated 27925 lines...]
[INFO] Building jar: <https://builds.apache.org/job/oozie-trunk-precommit-build/ws/minitest/target/oozie-mini-4.4.0-SNAPSHOT.jar>
[INFO]
[INFO] --- maven-site-plugin:2.0-beta-6:attach-descriptor (attach-descriptor) @ oozie-mini ---
[INFO]
[INFO] --- maven-assembly-plugin:2.2.1:single (default-cli) @ oozie-mini ---
[INFO] Reading assembly descriptor: src/main/assemblies/empty.xml
[INFO]
[INFO] ------------------------------------------------------------------------
[INFO] Building Apache Oozie Distro 4.4.0-SNAPSHOT
[INFO] ------------------------------------------------------------------------
[INFO]
[INFO] --- maven-remote-resources-plugin:1.5:process (default) @ oozie-distro ---
[INFO]
[INFO] --- maven-resources-plugin:2.5:resources (default-resources) @ oozie-distro ---
[debug] execute contextualize
[INFO] Using 'UTF-8' encoding to copy filtered resources.
[INFO] skip non existing resourceDirectory <https://builds.apache.org/job/oozie-trunk-precommit-build/ws/distro/src/main/resources>
[INFO] Copying 3 resources
[INFO]
[INFO] --- maven-compiler-plugin:2.3.2:compile (default-compile) @ oozie-distro ---
[INFO] No sources to compile
[INFO]
[INFO] --- maven-resources-plugin:2.5:testResources (default-testResources) @ oozie-distro ---
[debug] execute contextualize
[INFO] Using 'UTF-8' encoding to copy filtered resources.
[INFO] skip non existing resourceDirectory <https://builds.apache.org/job/oozie-trunk-precommit-build/ws/distro/src/test/resources>
[INFO] Copying 3 resources
[INFO]
[INFO] --- maven-compiler-plugin:2.3.2:testCompile (default-testCompile) @ oozie-distro ---
[INFO] No sources to compile
[INFO]
[INFO] --- maven-surefire-plugin:2.12.2:test (default-test) @ oozie-distro ---
[INFO] Tests are skipped.
[INFO]
[INFO] --- maven-jar-plugin:2.3.1:jar (default-jar) @ oozie-distro ---
[INFO] Building jar: <https://builds.apache.org/job/oozie-trunk-precommit-build/ws/distro/target/oozie-distro-4.4.0-SNAPSHOT.jar>
[INFO]
[INFO] --- maven-site-plugin:2.0-beta-6:attach-descriptor (attach-descriptor) @ oozie-distro ---
[INFO]
[INFO] --- maven-antrun-plugin:1.6:run (default) @ oozie-distro ---
[INFO] Executing tasks
main:
[get] Destination already exists (skipping): <https://builds.apache.org/job/oozie-trunk-precommit-build/ws/distro/downloads/tomcat-6.0.44.tar.gz>
[delete] Deleting directory <https://builds.apache.org/job/oozie-trunk-precommit-build/ws/distro/target/tomcat>
[mkdir] Created dir: <https://builds.apache.org/job/oozie-trunk-precommit-build/ws/distro/target/tomcat>
[gunzip] Expanding <https://builds.apache.org/job/oozie-trunk-precommit-build/ws/distro/downloads/tomcat-6.0.44.tar.gz> to <https://builds.apache.org/job/oozie-trunk-precommit-build/ws/distro/target/tomcat/tomcat-6.0.44.tar>
[untar] Expanding: <https://builds.apache.org/job/oozie-trunk-precommit-build/ws/distro/target/tomcat/tomcat-6.0.44.tar> into <https://builds.apache.org/job/oozie-trunk-precommit-build/ws/distro/target/tomcat>
[delete] Deleting directory <https://builds.apache.org/job/oozie-trunk-precommit-build/ws/distro/target/tomcat/oozie-server/webapps>
[mkdir] Created dir: <https://builds.apache.org/job/oozie-trunk-precommit-build/ws/distro/target/tomcat/oozie-server/webapps>
[delete] Deleting: <https://builds.apache.org/job/oozie-trunk-precommit-build/ws/distro/target/tomcat/oozie-server/conf/server.xml>
[copy] Copying 1 file to <https://builds.apache.org/job/oozie-trunk-precommit-build/ws/distro/target/tomcat/oozie-server/conf>
[copy] Copying 1 file to <https://builds.apache.org/job/oozie-trunk-precommit-build/ws/distro/target/tomcat/oozie-server/conf>
[mkdir] Created dir: <https://builds.apache.org/job/oozie-trunk-precommit-build/ws/distro/target/tomcat/oozie-server/conf/ssl>
[copy] Copying 1 file to <https://builds.apache.org/job/oozie-trunk-precommit-build/ws/distro/target/tomcat/oozie-server/conf/ssl>
[copy] Copying 1 file to <https://builds.apache.org/job/oozie-trunk-precommit-build/ws/distro/target/tomcat/oozie-server/conf/ssl>
[copy] Copying 1 file to <https://builds.apache.org/job/oozie-trunk-precommit-build/ws/distro/target/tomcat/oozie-server/conf/ssl>
[copy] Copying 3 files to <https://builds.apache.org/job/oozie-trunk-precommit-build/ws/distro/target/tomcat/oozie-server/webapps/ROOT>
[INFO] Executed tasks
[INFO]
[INFO] --- maven-assembly-plugin:2.2.1:single (default-cli) @ oozie-distro ---
[INFO] Reading assembly descriptor: ../src/main/assemblies/distro.xml
[INFO] Copying files to <https://builds.apache.org/job/oozie-trunk-precommit-build/ws/distro/target/oozie-4.4.0-SNAPSHOT-distro>
[WARNING] Assembly file: <https://builds.apache.org/job/oozie-trunk-precommit-build/ws/distro/target/oozie-4.4.0-SNAPSHOT-distro> is not a regular file (it may be a directory). It cannot be attached to the project build for installation or deployment.
[INFO] Building tar : <https://builds.apache.org/job/oozie-trunk-precommit-build/ws/distro/target/oozie-4.4.0-SNAPSHOT-distro.tar.gz>
[INFO]
[INFO] ------------------------------------------------------------------------
[INFO] Building Apache Oozie ZooKeeper Security Tests 4.4.0-SNAPSHOT
[INFO] ------------------------------------------------------------------------
[INFO]
[INFO] --- maven-remote-resources-plugin:1.5:process (default) @ oozie-zookeeper-security-tests ---
[INFO]
[INFO] --- maven-resources-plugin:2.5:resources (default-resources) @ oozie-zookeeper-security-tests ---
[debug] execute contextualize
[INFO] Using 'UTF-8' encoding to copy filtered resources.
[INFO] skip non existing resourceDirectory <https://builds.apache.org/job/oozie-trunk-precommit-build/ws/zookeeper-security-tests/src/main/resources>
[INFO] Copying 3 resources
[INFO]
[INFO] --- maven-compiler-plugin:2.3.2:compile (default-compile) @ oozie-zookeeper-security-tests ---
[INFO] No sources to compile
[INFO]
[INFO] --- maven-resources-plugin:2.5:testResources (default-testResources) @ oozie-zookeeper-security-tests ---
[debug] execute contextualize
[INFO] Using 'UTF-8' encoding to copy filtered resources.
[INFO] skip non existing resourceDirectory <https://builds.apache.org/job/oozie-trunk-precommit-build/ws/zookeeper-security-tests/src/test/resources>
[INFO] Copying 3 resources
[INFO]
[INFO] --- maven-compiler-plugin:2.3.2:testCompile (default-testCompile) @ oozie-zookeeper-security-tests ---
[INFO] Nothing to compile - all classes are up to date
[INFO]
[INFO] --- maven-surefire-plugin:2.12.2:test (default-test) @ oozie-zookeeper-security-tests ---
[INFO] Tests are skipped.
[INFO]
[INFO] --- maven-jar-plugin:2.3.1:jar (default-jar) @ oozie-zookeeper-security-tests ---
[INFO] Building jar: <https://builds.apache.org/job/oozie-trunk-precommit-build/ws/zookeeper-security-tests/target/oozie-zookeeper-security-tests-4.4.0-SNAPSHOT.jar>
[INFO]
[INFO] --- maven-site-plugin:2.0-beta-6:attach-descriptor (attach-descriptor) @ oozie-zookeeper-security-tests ---
[INFO]
[INFO] --- maven-assembly-plugin:2.2.1:single (default-cli) @ oozie-zookeeper-security-tests ---
[INFO] Reading assembly descriptor: src/main/assemblies/empty.xml
[INFO] ------------------------------------------------------------------------
[INFO] Reactor Summary:
[INFO]
[INFO] Apache Oozie Main .................................. SUCCESS [ 1.742 s]
[INFO] Apache Oozie Hadoop Utils hadoop-2-4.4.0-SNAPSHOT .. SUCCESS [ 2.762 s]
[INFO] Apache Oozie Hadoop Distcp hadoop-2-4.4.0-SNAPSHOT . SUCCESS [ 0.163 s]
[INFO] Apache Oozie Hadoop Auth hadoop-2-4.4.0-SNAPSHOT Test SUCCESS [ 0.301 s]
[INFO] Apache Oozie Hadoop Libs ........................... SUCCESS [ 0.027 s]
[INFO] Apache Oozie Client ................................ SUCCESS [ 28.172 s]
[INFO] Apache Oozie Share Lib Oozie ....................... SUCCESS [ 1.996 s]
[INFO] Apache Oozie Share Lib HCatalog .................... SUCCESS [ 1.958 s]
[INFO] Apache Oozie Share Lib Distcp ...................... SUCCESS [ 0.410 s]
[INFO] Apache Oozie Core .................................. SUCCESS [ 47.617 s]
[INFO] Apache Oozie Share Lib Streaming ................... SUCCESS [ 3.295 s]
[INFO] Apache Oozie Share Lib Pig ......................... SUCCESS [ 2.793 s]
[INFO] Apache Oozie Share Lib Hive ........................ SUCCESS [ 5.452 s]
[INFO] Apache Oozie Share Lib Hive 2 ...................... SUCCESS [ 4.066 s]
[INFO] Apache Oozie Share Lib Sqoop ....................... SUCCESS [ 0.582 s]
[INFO] Apache Oozie Examples .............................. SUCCESS [ 2.711 s]
[INFO] Apache Oozie Share Lib Spark ....................... SUCCESS [ 6.317 s]
[INFO] Apache Oozie Share Lib ............................. SUCCESS [ 31.694 s]
[INFO] Apache Oozie Docs .................................. SUCCESS [ 15.276 s]
[INFO] Apache Oozie WebApp ................................ SUCCESS [ 41.623 s]
[INFO] Apache Oozie Tools ................................. SUCCESS [ 1.372 s]
[INFO] Apache Oozie MiniOozie ............................. SUCCESS [ 0.782 s]
[INFO] Apache Oozie Distro ................................ SUCCESS [ 52.541 s]
[INFO] Apache Oozie ZooKeeper Security Tests .............. SUCCESS [ 2.676 s]
[INFO] ------------------------------------------------------------------------
[INFO] BUILD SUCCESS
[INFO] ------------------------------------------------------------------------
[INFO] Total time: 04:18 min
[INFO] Finished at: 2016-11-08T00:24:46+00:00
[INFO] Final Memory: 85M/966M
[INFO] ------------------------------------------------------------------------
Reports
Running test-patch task CLEAN
Running test-patch task RAW_PATCH_ANALYSIS
Running test-patch task RAT
Running test-patch task JAVADOC
Running test-patch task COMPILE
Running test-patch task FINDBUGS_DIFF
[TRACE] Folder [/home/jenkins/jenkins-slave/workspace/oozie-trunk-postcommit-build/test-patch/tmp/FINDBUGS_DIFF/pre/docs/target/findbugs/] does not exist, creating
[TRACE] XML file [/home/jenkins/jenkins-slave/workspace/oozie-trunk-postcommit-build/test-patch/tmp/FINDBUGS_DIFF/pre/docs/target/findbugs/findbugsXml.xml] does not exist, creating
[TRACE] Folder [/home/jenkins/jenkins-slave/workspace/oozie-trunk-postcommit-build/test-patch/tmp/FINDBUGS_DIFF/pre/client/target/findbugs/] does not exist, creating
[TRACE] XML file [/home/jenkins/jenkins-slave/workspace/oozie-trunk-postcommit-build/test-patch/tmp/FINDBUGS_DIFF/pre/client/target/findbugs/findbugsXml.xml] does not exist, creating
[TRACE] Folder [/home/jenkins/jenkins-slave/workspace/oozie-trunk-postcommit-build/test-patch/tmp/FINDBUGS_DIFF/pre/tools/target/findbugs/] does not exist, creating
[TRACE] XML file [/home/jenkins/jenkins-slave/workspace/oozie-trunk-postcommit-build/test-patch/tmp/FINDBUGS_DIFF/pre/tools/target/findbugs/findbugsXml.xml] does not exist, creating
[TRACE] Folder [/home/jenkins/jenkins-slave/workspace/oozie-trunk-postcommit-build/test-patch/tmp/FINDBUGS_DIFF/pre/core/target/findbugs/] does not exist, creating
[TRACE] XML file [/home/jenkins/jenkins-slave/workspace/oozie-trunk-postcommit-build/test-patch/tmp/FINDBUGS_DIFF/pre/core/target/findbugs/findbugsXml.xml] does not exist, creating
[TRACE] Folder [/home/jenkins/jenkins-slave/workspace/oozie-trunk-postcommit-build/test-patch/tmp/FINDBUGS_DIFF/pre/examples/target/findbugs/] does not exist, creating
[TRACE] XML file [/home/jenkins/jenkins-slave/workspace/oozie-trunk-postcommit-build/test-patch/tmp/FINDBUGS_DIFF/pre/examples/target/findbugs/findbugsXml.xml] does not exist, creating
[TRACE] Folder [/home/jenkins/jenkins-slave/workspace/oozie-trunk-postcommit-build/test-patch/tmp/FINDBUGS_DIFF/pre/sharelib/streaming/target/findbugs/] does not exist, creating
[TRACE] XML file [/home/jenkins/jenkins-slave/workspace/oozie-trunk-postcommit-build/test-patch/tmp/FINDBUGS_DIFF/pre/sharelib/streaming/target/findbugs/findbugsXml.xml] does not exist, creating
[TRACE] Folder [/home/jenkins/jenkins-slave/workspace/oozie-trunk-postcommit-build/test-patch/tmp/FINDBUGS_DIFF/pre/sharelib/hive2/target/findbugs/] does not exist, creating
[TRACE] XML file [/home/jenkins/jenkins-slave/workspace/oozie-trunk-postcommit-build/test-patch/tmp/FINDBUGS_DIFF/pre/sharelib/hive2/target/findbugs/findbugsXml.xml] does not exist, creating
[TRACE] Folder [/home/jenkins/jenkins-slave/workspace/oozie-trunk-postcommit-build/test-patch/tmp/FINDBUGS_DIFF/pre/sharelib/distcp/target/findbugs/] does not exist, creating
[TRACE] XML file [/home/jenkins/jenkins-slave/workspace/oozie-trunk-postcommit-build/test-patch/tmp/FINDBUGS_DIFF/pre/sharelib/distcp/target/findbugs/findbugsXml.xml] does not exist, creating
[TRACE] Folder [/home/jenkins/jenkins-slave/workspace/oozie-trunk-postcommit-build/test-patch/tmp/FINDBUGS_DIFF/pre/sharelib/hive/target/findbugs/] does not exist, creating
[TRACE] XML file [/home/jenkins/jenkins-slave/workspace/oozie-trunk-postcommit-build/test-patch/tmp/FINDBUGS_DIFF/pre/sharelib/hive/target/findbugs/findbugsXml.xml] does not exist, creating
[TRACE] Folder [/home/jenkins/jenkins-slave/workspace/oozie-trunk-postcommit-build/test-patch/tmp/FINDBUGS_DIFF/pre/sharelib/pig/target/findbugs/] does not exist, creating
[TRACE] XML file [/home/jenkins/jenkins-slave/workspace/oozie-trunk-postcommit-build/test-patch/tmp/FINDBUGS_DIFF/pre/sharelib/pig/target/findbugs/findbugsXml.xml] does not exist, creating
[TRACE] Folder [/home/jenkins/jenkins-slave/workspace/oozie-trunk-postcommit-build/test-patch/tmp/FINDBUGS_DIFF/pre/sharelib/oozie/target/findbugs/] does not exist, creating
[TRACE] XML file [/home/jenkins/jenkins-slave/workspace/oozie-trunk-postcommit-build/test-patch/tmp/FINDBUGS_DIFF/pre/sharelib/oozie/target/findbugs/findbugsXml.xml] does not exist, creating
[TRACE] Folder [/home/jenkins/jenkins-slave/workspace/oozie-trunk-postcommit-build/test-patch/tmp/FINDBUGS_DIFF/pre/sharelib/sqoop/target/findbugs/] does not exist, creating
[TRACE] XML file [/home/jenkins/jenkins-slave/workspace/oozie-trunk-postcommit-build/test-patch/tmp/FINDBUGS_DIFF/pre/sharelib/sqoop/target/findbugs/findbugsXml.xml] does not exist, creating
[TRACE] Folder [/home/jenkins/jenkins-slave/workspace/oozie-trunk-postcommit-build/test-patch/tmp/FINDBUGS_DIFF/pre/sharelib/spark/target/findbugs/] does not exist, creating
[TRACE] XML file [/home/jenkins/jenkins-slave/workspace/oozie-trunk-postcommit-build/test-patch/tmp/FINDBUGS_DIFF/pre/sharelib/spark/target/findbugs/findbugsXml.xml] does not exist, creating
[TRACE] Folder [/home/jenkins/jenkins-slave/workspace/oozie-trunk-postcommit-build/test-patch/tmp/FINDBUGS_DIFF/pre/sharelib/hcatalog/target/findbugs/] does not exist, creating
[TRACE] XML file [/home/jenkins/jenkins-slave/workspace/oozie-trunk-postcommit-build/test-patch/tmp/FINDBUGS_DIFF/pre/sharelib/hcatalog/target/findbugs/findbugsXml.xml] does not exist, creating
[TRACE] Folder [/home/jenkins/jenkins-slave/workspace/oozie-trunk-postcommit-build/test-patch/tmp/FINDBUGS_DIFF/pre/hadooplibs/hadoop-utils-2/target/findbugs/] does not exist, creating
[TRACE] XML file [/home/jenkins/jenkins-slave/workspace/oozie-trunk-postcommit-build/test-patch/tmp/FINDBUGS_DIFF/pre/hadooplibs/hadoop-utils-2/target/findbugs/findbugsXml.xml] does not exist, creating
[TRACE] Downloading FindBugs diff JAR from https://repo1.maven.org/maven2/me/andrz/findbugs/findbugs-diff/0.1.0/findbugs-diff-0.1.0-all.jar
[TRACE] FindBugs diff JAR downloaded
[ERROR] FindBugs diff JAR has a weird MD5 sum, rejecting
[TRACE] File [<https://builds.apache.org/job/oozie-trunk-precommit-build/ws/test-patch/tmp/FINDBUGS_DIFF/diff/findbugs-diff-0.1.0-all.jar]> removed
[TRACE] File [<https://builds.apache.org/job/oozie-trunk-precommit-build/ws/test-patch/tmp/FINDBUGS_DIFF/diff/findbugs-diff-0.1.0-all.jar.md5]> removed
Running test-patch task BACKWARDS_COMPATIBILITY
Running test-patch task TESTS
Running test-patch task DISTRO
Testing JIRA OOZIE-2723
Cleaning local git workspace
----------------------------
+1 PATCH_APPLIES
+1 CLEAN
+1 RAW_PATCH_ANALYSIS
+1 the patch does not introduce any @author tags
+1 the patch does not introduce any tabs
+1 the patch does not introduce any trailing spaces
+1 the patch does not introduce any line longer than 132
+1 the patch does adds/modifies 1 testcase(s)
+1 RAT
+1 the patch does not seem to introduce new RAT warnings
+1 JAVADOC
+1 the patch does not seem to introduce new Javadoc warnings
+1 COMPILE
+1 HEAD compiles
+1 patch compiles
+1 the patch does not seem to introduce new javac warnings
-1 FindBugs diff JAR has a weird MD5 sum, rejecting.
+1 BACKWARDS_COMPATIBILITY
+1 the patch does not change any JPA Entity/Colum/Basic/Lob/Transient annotations
+1 the patch does not modify JPA files
-1 TESTS
Tests run: 1818
Tests failed: 5
Tests errors: 0
The patch failed the following testcases:
testMemoryUsageAndSpeed(org.apache.oozie.service.TestPartitionDependencyManagerEhcache)
testMaterizationLookup(org.apache.oozie.command.coord.TestCoordMaterializeTransitionXCommand)
testCoordActionRecoveryServiceForWaiting(org.apache.oozie.service.TestRecoveryService)
testBundlePauseExtendMaterializesCoordinator(org.apache.oozie.command.bundle.TestBundleChangeXCommand)
testHive2Action(org.apache.oozie.action.hadoop.TestHive2ActionExecutor)
+1 DISTRO
+1 distro tarball builds with the patch
----------------------------
-1 Overall result, please check the reported -1(s)
The full output of the test-patch run is available at
https://builds.apache.org/job/oozie-trunk-precommit-build/3419/
% Total % Received % Xferd Average Speed Time Time Time Current
Dload Upload Total Spent Left Speed
0 0 0 0 0 0 0 0 --:--:-- --:--:-- --:--:-- 0
0 0 0 0 0 0 0 0 --:--:-- --:--:-- --:--:-- 0
0 0 0 0 0 0 0 0 --:--:-- --:--:-- --:--:-- 0
30 3706k 30 1134k 0 0 1121k 0 0:00:03 0:00:01 0:00:02 1121k
100 3706k 100 3706k 0 0 2570k 0 0:00:01 0:00:01 --:--:-- 5981k
Adding comment to JIRA
Comment added.
test-patch exit code: 1
Build step 'Execute shell' marked build as failure
Archiving artifacts
Recording test results
Build failed in Jenkins: oozie-trunk-precommit-build #3417
Posted by Apache Jenkins Server <je...@builds.apache.org>.
See <https://builds.apache.org/job/oozie-trunk-precommit-build/3417/changes>
Changes:
[rohini] OOZIE-2536 Hadoop's cleanup of local directory in uber mode causing
[rkanter] OOZIE-2225 Add wild card filter for gathering jobs (sai-krish via
[jvishwakarma] Test case failure (abhishekbafna via jaydeepvishwakarma)
[rkanter] OOZIE-1459 Remove the version in the child poms for maven-antrun-plugin
------------------------------------------
[...truncated 12602 lines...]
[INFO] Tests are skipped.
[INFO]
[INFO] --- maven-jar-plugin:2.3.1:jar (default-jar) @ oozie-tools ---
[INFO] Building jar: <https://builds.apache.org/job/oozie-trunk-precommit-build/ws/tools/target/oozie-tools-4.4.0-SNAPSHOT.jar>
[INFO]
[INFO] --- maven-site-plugin:2.0-beta-6:attach-descriptor (attach-descriptor) @ oozie-tools ---
[INFO]
[INFO] --- maven-assembly-plugin:2.2.1:single (default-cli) @ oozie-tools ---
[INFO] Reading assembly descriptor: ../src/main/assemblies/tools.xml
[WARNING] The following patterns were never triggered in this artifact exclusion filter:
o '*:*:pom:*'
[INFO] Copying files to <https://builds.apache.org/job/oozie-trunk-precommit-build/ws/tools/target/oozie-tools-4.4.0-SNAPSHOT-tools>
[WARNING] Assembly file: <https://builds.apache.org/job/oozie-trunk-precommit-build/ws/tools/target/oozie-tools-4.4.0-SNAPSHOT-tools> is not a regular file (it may be a directory). It cannot be attached to the project build for installation or deployment.
[INFO]
[INFO] ------------------------------------------------------------------------
[INFO] Building Apache Oozie MiniOozie 4.4.0-SNAPSHOT
[INFO] ------------------------------------------------------------------------
[INFO]
[INFO] --- maven-remote-resources-plugin:1.5:process (default) @ oozie-mini ---
[INFO]
[INFO] --- maven-resources-plugin:2.5:resources (default-resources) @ oozie-mini ---
[debug] execute contextualize
[INFO] Using 'UTF-8' encoding to copy filtered resources.
[INFO] skip non existing resourceDirectory <https://builds.apache.org/job/oozie-trunk-precommit-build/ws/minitest/src/main/resources>
[INFO] Copying 3 resources
[INFO]
[INFO] --- maven-compiler-plugin:2.3.2:compile (default-compile) @ oozie-mini ---
[INFO] No sources to compile
[INFO]
[INFO] --- maven-resources-plugin:2.5:testResources (default-testResources) @ oozie-mini ---
[debug] execute contextualize
[INFO] Using 'UTF-8' encoding to copy filtered resources.
[INFO] Copying 3 resources
[INFO] Copying 3 resources
[INFO]
[INFO] --- maven-compiler-plugin:2.3.2:testCompile (default-testCompile) @ oozie-mini ---
[INFO] Nothing to compile - all classes are up to date
[INFO]
[INFO] --- maven-surefire-plugin:2.12.2:test (default-test) @ oozie-mini ---
[INFO] Tests are skipped.
[INFO]
[INFO] --- maven-jar-plugin:2.3.1:jar (default-jar) @ oozie-mini ---
[INFO] Building jar: <https://builds.apache.org/job/oozie-trunk-precommit-build/ws/minitest/target/oozie-mini-4.4.0-SNAPSHOT.jar>
[INFO]
[INFO] --- maven-site-plugin:2.0-beta-6:attach-descriptor (attach-descriptor) @ oozie-mini ---
[INFO]
[INFO] --- maven-assembly-plugin:2.2.1:single (default-cli) @ oozie-mini ---
[INFO] Reading assembly descriptor: src/main/assemblies/empty.xml
[INFO]
[INFO] ------------------------------------------------------------------------
[INFO] Building Apache Oozie Distro 4.4.0-SNAPSHOT
[INFO] ------------------------------------------------------------------------
[INFO]
[INFO] --- maven-remote-resources-plugin:1.5:process (default) @ oozie-distro ---
[INFO]
[INFO] --- maven-resources-plugin:2.5:resources (default-resources) @ oozie-distro ---
[debug] execute contextualize
[INFO] Using 'UTF-8' encoding to copy filtered resources.
[INFO] skip non existing resourceDirectory <https://builds.apache.org/job/oozie-trunk-precommit-build/ws/distro/src/main/resources>
[INFO] Copying 3 resources
[INFO]
[INFO] --- maven-compiler-plugin:2.3.2:compile (default-compile) @ oozie-distro ---
[INFO] No sources to compile
[INFO]
[INFO] --- maven-resources-plugin:2.5:testResources (default-testResources) @ oozie-distro ---
[debug] execute contextualize
[INFO] Using 'UTF-8' encoding to copy filtered resources.
[INFO] skip non existing resourceDirectory <https://builds.apache.org/job/oozie-trunk-precommit-build/ws/distro/src/test/resources>
[INFO] Copying 3 resources
[INFO]
[INFO] --- maven-compiler-plugin:2.3.2:testCompile (default-testCompile) @ oozie-distro ---
[INFO] No sources to compile
[INFO]
[INFO] --- maven-surefire-plugin:2.12.2:test (default-test) @ oozie-distro ---
[INFO] Tests are skipped.
[INFO]
[INFO] --- maven-jar-plugin:2.3.1:jar (default-jar) @ oozie-distro ---
[INFO] Building jar: <https://builds.apache.org/job/oozie-trunk-precommit-build/ws/distro/target/oozie-distro-4.4.0-SNAPSHOT.jar>
[INFO]
[INFO] --- maven-site-plugin:2.0-beta-6:attach-descriptor (attach-descriptor) @ oozie-distro ---
[INFO]
[INFO] --- maven-antrun-plugin:1.6:run (default) @ oozie-distro ---
[INFO] Executing tasks
main:
[get] Destination already exists (skipping): <https://builds.apache.org/job/oozie-trunk-precommit-build/ws/distro/downloads/tomcat-6.0.44.tar.gz>
[delete] Deleting directory <https://builds.apache.org/job/oozie-trunk-precommit-build/ws/distro/target/tomcat>
[mkdir] Created dir: <https://builds.apache.org/job/oozie-trunk-precommit-build/ws/distro/target/tomcat>
[gunzip] Expanding <https://builds.apache.org/job/oozie-trunk-precommit-build/ws/distro/downloads/tomcat-6.0.44.tar.gz> to <https://builds.apache.org/job/oozie-trunk-precommit-build/ws/distro/target/tomcat/tomcat-6.0.44.tar>
[untar] Expanding: <https://builds.apache.org/job/oozie-trunk-precommit-build/ws/distro/target/tomcat/tomcat-6.0.44.tar> into <https://builds.apache.org/job/oozie-trunk-precommit-build/ws/distro/target/tomcat>
[delete] Deleting directory <https://builds.apache.org/job/oozie-trunk-precommit-build/ws/distro/target/tomcat/oozie-server/webapps>
[mkdir] Created dir: <https://builds.apache.org/job/oozie-trunk-precommit-build/ws/distro/target/tomcat/oozie-server/webapps>
[delete] Deleting: <https://builds.apache.org/job/oozie-trunk-precommit-build/ws/distro/target/tomcat/oozie-server/conf/server.xml>
[copy] Copying 1 file to <https://builds.apache.org/job/oozie-trunk-precommit-build/ws/distro/target/tomcat/oozie-server/conf>
[copy] Copying 1 file to <https://builds.apache.org/job/oozie-trunk-precommit-build/ws/distro/target/tomcat/oozie-server/conf>
[mkdir] Created dir: <https://builds.apache.org/job/oozie-trunk-precommit-build/ws/distro/target/tomcat/oozie-server/conf/ssl>
[copy] Copying 1 file to <https://builds.apache.org/job/oozie-trunk-precommit-build/ws/distro/target/tomcat/oozie-server/conf/ssl>
[copy] Copying 1 file to <https://builds.apache.org/job/oozie-trunk-precommit-build/ws/distro/target/tomcat/oozie-server/conf/ssl>
[copy] Copying 1 file to <https://builds.apache.org/job/oozie-trunk-precommit-build/ws/distro/target/tomcat/oozie-server/conf/ssl>
[copy] Copying 3 files to <https://builds.apache.org/job/oozie-trunk-precommit-build/ws/distro/target/tomcat/oozie-server/webapps/ROOT>
[INFO] Executed tasks
[INFO]
[INFO] --- maven-assembly-plugin:2.2.1:single (default-cli) @ oozie-distro ---
[INFO] Reading assembly descriptor: ../src/main/assemblies/distro.xml
[INFO] Copying files to <https://builds.apache.org/job/oozie-trunk-precommit-build/ws/distro/target/oozie-4.4.0-SNAPSHOT-distro>
[WARNING] Assembly file: <https://builds.apache.org/job/oozie-trunk-precommit-build/ws/distro/target/oozie-4.4.0-SNAPSHOT-distro> is not a regular file (it may be a directory). It cannot be attached to the project build for installation or deployment.
[INFO] Building tar : <https://builds.apache.org/job/oozie-trunk-precommit-build/ws/distro/target/oozie-4.4.0-SNAPSHOT-distro.tar.gz>
[INFO]
[INFO] ------------------------------------------------------------------------
[INFO] Building Apache Oozie ZooKeeper Security Tests 4.4.0-SNAPSHOT
[INFO] ------------------------------------------------------------------------
[INFO]
[INFO] --- maven-remote-resources-plugin:1.5:process (default) @ oozie-zookeeper-security-tests ---
[INFO]
[INFO] --- maven-resources-plugin:2.5:resources (default-resources) @ oozie-zookeeper-security-tests ---
[debug] execute contextualize
[INFO] Using 'UTF-8' encoding to copy filtered resources.
[INFO] skip non existing resourceDirectory <https://builds.apache.org/job/oozie-trunk-precommit-build/ws/zookeeper-security-tests/src/main/resources>
[INFO] Copying 3 resources
[INFO]
[INFO] --- maven-compiler-plugin:2.3.2:compile (default-compile) @ oozie-zookeeper-security-tests ---
[INFO] No sources to compile
[INFO]
[INFO] --- maven-resources-plugin:2.5:testResources (default-testResources) @ oozie-zookeeper-security-tests ---
[debug] execute contextualize
[INFO] Using 'UTF-8' encoding to copy filtered resources.
[INFO] skip non existing resourceDirectory <https://builds.apache.org/job/oozie-trunk-precommit-build/ws/zookeeper-security-tests/src/test/resources>
[INFO] Copying 3 resources
[INFO]
[INFO] --- maven-compiler-plugin:2.3.2:testCompile (default-testCompile) @ oozie-zookeeper-security-tests ---
[INFO] Nothing to compile - all classes are up to date
[INFO]
[INFO] --- maven-surefire-plugin:2.12.2:test (default-test) @ oozie-zookeeper-security-tests ---
[INFO] Tests are skipped.
[INFO]
[INFO] --- maven-jar-plugin:2.3.1:jar (default-jar) @ oozie-zookeeper-security-tests ---
[INFO] Building jar: <https://builds.apache.org/job/oozie-trunk-precommit-build/ws/zookeeper-security-tests/target/oozie-zookeeper-security-tests-4.4.0-SNAPSHOT.jar>
[INFO]
[INFO] --- maven-site-plugin:2.0-beta-6:attach-descriptor (attach-descriptor) @ oozie-zookeeper-security-tests ---
[INFO]
[INFO] --- maven-assembly-plugin:2.2.1:single (default-cli) @ oozie-zookeeper-security-tests ---
[INFO] Reading assembly descriptor: src/main/assemblies/empty.xml
[INFO] ------------------------------------------------------------------------
[INFO] Reactor Summary:
[INFO]
[INFO] Apache Oozie Main .................................. SUCCESS [ 1.663 s]
[INFO] Apache Oozie Hadoop Utils hadoop-2-4.4.0-SNAPSHOT .. SUCCESS [ 2.222 s]
[INFO] Apache Oozie Hadoop Distcp hadoop-2-4.4.0-SNAPSHOT . SUCCESS [ 0.164 s]
[INFO] Apache Oozie Hadoop Auth hadoop-2-4.4.0-SNAPSHOT Test SUCCESS [ 0.315 s]
[INFO] Apache Oozie Hadoop Libs ........................... SUCCESS [ 0.026 s]
[INFO] Apache Oozie Client ................................ SUCCESS [ 24.609 s]
[INFO] Apache Oozie Share Lib Oozie ....................... SUCCESS [ 1.814 s]
[INFO] Apache Oozie Share Lib HCatalog .................... SUCCESS [ 2.092 s]
[INFO] Apache Oozie Share Lib Distcp ...................... SUCCESS [ 0.381 s]
[INFO] Apache Oozie Core .................................. SUCCESS [ 43.507 s]
[INFO] Apache Oozie Share Lib Streaming ................... SUCCESS [ 2.976 s]
[INFO] Apache Oozie Share Lib Pig ......................... SUCCESS [ 2.705 s]
[INFO] Apache Oozie Share Lib Hive ........................ SUCCESS [ 5.087 s]
[INFO] Apache Oozie Share Lib Hive 2 ...................... SUCCESS [ 4.024 s]
[INFO] Apache Oozie Share Lib Sqoop ....................... SUCCESS [ 0.600 s]
[INFO] Apache Oozie Examples .............................. SUCCESS [ 2.405 s]
[INFO] Apache Oozie Share Lib Spark ....................... SUCCESS [ 6.193 s]
[INFO] Apache Oozie Share Lib ............................. SUCCESS [ 23.658 s]
[INFO] Apache Oozie Docs .................................. SUCCESS [ 11.770 s]
[INFO] Apache Oozie WebApp ................................ SUCCESS [ 35.070 s]
[INFO] Apache Oozie Tools ................................. SUCCESS [ 1.306 s]
[INFO] Apache Oozie MiniOozie ............................. SUCCESS [ 0.677 s]
[INFO] Apache Oozie Distro ................................ SUCCESS [ 39.676 s]
[INFO] Apache Oozie ZooKeeper Security Tests .............. SUCCESS [ 2.473 s]
[INFO] ------------------------------------------------------------------------
[INFO] BUILD SUCCESS
[INFO] ------------------------------------------------------------------------
[INFO] Total time: 03:37 min
[INFO] Finished at: 2016-11-05T15:05:07+00:00
[INFO] Final Memory: 84M/1046M
[INFO] ------------------------------------------------------------------------
Reports
Running test-patch task CLEAN
Running test-patch task RAW_PATCH_ANALYSIS
Running test-patch task RAT
Running test-patch task JAVADOC
Running test-patch task COMPILE
Running test-patch task FINDBUGS_DIFF
[TRACE] Downloading FindBugs diff JAR from https://repo1.maven.org/maven2/me/andrz/findbugs/findbugs-diff/0.1.0/findbugs-diff-0.1.0-all.jar
[TRACE] FindBugs diff JAR downloaded
[ERROR] FindBugs diff JAR has a weird MD5 sum, rejecting
[TRACE] File [<https://builds.apache.org/job/oozie-trunk-precommit-build/ws/test-patch/tmp/FINDBUGS_DIFF/diff/findbugs-diff-0.1.0-all.jar]> removed
[TRACE] File [<https://builds.apache.org/job/oozie-trunk-precommit-build/ws/test-patch/tmp/FINDBUGS_DIFF/diff/findbugs-diff-0.1.0-all.jar.md5]> removed
Running test-patch task BACKWARDS_COMPATIBILITY
Running test-patch task TESTS
Running test-patch task DISTRO
Testing JIRA OOZIE-2097
Cleaning local git workspace
----------------------------
+1 PATCH_APPLIES
+1 CLEAN
+1 RAW_PATCH_ANALYSIS
+1 the patch does not introduce any @author tags
+1 the patch does not introduce any tabs
+1 the patch does not introduce any trailing spaces
+1 the patch does not introduce any line longer than 132
+1 the patch does adds/modifies 5 testcase(s)
+1 RAT
+1 the patch does not seem to introduce new RAT warnings
+1 JAVADOC
+1 the patch does not seem to introduce new Javadoc warnings
+1 COMPILE
+1 HEAD compiles
+1 patch compiles
+1 the patch does not seem to introduce new javac warnings
-1 FindBugs diff JAR has a weird MD5 sum, rejecting.
+1 BACKWARDS_COMPATIBILITY
+1 the patch does not change any JPA Entity/Colum/Basic/Lob/Transient annotations
+1 the patch does not modify JPA files
-1 TESTS
Tests run: 1818
Tests failed: 1
Tests errors: 0
The patch failed the following testcases:
testMaterizationLookup(org.apache.oozie.command.coord.TestCoordMaterializeTransitionXCommand)
+1 DISTRO
+1 distro tarball builds with the patch
----------------------------
-1 Overall result, please check the reported -1(s)
The full output of the test-patch run is available at
https://builds.apache.org/job/oozie-trunk-precommit-build/3417/
Adding comment to JIRA
Comment added.
test-patch exit code: 1
Build step 'Execute shell' marked build as failure
Archiving artifacts
Recording test results