You are viewing a plain text version of this content. The canonical link for it is here.
Posted to builds@beam.apache.org by Apache Jenkins Server <je...@builds.apache.org> on 2020/08/15 06:04:06 UTC
Build failed in Jenkins: beam_PostCommit_SQL #5197
See <https://ci-beam.apache.org/job/beam_PostCommit_SQL/5197/display/redirect?page=changes>
Changes:
[Boyuan Zhang] Scale progress with respect to windows observation.
[Robert Burke] Fix broken build.
------------------------------------------
[...truncated 4.13 KB...]
> Task :buildSrc:spotlessGroovyGradle
> Task :buildSrc:spotlessGroovyGradleCheck
> Task :buildSrc:spotlessCheck
> Task :buildSrc:pluginUnderTestMetadata
> Task :buildSrc:compileTestJava NO-SOURCE
> Task :buildSrc:compileTestGroovy NO-SOURCE
> Task :buildSrc:processTestResources NO-SOURCE
> Task :buildSrc:testClasses UP-TO-DATE
> Task :buildSrc:test NO-SOURCE
> Task :buildSrc:validateTaskProperties FROM-CACHE
> Task :buildSrc:check
> Task :buildSrc:build
Configuration on demand is an incubating feature.
> Task :sdks:java:core:generateAvroProtocol NO-SOURCE
> Task :sdks:java:extensions:google-cloud-platform-core:processResources NO-SOURCE
> Task :runners:java-fn-execution:processResources NO-SOURCE
> Task :vendor:sdks-java-extensions-protobuf:processResources NO-SOURCE
> Task :sdks:java:fn-execution:processResources NO-SOURCE
> Task :runners:core-java:processResources NO-SOURCE
> Task :runners:core-construction-java:processResources NO-SOURCE
> Task :runners:local-java:processResources NO-SOURCE
> Task :sdks:java:harness:processResources NO-SOURCE
> Task :runners:direct-java:processResources NO-SOURCE
> Task :sdks:java:core:generateAvroJava NO-SOURCE
> Task :sdks:java:io:kafka:processResources NO-SOURCE
> Task :sdks:java:io:google-cloud-platform:processResources NO-SOURCE
> Task :sdks:java:io:hadoop-common:processResources NO-SOURCE
> Task :sdks:java:testing:test-utils:processResources NO-SOURCE
> Task :sdks:java:io:mongodb:processResources NO-SOURCE
> Task :sdks:java:expansion-service:createCheckerFrameworkManifest
> Task :sdks:java:extensions:join-library:createCheckerFrameworkManifest
> Task :sdks:java:testing:test-utils:processTestResources NO-SOURCE
> Task :sdks:java:io:mongodb:processTestResources NO-SOURCE
> Task :sdks:java:extensions:protobuf:extractProto
> Task :sdks:java:io:common:compileJava NO-SOURCE
> Task :model:fn-execution:extractProto
> Task :sdks:java:io:parquet:processResources NO-SOURCE
> Task :model:job-management:extractProto
> Task :sdks:java:extensions:join-library:processResources NO-SOURCE
> Task :sdks:java:expansion-service:processResources NO-SOURCE
> Task :sdks:java:io:common:processResources NO-SOURCE
> Task :sdks:java:extensions:protobuf:processResources NO-SOURCE
> Task :sdks:java:io:common:classes UP-TO-DATE
> Task :sdks:java:extensions:sql:zetasql:processResources NO-SOURCE
> Task :sdks:java:extensions:google-cloud-platform-core:processTestResources NO-SOURCE
> Task :sdks:java:extensions:sql:datacatalog:createCheckerFrameworkManifest
> Task :sdks:java:extensions:sql:datacatalog:processResources NO-SOURCE
> Task :sdks:java:extensions:sql:datacatalog:processTestResources NO-SOURCE
> Task :sdks:java:core:generateGrammarSource FROM-CACHE
> Task :model:fn-execution:processResources
> Task :model:job-management:processResources
> Task :sdks:java:io:common:jar
> Task :sdks:java:io:common:processTestResources NO-SOURCE
> Task :sdks:java:core:processResources
> Task :sdks:java:extensions:sql:jdbc:processResources
> Task :sdks:java:core:generateTestAvroProtocol NO-SOURCE
> Task :sdks:java:extensions:sql:jdbc:processTestResources NO-SOURCE
> Task :sdks:java:io:google-cloud-platform:processTestResources
> Task :sdks:java:core:generateTestAvroJava
> Task :sdks:java:core:generateTestGrammarSource NO-SOURCE
> Task :sdks:java:core:processTestResources
> Task :sdks:java:extensions:sql:copyFmppTemplatesFromCalciteCore
> Task :sdks:java:extensions:sql:copyFmppTemplatesFromSrc
> Task :model:pipeline:extractIncludeProto
> Task :model:pipeline:extractProto
> Task :model:pipeline:generateProto
> Task :model:pipeline:compileJava FROM-CACHE
> Task :model:pipeline:processResources
> Task :model:pipeline:classes
> Task :sdks:java:extensions:sql:generateFmppSources
> Task :model:pipeline:jar
> Task :model:fn-execution:extractIncludeProto
> Task :model:job-management:extractIncludeProto
> Task :model:fn-execution:generateProto
> Task :sdks:java:extensions:sql:compileJavacc
Java Compiler Compiler Version 4.0 (Parser Generator)
(type "javacc" with no arguments for help)
Reading from file <https://ci-beam.apache.org/job/beam_PostCommit_SQL/ws/src/sdks/java/extensions/sql/build/generated/fmpp/javacc/Parser.jj> . . .
Note: UNICODE_INPUT option is specified. Please make sure you create the parser/lexer using a Reader with the correct character encoding.
Warning: Lookahead adequacy checking not being performed since option LOOKAHEAD is more than 1. Set option FORCE_LA_CHECK to true to force checking.
> Task :model:job-management:generateProto
> Task :sdks:java:extensions:sql:compileJavacc
File "TokenMgrError.java" does not exist. Will create one.
File "ParseException.java" does not exist. Will create one.
File "Token.java" does not exist. Will create one.
File "SimpleCharStream.java" does not exist. Will create one.
Parser generated with 0 errors and 1 warnings.
> Task :sdks:java:extensions:sql:processResources
> Task :sdks:java:extensions:sql:processTestResources
> Task :model:job-management:compileJava FROM-CACHE
> Task :model:job-management:classes
> Task :model:fn-execution:compileJava FROM-CACHE
> Task :model:fn-execution:classes
> Task :model:pipeline:shadowJar
> Task :model:job-management:shadowJar
> Task :model:fn-execution:shadowJar
> Task :sdks:java:core:compileJava FROM-CACHE
> Task :sdks:java:core:classes
> Task :sdks:java:core:shadowJar
> Task :runners:core-construction-java:compileJava FROM-CACHE
> Task :runners:core-construction-java:classes UP-TO-DATE
> Task :sdks:java:extensions:join-library:compileJava FROM-CACHE
> Task :sdks:java:extensions:join-library:classes UP-TO-DATE
> Task :sdks:java:extensions:join-library:jar
> Task :runners:local-java:compileJava FROM-CACHE
> Task :runners:local-java:classes UP-TO-DATE
> Task :runners:local-java:jar
> Task :runners:core-construction-java:jar
> Task :sdks:java:extensions:protobuf:extractIncludeProto
> Task :sdks:java:extensions:protobuf:generateProto NO-SOURCE
> Task :vendor:sdks-java-extensions-protobuf:compileJava FROM-CACHE
> Task :vendor:sdks-java-extensions-protobuf:classes UP-TO-DATE
> Task :sdks:java:extensions:protobuf:compileJava FROM-CACHE
> Task :sdks:java:extensions:protobuf:classes UP-TO-DATE
> Task :sdks:java:io:common:compileTestJava FROM-CACHE
> Task :sdks:java:io:common:testClasses UP-TO-DATE
> Task :sdks:java:io:common:testJar
> Task :sdks:java:extensions:protobuf:jar
> Task :sdks:java:io:mongodb:compileJava FROM-CACHE
> Task :sdks:java:io:mongodb:classes UP-TO-DATE
> Task :sdks:java:io:mongodb:jar
> Task :sdks:java:fn-execution:compileJava FROM-CACHE
> Task :sdks:java:fn-execution:classes UP-TO-DATE
> Task :vendor:sdks-java-extensions-protobuf:shadowJar
> Task :sdks:java:io:hadoop-common:compileJava FROM-CACHE
> Task :sdks:java:io:hadoop-common:classes UP-TO-DATE
> Task :sdks:java:fn-execution:jar
> Task :sdks:java:extensions:google-cloud-platform-core:compileJava FROM-CACHE
> Task :sdks:java:extensions:google-cloud-platform-core:classes UP-TO-DATE
> Task :sdks:java:io:hadoop-common:jar
> Task :sdks:java:extensions:google-cloud-platform-core:jar
> Task :sdks:java:io:parquet:compileJava FROM-CACHE
> Task :sdks:java:io:parquet:classes UP-TO-DATE
> Task :sdks:java:core:jar
> Task :sdks:java:io:parquet:jar
> Task :sdks:java:testing:test-utils:compileJava FROM-CACHE
> Task :sdks:java:testing:test-utils:classes UP-TO-DATE
> Task :runners:core-java:compileJava FROM-CACHE
> Task :runners:core-java:classes UP-TO-DATE
> Task :sdks:java:testing:test-utils:jar
> Task :sdks:java:testing:test-utils:compileTestJava FROM-CACHE
> Task :sdks:java:testing:test-utils:testClasses UP-TO-DATE
> Task :sdks:java:testing:test-utils:testJar
> Task :runners:core-java:jar
> Task :sdks:java:harness:compileJava FROM-CACHE
> Task :sdks:java:harness:classes UP-TO-DATE
> Task :sdks:java:io:mongodb:compileTestJava FROM-CACHE
> Task :sdks:java:io:mongodb:testClasses UP-TO-DATE
> Task :sdks:java:io:mongodb:testJar
> Task :sdks:java:harness:jar
> Task :sdks:java:core:compileTestJava FROM-CACHE
> Task :sdks:java:core:testClasses
> Task :sdks:java:core:shadowTestJar
> Task :sdks:java:extensions:google-cloud-platform-core:compileTestJava FROM-CACHE
> Task :sdks:java:extensions:google-cloud-platform-core:testClasses UP-TO-DATE
> Task :sdks:java:extensions:google-cloud-platform-core:testJar
> Task :sdks:java:harness:shadowJar
> Task :runners:java-fn-execution:compileJava FROM-CACHE
> Task :runners:java-fn-execution:classes UP-TO-DATE
> Task :runners:java-fn-execution:jar
> Task :sdks:java:expansion-service:compileJava FROM-CACHE
> Task :sdks:java:expansion-service:classes UP-TO-DATE
> Task :sdks:java:expansion-service:jar
> Task :runners:direct-java:compileJava FROM-CACHE
> Task :runners:direct-java:classes UP-TO-DATE
> Task :sdks:java:io:kafka:compileJava FROM-CACHE
> Task :sdks:java:io:kafka:classes UP-TO-DATE
> Task :sdks:java:io:kafka:jar
> Task :sdks:java:io:google-cloud-platform:compileJava FROM-CACHE
> Task :sdks:java:io:google-cloud-platform:classes UP-TO-DATE
> Task :sdks:java:io:google-cloud-platform:jar
> Task :runners:direct-java:shadowJar
> Task :sdks:java:io:google-cloud-platform:compileTestJava FROM-CACHE
> Task :sdks:java:io:google-cloud-platform:testClasses
> Task :sdks:java:extensions:sql:compileJava FROM-CACHE
> Task :sdks:java:extensions:sql:classes
> Task :sdks:java:io:google-cloud-platform:testJar
> Task :sdks:java:extensions:sql:compileTestJava FROM-CACHE
> Task :sdks:java:extensions:sql:testClasses
> Task :sdks:java:extensions:sql:integrationTest
org.apache.beam.sdk.extensions.sql.meta.provider.pubsub.PubsubJsonIT > testSQLSelectsPayloadContentFlat FAILED
io.grpc.StatusRuntimeException at PubsubJsonIT.java:403
org.apache.beam.sdk.extensions.sql.meta.provider.pubsub.PubsubJsonIT > testSQLSelectsPayloadContent FAILED
io.grpc.StatusRuntimeException
org.apache.beam.sdk.extensions.sql.meta.provider.pubsub.PubsubJsonIT > testSQLReadAndWriteWithSameFlatTableDefinition FAILED
io.grpc.StatusRuntimeException
org.apache.beam.sdk.extensions.sql.meta.provider.pubsub.PubsubJsonIT > testSQLInsertJsonRowsToPubsubWithTimestampAttributeFlat FAILED
io.grpc.StatusRuntimeException
org.apache.beam.sdk.extensions.sql.meta.provider.pubsub.PubsubJsonIT > testWritesJsonRowsToPubsub FAILED
io.grpc.StatusRuntimeException
org.apache.beam.sdk.extensions.sql.PubsubToBigqueryIT > testSimpleInsert FAILED
io.grpc.StatusRuntimeException
org.apache.beam.sdk.extensions.sql.PubsubToBigqueryIT > testSimpleInsertFlat FAILED
io.grpc.StatusRuntimeException
35 tests completed, 7 failed, 4 skipped
> Task :sdks:java:extensions:sql:integrationTest FAILED
> Task :sdks:java:extensions:sql:jar
> Task :sdks:java:extensions:sql:jdbc:compileJava FROM-CACHE
> Task :sdks:java:extensions:sql:jdbc:classes
> Task :sdks:java:extensions:sql:zetasql:compileJava FROM-CACHE
> Task :sdks:java:extensions:sql:zetasql:classes UP-TO-DATE
> Task :sdks:java:extensions:sql:datacatalog:compileJava FROM-CACHE
> Task :sdks:java:extensions:sql:datacatalog:classes UP-TO-DATE
> Task :sdks:java:extensions:sql:zetasql:jar
> Task :sdks:java:extensions:sql:datacatalog:compileTestJava FROM-CACHE
> Task :sdks:java:extensions:sql:datacatalog:testClasses UP-TO-DATE
> Task :sdks:java:extensions:sql:jdbc:compileTestJava FROM-CACHE
> Task :sdks:java:extensions:sql:jdbc:testClasses UP-TO-DATE
> Task :sdks:java:extensions:sql:jdbc:endToEndTest
> Task :sdks:java:extensions:sql:jdbc:postCommit
> Task :sdks:java:extensions:sql:datacatalog:integrationTest
> Task :sdks:java:extensions:sql:datacatalog:postCommit
FAILURE: Build failed with an exception.
* What went wrong:
Execution failed for task ':sdks:java:extensions:sql:integrationTest'.
> There were failing tests. See the report at: file://<https://ci-beam.apache.org/job/beam_PostCommit_SQL/ws/src/sdks/java/extensions/sql/build/reports/tests/integrationTest/index.html>
* Try:
Run with --stacktrace option to get the stack trace. Run with --info or --debug option to get more log output. Run with --scan to get full insights.
* Get more help at https://help.gradle.org
Deprecated Gradle features were used in this build, making it incompatible with Gradle 6.0.
Use '--warning-mode all' to show the individual deprecation warnings.
See https://docs.gradle.org/5.2.1/userguide/command_line_interface.html#sec:command_line_warnings
BUILD FAILED in 3m 32s
101 actionable tasks: 65 executed, 36 from cache
Publishing build scan...
https://gradle.com/s/vrmmdpm4icxxg
Build step 'Invoke Gradle script' changed build result to FAILURE
Build step 'Invoke Gradle script' marked build as failure
---------------------------------------------------------------------
To unsubscribe, e-mail: builds-unsubscribe@beam.apache.org
For additional commands, e-mail: builds-help@beam.apache.org
Jenkins build is back to normal : beam_PostCommit_SQL #5212
Posted by Apache Jenkins Server <je...@builds.apache.org>.
See <https://ci-beam.apache.org/job/beam_PostCommit_SQL/5212/display/redirect?page=changes>
---------------------------------------------------------------------
To unsubscribe, e-mail: builds-unsubscribe@beam.apache.org
For additional commands, e-mail: builds-help@beam.apache.org
Build failed in Jenkins: beam_PostCommit_SQL #5211
Posted by Apache Jenkins Server <je...@builds.apache.org>.
See <https://ci-beam.apache.org/job/beam_PostCommit_SQL/5211/display/redirect?page=changes>
Changes:
[noreply] [BEAM-10715] Update Jet Runner validates runner testing (#12567)
[noreply] [BEAM-10557] Implemented SchemaIOProvider for DataStoreV1, Refactored
------------------------------------------
[...truncated 19.54 KB...]
> Task :sdks:java:core:processTestResources
> Task :model:pipeline:generateProto
> Task :model:pipeline:compileJava FROM-CACHE
> Task :model:pipeline:processResources
> Task :model:pipeline:classes
> Task :model:pipeline:jar
> Task :model:fn-execution:extractIncludeProto
> Task :model:job-management:extractIncludeProto
> Task :model:fn-execution:generateProto
> Task :model:job-management:generateProto
> Task :sdks:java:extensions:sql:generateFmppSources
> Task :model:fn-execution:compileJava FROM-CACHE
> Task :model:fn-execution:classes
> Task :model:job-management:compileJava FROM-CACHE
> Task :model:job-management:classes
> Task :sdks:java:extensions:sql:compileJavacc
Java Compiler Compiler Version 4.0 (Parser Generator)
(type "javacc" with no arguments for help)
Reading from file <https://ci-beam.apache.org/job/beam_PostCommit_SQL/ws/src/sdks/java/extensions/sql/build/generated/fmpp/javacc/Parser.jj> . . .
Note: UNICODE_INPUT option is specified. Please make sure you create the parser/lexer using a Reader with the correct character encoding.
Warning: Lookahead adequacy checking not being performed since option LOOKAHEAD is more than 1. Set option FORCE_LA_CHECK to true to force checking.
File "TokenMgrError.java" does not exist. Will create one.
File "ParseException.java" does not exist. Will create one.
File "Token.java" does not exist. Will create one.
File "SimpleCharStream.java" does not exist. Will create one.
Parser generated with 0 errors and 1 warnings.
> Task :sdks:java:extensions:sql:processResources
> Task :sdks:java:extensions:sql:processTestResources
> Task :model:pipeline:shadowJar
> Task :model:job-management:shadowJar
> Task :model:fn-execution:shadowJar
> Task :sdks:java:core:compileJava FROM-CACHE
> Task :sdks:java:core:classes
> Task :sdks:java:core:shadowJar
> Task :vendor:sdks-java-extensions-protobuf:compileJava FROM-CACHE
> Task :vendor:sdks-java-extensions-protobuf:classes UP-TO-DATE
> Task :runners:local-java:compileJava FROM-CACHE
> Task :runners:local-java:classes UP-TO-DATE
> Task :runners:local-java:jar
> Task :sdks:java:extensions:protobuf:extractIncludeProto
> Task :sdks:java:extensions:protobuf:generateProto NO-SOURCE
> Task :runners:core-construction-java:compileJava FROM-CACHE
> Task :runners:core-construction-java:classes UP-TO-DATE
> Task :sdks:java:extensions:protobuf:compileJava FROM-CACHE
> Task :sdks:java:extensions:protobuf:classes UP-TO-DATE
> Task :vendor:sdks-java-extensions-protobuf:shadowJar
> Task :sdks:java:fn-execution:compileJava FROM-CACHE
> Task :sdks:java:fn-execution:classes UP-TO-DATE
> Task :sdks:java:extensions:protobuf:jar
> Task :sdks:java:fn-execution:jar
> Task :sdks:java:extensions:google-cloud-platform-core:compileJava FROM-CACHE
> Task :sdks:java:extensions:google-cloud-platform-core:classes UP-TO-DATE
> Task :sdks:java:extensions:google-cloud-platform-core:jar
> Task :runners:core-construction-java:jar
> Task :sdks:java:core:jar
> Task :runners:core-java:compileJava FROM-CACHE
> Task :runners:core-java:classes UP-TO-DATE
> Task :runners:core-java:jar
> Task :sdks:java:harness:compileJava FROM-CACHE
> Task :sdks:java:harness:classes UP-TO-DATE
> Task :sdks:java:harness:jar
> Task :sdks:java:io:common:compileTestJava
Note: <https://ci-beam.apache.org/job/beam_PostCommit_SQL/ws/src/sdks/java/io/common/src/test/java/org/apache/beam/sdk/io/common/IOITHelperTest.java> uses or overrides a deprecated API.
Note: Recompile with -Xlint:deprecation for details.
> Task :sdks:java:io:common:testClasses
> Task :sdks:java:io:hadoop-common:compileJava
> Task :sdks:java:io:hadoop-common:classes
> Task :sdks:java:testing:test-utils:compileJava
> Task :sdks:java:io:common:testJar
> Task :sdks:java:testing:test-utils:classes
> Task :sdks:java:io:mongodb:compileJava
Note: Some input files use or override a deprecated API.
Note: Recompile with -Xlint:deprecation for details.
Note: Some input files use unchecked or unsafe operations.
Note: Recompile with -Xlint:unchecked for details.
> Task :sdks:java:io:mongodb:classes
> Task :sdks:java:io:hadoop-common:jar
> Task :sdks:java:testing:test-utils:jar
> Task :sdks:java:io:mongodb:jar
> Task :sdks:java:testing:test-utils:compileTestJava
> Task :sdks:java:testing:test-utils:testClasses
> Task :sdks:java:testing:test-utils:testJar
> Task :sdks:java:io:parquet:compileJava
Note: <https://ci-beam.apache.org/job/beam_PostCommit_SQL/ws/src/sdks/java/io/parquet/src/main/java/org/apache/beam/sdk/io/parquet/ParquetIO.java> uses unchecked or unsafe operations.
Note: Recompile with -Xlint:unchecked for details.
> Task :sdks:java:io:parquet:classes
> Task :sdks:java:io:parquet:jar
> Task :sdks:java:extensions:join-library:compileJava
Note: <https://ci-beam.apache.org/job/beam_PostCommit_SQL/ws/src/sdks/java/extensions/join-library/src/main/java/org/apache/beam/sdk/extensions/joinlibrary/Join.java> uses unchecked or unsafe operations.
Note: Recompile with -Xlint:unchecked for details.
> Task :sdks:java:extensions:join-library:classes
> Task :sdks:java:extensions:join-library:jar
> Task :sdks:java:io:mongodb:compileTestJava
Note: <https://ci-beam.apache.org/job/beam_PostCommit_SQL/ws/src/sdks/java/io/mongodb/src/test/java/org/apache/beam/sdk/io/mongodb/MongoDBGridFSIOTest.java> uses or overrides a deprecated API.
Note: Recompile with -Xlint:deprecation for details.
> Task :sdks:java:io:mongodb:testClasses
> Task :sdks:java:io:mongodb:testJar
> Task :sdks:java:harness:shadowJar
> Task :sdks:java:core:compileTestJava
Note: Some input files use or override a deprecated API.
Note: Recompile with -Xlint:deprecation for details.
Note: Some input files use unchecked or unsafe operations.
Note: Recompile with -Xlint:unchecked for details.
> Task :sdks:java:core:testClasses
> Task :runners:java-fn-execution:compileJava
Note: Some input files use or override a deprecated API.
Note: Recompile with -Xlint:deprecation for details.
Note: Some input files use unchecked or unsafe operations.
Note: Recompile with -Xlint:unchecked for details.
> Task :runners:java-fn-execution:classes
> Task :runners:java-fn-execution:jar
> Task :sdks:java:core:shadowTestJar
> Task :runners:direct-java:compileJava
Note: Some input files use or override a deprecated API.
Note: Recompile with -Xlint:deprecation for details.
Note: Some input files use unchecked or unsafe operations.
Note: Recompile with -Xlint:unchecked for details.
> Task :runners:direct-java:classes
> Task :sdks:java:extensions:google-cloud-platform-core:compileTestJava
Note: Some input files use or override a deprecated API.
Note: Recompile with -Xlint:deprecation for details.
> Task :sdks:java:extensions:google-cloud-platform-core:testClasses
> Task :sdks:java:extensions:google-cloud-platform-core:testJar
> Task :runners:direct-java:shadowJar
> Task :sdks:java:expansion-service:compileJava
Note: <https://ci-beam.apache.org/job/beam_PostCommit_SQL/ws/src/sdks/java/expansion-service/src/main/java/org/apache/beam/sdk/expansion/service/ExpansionService.java> uses unchecked or unsafe operations.
Note: Recompile with -Xlint:unchecked for details.
> Task :sdks:java:expansion-service:classes
> Task :sdks:java:expansion-service:jar
> Task :sdks:java:io:kafka:compileJava
Note: <https://ci-beam.apache.org/job/beam_PostCommit_SQL/ws/src/sdks/java/io/kafka/src/main/java/org/apache/beam/sdk/io/kafka/KafkaIO.java> uses or overrides a deprecated API.
Note: Recompile with -Xlint:deprecation for details.
Note: Some input files use unchecked or unsafe operations.
Note: Recompile with -Xlint:unchecked for details.
> Task :sdks:java:io:kafka:classes
> Task :sdks:java:io:kafka:jar
> Task :sdks:java:io:google-cloud-platform:compileJava
Note: Some input files use or override a deprecated API.
Note: Recompile with -Xlint:deprecation for details.
Note: Some input files use unchecked or unsafe operations.
Note: Recompile with -Xlint:unchecked for details.
> Task :sdks:java:io:google-cloud-platform:classes
> Task :sdks:java:io:google-cloud-platform:jar
> Task :sdks:java:extensions:sql:compileJava
Note: Some input files use or override a deprecated API.
Note: Recompile with -Xlint:deprecation for details.
Note: Some input files use unchecked or unsafe operations.
Note: Recompile with -Xlint:unchecked for details.
> Task :sdks:java:io:google-cloud-platform:compileTestJava
Note: Some input files use or override a deprecated API.
Note: Recompile with -Xlint:deprecation for details.
Note: Some input files use unchecked or unsafe operations.
Note: Recompile with -Xlint:unchecked for details.
> Task :sdks:java:io:google-cloud-platform:testClasses
> Task :sdks:java:extensions:sql:classes
> Task :sdks:java:io:google-cloud-platform:testJar
> Task :sdks:java:extensions:sql:compileTestJava
Note: Some input files use or override a deprecated API.
Note: Recompile with -Xlint:deprecation for details.
Note: Some input files use unchecked or unsafe operations.
Note: Recompile with -Xlint:unchecked for details.
> Task :sdks:java:extensions:sql:testClasses
> Task :sdks:java:extensions:sql:integrationTest
org.apache.beam.sdk.extensions.sql.PubsubToBigqueryIT > testSimpleInsert FAILED
java.lang.AssertionError at PubsubToBigqueryIT.java:111
org.apache.beam.sdk.extensions.sql.PubsubToBigqueryIT > testSimpleInsertFlat FAILED
java.lang.AssertionError at PubsubToBigqueryIT.java:162
35 tests completed, 2 failed, 4 skipped
> Task :sdks:java:extensions:sql:integrationTest FAILED
> Task :sdks:java:extensions:sql:jar
> Task :sdks:java:extensions:sql:zetasql:compileJava FROM-CACHE
> Task :sdks:java:extensions:sql:zetasql:classes UP-TO-DATE
> Task :sdks:java:extensions:sql:zetasql:jar
> Task :sdks:java:extensions:sql:jdbc:compileJava
> Task :sdks:java:extensions:sql:jdbc:classes
> Task :sdks:java:extensions:sql:jdbc:compileTestJava
Note: Some input files use or override a deprecated API.
Note: Recompile with -Xlint:deprecation for details.
Note: Some input files use unchecked or unsafe operations.
Note: Recompile with -Xlint:unchecked for details.
> Task :sdks:java:extensions:sql:jdbc:testClasses
> Task :sdks:java:extensions:sql:jdbc:endToEndTest
> Task :sdks:java:extensions:sql:jdbc:postCommit
> Task :sdks:java:extensions:sql:datacatalog:compileJava
> Task :sdks:java:extensions:sql:datacatalog:classes
> Task :sdks:java:extensions:sql:datacatalog:compileTestJava
> Task :sdks:java:extensions:sql:datacatalog:testClasses
> Task :sdks:java:extensions:sql:datacatalog:integrationTest
> Task :sdks:java:extensions:sql:datacatalog:postCommit
FAILURE: Build failed with an exception.
* What went wrong:
Execution failed for task ':sdks:java:extensions:sql:integrationTest'.
> There were failing tests. See the report at: file://<https://ci-beam.apache.org/job/beam_PostCommit_SQL/ws/src/sdks/java/extensions/sql/build/reports/tests/integrationTest/index.html>
* Try:
Run with --stacktrace option to get the stack trace. Run with --info or --debug option to get more log output. Run with --scan to get full insights.
* Get more help at https://help.gradle.org
Deprecated Gradle features were used in this build, making it incompatible with Gradle 6.0.
Use '--warning-mode all' to show the individual deprecation warnings.
See https://docs.gradle.org/5.2.1/userguide/command_line_interface.html#sec:command_line_warnings
BUILD FAILED in 15m 15s
101 actionable tasks: 87 executed, 14 from cache
Publishing build scan...
https://gradle.com/s/5s64xqbd3zbgm
Build step 'Invoke Gradle script' changed build result to FAILURE
Build step 'Invoke Gradle script' marked build as failure
---------------------------------------------------------------------
To unsubscribe, e-mail: builds-unsubscribe@beam.apache.org
For additional commands, e-mail: builds-help@beam.apache.org
Build failed in Jenkins: beam_PostCommit_SQL #5210
Posted by Apache Jenkins Server <je...@builds.apache.org>.
See <https://ci-beam.apache.org/job/beam_PostCommit_SQL/5210/display/redirect?page=changes>
Changes:
[tobiasz.kedzierski] Improve CI documentation
------------------------------------------
[...truncated 1.72 KB...]
No emails were triggered.
[EnvInject] - Executing scripts and injecting environment variables after the SCM step.
[EnvInject] - Injecting as environment variables the properties content
SPARK_LOCAL_IP=127.0.0.1
[EnvInject] - Variables injected successfully.
[Gradle] - Launching build.
[src] $ <https://ci-beam.apache.org/job/beam_PostCommit_SQL/ws/src/gradlew> --continue --max-workers=12 -Dorg.gradle.jvmargs=-Xms2g -Dorg.gradle.jvmargs=-Xmx4g -Pdocker-pull-licenses :sqlPostCommit
Starting a Gradle Daemon (subsequent builds will be faster)
> Task :buildSrc:compileJava NO-SOURCE
> Task :buildSrc:compileGroovy FROM-CACHE
> Task :buildSrc:pluginDescriptors
> Task :buildSrc:processResources
> Task :buildSrc:classes
> Task :buildSrc:jar
> Task :buildSrc:assemble
> Task :buildSrc:spotlessGroovy
> Task :buildSrc:spotlessGroovyCheck
> Task :buildSrc:spotlessGroovyGradle
> Task :buildSrc:spotlessGroovyGradleCheck
> Task :buildSrc:spotlessCheck
> Task :buildSrc:pluginUnderTestMetadata
> Task :buildSrc:compileTestJava NO-SOURCE
> Task :buildSrc:compileTestGroovy NO-SOURCE
> Task :buildSrc:processTestResources NO-SOURCE
> Task :buildSrc:testClasses UP-TO-DATE
> Task :buildSrc:test NO-SOURCE
> Task :buildSrc:validateTaskProperties FROM-CACHE
> Task :buildSrc:check
> Task :buildSrc:build
Configuration on demand is an incubating feature.
> Task :sdks:java:core:generateAvroProtocol NO-SOURCE
> Task :sdks:java:extensions:google-cloud-platform-core:processResources NO-SOURCE
> Task :runners:core-java:processResources NO-SOURCE
> Task :runners:core-construction-java:processResources NO-SOURCE
> Task :sdks:java:harness:processResources NO-SOURCE
> Task :runners:java-fn-execution:processResources NO-SOURCE
> Task :runners:local-java:processResources NO-SOURCE
> Task :sdks:java:fn-execution:processResources NO-SOURCE
> Task :vendor:sdks-java-extensions-protobuf:processResources NO-SOURCE
> Task :sdks:java:core:generateAvroJava NO-SOURCE
> Task :runners:direct-java:processResources NO-SOURCE
> Task :model:job-management:extractProto
> Task :model:fn-execution:extractProto
> Task :sdks:java:io:google-cloud-platform:processResources NO-SOURCE
> Task :sdks:java:extensions:protobuf:extractProto
> Task :sdks:java:io:parquet:processResources NO-SOURCE
> Task :sdks:java:io:hadoop-common:processResources NO-SOURCE
> Task :sdks:java:extensions:protobuf:processResources NO-SOURCE
> Task :sdks:java:io:kafka:processResources NO-SOURCE
> Task :sdks:java:io:mongodb:processResources NO-SOURCE
> Task :sdks:java:io:common:compileJava NO-SOURCE
> Task :sdks:java:io:common:processResources NO-SOURCE
> Task :sdks:java:extensions:join-library:createCheckerFrameworkManifest
> Task :sdks:java:io:common:classes UP-TO-DATE
> Task :sdks:java:testing:test-utils:processResources NO-SOURCE
> Task :sdks:java:expansion-service:createCheckerFrameworkManifest
> Task :model:job-management:processResources
> Task :sdks:java:expansion-service:processResources NO-SOURCE
> Task :sdks:java:testing:test-utils:processTestResources NO-SOURCE
> Task :sdks:java:extensions:join-library:processResources NO-SOURCE
> Task :sdks:java:io:mongodb:processTestResources NO-SOURCE
> Task :sdks:java:extensions:google-cloud-platform-core:processTestResources NO-SOURCE
> Task :model:fn-execution:processResources
> Task :sdks:java:extensions:sql:datacatalog:createCheckerFrameworkManifest
> Task :sdks:java:extensions:sql:zetasql:processResources NO-SOURCE
> Task :sdks:java:extensions:sql:datacatalog:processResources NO-SOURCE
> Task :sdks:java:extensions:sql:datacatalog:processTestResources NO-SOURCE
> Task :sdks:java:io:common:jar
> Task :sdks:java:io:common:processTestResources NO-SOURCE
> Task :sdks:java:core:generateGrammarSource FROM-CACHE
> Task :sdks:java:core:processResources
> Task :sdks:java:core:generateTestAvroProtocol NO-SOURCE
> Task :sdks:java:extensions:sql:jdbc:processResources
> Task :sdks:java:extensions:sql:jdbc:processTestResources NO-SOURCE
> Task :sdks:java:io:google-cloud-platform:processTestResources
> Task :model:pipeline:extractIncludeProto
> Task :sdks:java:core:generateTestAvroJava
> Task :model:pipeline:extractProto
> Task :sdks:java:core:generateTestGrammarSource NO-SOURCE
> Task :sdks:java:core:processTestResources
> Task :sdks:java:extensions:sql:copyFmppTemplatesFromCalciteCore
> Task :sdks:java:extensions:sql:copyFmppTemplatesFromSrc
> Task :model:pipeline:generateProto
> Task :model:pipeline:compileJava FROM-CACHE
> Task :model:pipeline:processResources
> Task :model:pipeline:classes
> Task :sdks:java:extensions:sql:generateFmppSources
> Task :model:pipeline:jar
> Task :model:job-management:extractIncludeProto
> Task :model:fn-execution:extractIncludeProto
> Task :model:job-management:generateProto
> Task :model:fn-execution:generateProto
> Task :sdks:java:extensions:sql:compileJavacc
Java Compiler Compiler Version 4.0 (Parser Generator)
(type "javacc" with no arguments for help)
Reading from file <https://ci-beam.apache.org/job/beam_PostCommit_SQL/ws/src/sdks/java/extensions/sql/build/generated/fmpp/javacc/Parser.jj> . . .
Note: UNICODE_INPUT option is specified. Please make sure you create the parser/lexer using a Reader with the correct character encoding.
Warning: Lookahead adequacy checking not being performed since option LOOKAHEAD is more than 1. Set option FORCE_LA_CHECK to true to force checking.
File "TokenMgrError.java" does not exist. Will create one.
File "ParseException.java" does not exist. Will create one.
File "Token.java" does not exist. Will create one.
File "SimpleCharStream.java" does not exist. Will create one.
Parser generated with 0 errors and 1 warnings.
> Task :model:job-management:compileJava FROM-CACHE
> Task :model:job-management:classes
> Task :model:fn-execution:compileJava FROM-CACHE
> Task :model:fn-execution:classes
> Task :sdks:java:extensions:sql:processResources
> Task :sdks:java:extensions:sql:processTestResources
> Task :model:pipeline:shadowJar
> Task :model:job-management:shadowJar
> Task :model:fn-execution:shadowJar
> Task :sdks:java:core:compileJava FROM-CACHE
> Task :sdks:java:core:classes
> Task :sdks:java:core:shadowJar
> Task :sdks:java:io:mongodb:compileJava FROM-CACHE
> Task :sdks:java:io:mongodb:classes UP-TO-DATE
> Task :sdks:java:io:mongodb:jar
> Task :sdks:java:extensions:join-library:compileJava FROM-CACHE
> Task :sdks:java:extensions:join-library:classes UP-TO-DATE
> Task :sdks:java:extensions:join-library:jar
> Task :runners:core-construction-java:compileJava FROM-CACHE
> Task :runners:core-construction-java:classes UP-TO-DATE
> Task :runners:local-java:compileJava FROM-CACHE
> Task :runners:local-java:classes UP-TO-DATE
> Task :runners:local-java:jar
> Task :vendor:sdks-java-extensions-protobuf:compileJava FROM-CACHE
> Task :vendor:sdks-java-extensions-protobuf:classes UP-TO-DATE
> Task :sdks:java:extensions:protobuf:extractIncludeProto
> Task :sdks:java:extensions:protobuf:generateProto NO-SOURCE
> Task :sdks:java:io:hadoop-common:compileJava FROM-CACHE
> Task :sdks:java:io:hadoop-common:classes UP-TO-DATE
> Task :runners:core-construction-java:jar
> Task :sdks:java:extensions:protobuf:compileJava FROM-CACHE
> Task :sdks:java:io:hadoop-common:jar
> Task :sdks:java:extensions:protobuf:classes UP-TO-DATE
> Task :sdks:java:io:common:compileTestJava FROM-CACHE
> Task :sdks:java:io:common:testClasses UP-TO-DATE
> Task :sdks:java:io:common:testJar
> Task :sdks:java:extensions:protobuf:jar
> Task :sdks:java:fn-execution:compileJava FROM-CACHE
> Task :sdks:java:fn-execution:classes UP-TO-DATE
> Task :vendor:sdks-java-extensions-protobuf:shadowJar
> Task :sdks:java:fn-execution:jar
> Task :sdks:java:io:parquet:compileJava FROM-CACHE
> Task :sdks:java:io:parquet:classes UP-TO-DATE
> Task :sdks:java:io:parquet:jar
> Task :sdks:java:extensions:google-cloud-platform-core:compileJava FROM-CACHE
> Task :sdks:java:extensions:google-cloud-platform-core:classes UP-TO-DATE
> Task :runners:core-java:compileJava FROM-CACHE
> Task :runners:core-java:classes UP-TO-DATE
> Task :sdks:java:extensions:google-cloud-platform-core:jar
> Task :sdks:java:testing:test-utils:compileJava FROM-CACHE
> Task :sdks:java:testing:test-utils:classes UP-TO-DATE
> Task :sdks:java:testing:test-utils:jar
> Task :runners:core-java:jar
> Task :sdks:java:core:jar
> Task :sdks:java:testing:test-utils:compileTestJava FROM-CACHE
> Task :sdks:java:testing:test-utils:testClasses UP-TO-DATE
> Task :sdks:java:testing:test-utils:testJar
> Task :sdks:java:harness:compileJava FROM-CACHE
> Task :sdks:java:harness:classes UP-TO-DATE
> Task :sdks:java:harness:jar
> Task :sdks:java:io:mongodb:compileTestJava FROM-CACHE
> Task :sdks:java:io:mongodb:testClasses UP-TO-DATE
> Task :sdks:java:io:mongodb:testJar
> Task :sdks:java:core:compileTestJava FROM-CACHE
> Task :sdks:java:core:testClasses
> Task :sdks:java:core:shadowTestJar
> Task :sdks:java:extensions:google-cloud-platform-core:compileTestJava FROM-CACHE
> Task :sdks:java:extensions:google-cloud-platform-core:testClasses UP-TO-DATE
> Task :sdks:java:extensions:google-cloud-platform-core:testJar
> Task :sdks:java:harness:shadowJar
> Task :runners:java-fn-execution:compileJava FROM-CACHE
> Task :runners:java-fn-execution:classes UP-TO-DATE
> Task :runners:java-fn-execution:jar
> Task :sdks:java:expansion-service:compileJava FROM-CACHE
> Task :sdks:java:expansion-service:classes UP-TO-DATE
> Task :sdks:java:expansion-service:jar
> Task :runners:direct-java:compileJava FROM-CACHE
> Task :runners:direct-java:classes UP-TO-DATE
> Task :sdks:java:io:kafka:compileJava FROM-CACHE
> Task :sdks:java:io:kafka:classes UP-TO-DATE
> Task :sdks:java:io:kafka:jar
> Task :sdks:java:io:google-cloud-platform:compileJava FROM-CACHE
> Task :sdks:java:io:google-cloud-platform:classes UP-TO-DATE
> Task :sdks:java:io:google-cloud-platform:jar
> Task :runners:direct-java:shadowJar
> Task :sdks:java:io:google-cloud-platform:compileTestJava FROM-CACHE
> Task :sdks:java:io:google-cloud-platform:testClasses
> Task :sdks:java:extensions:sql:compileJava FROM-CACHE
> Task :sdks:java:extensions:sql:classes
> Task :sdks:java:io:google-cloud-platform:testJar
> Task :sdks:java:extensions:sql:compileTestJava FROM-CACHE
> Task :sdks:java:extensions:sql:testClasses
> Task :sdks:java:extensions:sql:integrationTest
org.apache.beam.sdk.extensions.sql.PubsubToBigqueryIT > testSimpleInsert FAILED
java.lang.AssertionError at PubsubToBigqueryIT.java:111
org.apache.beam.sdk.extensions.sql.PubsubToBigqueryIT > testSimpleInsertFlat FAILED
java.lang.AssertionError at PubsubToBigqueryIT.java:162
35 tests completed, 2 failed, 4 skipped
> Task :sdks:java:extensions:sql:integrationTest FAILED
> Task :sdks:java:extensions:sql:jar
> Task :sdks:java:extensions:sql:jdbc:compileJava FROM-CACHE
> Task :sdks:java:extensions:sql:jdbc:classes
> Task :sdks:java:extensions:sql:zetasql:compileJava FROM-CACHE
> Task :sdks:java:extensions:sql:zetasql:classes UP-TO-DATE
> Task :sdks:java:extensions:sql:datacatalog:compileJava FROM-CACHE
> Task :sdks:java:extensions:sql:datacatalog:classes UP-TO-DATE
> Task :sdks:java:extensions:sql:zetasql:jar
> Task :sdks:java:extensions:sql:datacatalog:compileTestJava FROM-CACHE
> Task :sdks:java:extensions:sql:datacatalog:testClasses UP-TO-DATE
> Task :sdks:java:extensions:sql:jdbc:compileTestJava FROM-CACHE
> Task :sdks:java:extensions:sql:jdbc:testClasses UP-TO-DATE
> Task :sdks:java:extensions:sql:jdbc:endToEndTest
> Task :sdks:java:extensions:sql:jdbc:postCommit
> Task :sdks:java:extensions:sql:datacatalog:integrationTest
> Task :sdks:java:extensions:sql:datacatalog:postCommit
FAILURE: Build failed with an exception.
* What went wrong:
Execution failed for task ':sdks:java:extensions:sql:integrationTest'.
> There were failing tests. See the report at: file://<https://ci-beam.apache.org/job/beam_PostCommit_SQL/ws/src/sdks/java/extensions/sql/build/reports/tests/integrationTest/index.html>
* Try:
Run with --stacktrace option to get the stack trace. Run with --info or --debug option to get more log output. Run with --scan to get full insights.
* Get more help at https://help.gradle.org
Deprecated Gradle features were used in this build, making it incompatible with Gradle 6.0.
Use '--warning-mode all' to show the individual deprecation warnings.
See https://docs.gradle.org/5.2.1/userguide/command_line_interface.html#sec:command_line_warnings
BUILD FAILED in 13m 33s
101 actionable tasks: 65 executed, 36 from cache
Publishing build scan...
https://gradle.com/s/ajxzqv4l4jiko
Build step 'Invoke Gradle script' changed build result to FAILURE
Build step 'Invoke Gradle script' marked build as failure
---------------------------------------------------------------------
To unsubscribe, e-mail: builds-unsubscribe@beam.apache.org
For additional commands, e-mail: builds-help@beam.apache.org
Build failed in Jenkins: beam_PostCommit_SQL #5209
Posted by Apache Jenkins Server <je...@builds.apache.org>.
See <https://ci-beam.apache.org/job/beam_PostCommit_SQL/5209/display/redirect?page=changes>
Changes:
[heejong] [BEAM-10679] improving XLang KafkaIO streaming test
[heejong] fix formatting
[heejong] fix incorrect coder issue
[heejong] use Create
[noreply] [BEAM-9919] Added an External Transform API to Go SDK (#12445)
------------------------------------------
[...truncated 4.38 KB...]
> Task :buildSrc:spotlessGroovyGradleCheck
> Task :buildSrc:spotlessCheck
> Task :buildSrc:pluginUnderTestMetadata
> Task :buildSrc:compileTestJava NO-SOURCE
> Task :buildSrc:compileTestGroovy NO-SOURCE
> Task :buildSrc:processTestResources NO-SOURCE
> Task :buildSrc:testClasses UP-TO-DATE
> Task :buildSrc:test NO-SOURCE
> Task :buildSrc:validateTaskProperties FROM-CACHE
> Task :buildSrc:check
> Task :buildSrc:build
Configuration on demand is an incubating feature.
> Task :sdks:java:core:generateAvroProtocol NO-SOURCE
> Task :runners:java-fn-execution:processResources NO-SOURCE
> Task :runners:local-java:processResources NO-SOURCE
> Task :sdks:java:fn-execution:processResources NO-SOURCE
> Task :runners:core-java:processResources NO-SOURCE
> Task :sdks:java:extensions:google-cloud-platform-core:processResources NO-SOURCE
> Task :vendor:sdks-java-extensions-protobuf:processResources NO-SOURCE
> Task :runners:core-construction-java:processResources NO-SOURCE
> Task :sdks:java:harness:processResources NO-SOURCE
> Task :sdks:java:core:generateAvroJava NO-SOURCE
> Task :runners:direct-java:processResources NO-SOURCE
> Task :sdks:java:io:google-cloud-platform:processResources NO-SOURCE
> Task :sdks:java:io:hadoop-common:processResources NO-SOURCE
> Task :sdks:java:io:parquet:processResources NO-SOURCE
> Task :sdks:java:io:mongodb:processResources NO-SOURCE
> Task :sdks:java:io:common:compileJava NO-SOURCE
> Task :sdks:java:testing:test-utils:processResources NO-SOURCE
> Task :sdks:java:io:kafka:processResources NO-SOURCE
> Task :sdks:java:io:mongodb:processTestResources NO-SOURCE
> Task :model:job-management:extractProto
> Task :sdks:java:extensions:protobuf:extractProto
> Task :sdks:java:expansion-service:createCheckerFrameworkManifest
> Task :sdks:java:extensions:join-library:createCheckerFrameworkManifest
> Task :model:fn-execution:extractProto
> Task :sdks:java:testing:test-utils:processTestResources NO-SOURCE
> Task :sdks:java:extensions:sql:zetasql:processResources NO-SOURCE
> Task :sdks:java:extensions:join-library:processResources NO-SOURCE
> Task :sdks:java:extensions:protobuf:processResources NO-SOURCE
> Task :sdks:java:expansion-service:processResources NO-SOURCE
> Task :sdks:java:io:common:processResources NO-SOURCE
> Task :sdks:java:io:common:classes UP-TO-DATE
> Task :sdks:java:extensions:sql:datacatalog:createCheckerFrameworkManifest
> Task :sdks:java:extensions:google-cloud-platform-core:processTestResources NO-SOURCE
> Task :sdks:java:extensions:sql:datacatalog:processResources NO-SOURCE
> Task :sdks:java:core:generateGrammarSource FROM-CACHE
> Task :sdks:java:extensions:sql:datacatalog:processTestResources NO-SOURCE
> Task :model:job-management:processResources
> Task :model:fn-execution:processResources
> Task :sdks:java:extensions:sql:jdbc:processResources
> Task :sdks:java:extensions:sql:jdbc:processTestResources NO-SOURCE
> Task :sdks:java:core:processResources
> Task :sdks:java:core:generateTestAvroProtocol NO-SOURCE
> Task :sdks:java:io:common:jar
> Task :sdks:java:io:common:processTestResources NO-SOURCE
> Task :sdks:java:io:google-cloud-platform:processTestResources
> Task :sdks:java:core:generateTestAvroJava
> Task :sdks:java:core:generateTestGrammarSource NO-SOURCE
> Task :sdks:java:core:processTestResources
> Task :model:pipeline:extractIncludeProto
> Task :model:pipeline:extractProto
> Task :sdks:java:extensions:sql:copyFmppTemplatesFromCalciteCore
> Task :sdks:java:extensions:sql:copyFmppTemplatesFromSrc
> Task :model:pipeline:generateProto
> Task :model:pipeline:compileJava FROM-CACHE
> Task :model:pipeline:processResources
> Task :model:pipeline:classes
> Task :model:pipeline:jar
> Task :sdks:java:extensions:sql:generateFmppSources
> Task :model:fn-execution:extractIncludeProto
> Task :model:job-management:extractIncludeProto
> Task :model:job-management:generateProto
> Task :model:fn-execution:generateProto
> Task :sdks:java:extensions:sql:compileJavacc
Java Compiler Compiler Version 4.0 (Parser Generator)
(type "javacc" with no arguments for help)
Reading from file <https://ci-beam.apache.org/job/beam_PostCommit_SQL/ws/src/sdks/java/extensions/sql/build/generated/fmpp/javacc/Parser.jj> . . .
Warning: Note: UNICODE_INPUT option is specified. Please make sure you create the parser/lexer using a Reader with the correct character encoding.
Lookahead adequacy checking not being performed since option LOOKAHEAD is more than 1. Set option FORCE_LA_CHECK to true to force checking.
> Task :model:job-management:compileJava FROM-CACHE
> Task :model:fn-execution:compileJava FROM-CACHE
> Task :model:job-management:classes
> Task :model:fn-execution:classes
> Task :sdks:java:extensions:sql:compileJavacc
File "TokenMgrError.java" does not exist. Will create one.
File "ParseException.java" does not exist. Will create one.
File "Token.java" does not exist. Will create one.
File "SimpleCharStream.java" does not exist. Will create one.
Parser generated with 0 errors and 1 warnings.
> Task :sdks:java:extensions:sql:processResources
> Task :sdks:java:extensions:sql:processTestResources
> Task :model:pipeline:shadowJar
> Task :model:job-management:shadowJar
> Task :model:fn-execution:shadowJar
> Task :sdks:java:core:compileJava FROM-CACHE
> Task :sdks:java:core:classes
> Task :sdks:java:core:shadowJar
> Task :runners:local-java:compileJava FROM-CACHE
> Task :runners:local-java:classes UP-TO-DATE
> Task :sdks:java:io:hadoop-common:compileJava FROM-CACHE
> Task :sdks:java:io:hadoop-common:classes UP-TO-DATE
> Task :sdks:java:io:common:compileTestJava FROM-CACHE
> Task :sdks:java:io:common:testClasses UP-TO-DATE
> Task :sdks:java:extensions:join-library:compileJava FROM-CACHE
> Task :sdks:java:extensions:join-library:classes UP-TO-DATE
> Task :vendor:sdks-java-extensions-protobuf:compileJava FROM-CACHE
> Task :vendor:sdks-java-extensions-protobuf:classes UP-TO-DATE
> Task :sdks:java:io:mongodb:compileJava FROM-CACHE
> Task :sdks:java:io:mongodb:classes UP-TO-DATE
> Task :sdks:java:io:common:testJar
> Task :sdks:java:extensions:join-library:jar
> Task :sdks:java:io:hadoop-common:jar
> Task :sdks:java:fn-execution:compileJava FROM-CACHE
> Task :sdks:java:fn-execution:classes UP-TO-DATE
> Task :runners:local-java:jar
> Task :sdks:java:io:mongodb:jar
> Task :sdks:java:extensions:google-cloud-platform-core:compileJava FROM-CACHE
> Task :sdks:java:extensions:google-cloud-platform-core:classes UP-TO-DATE
> Task :sdks:java:fn-execution:jar
> Task :runners:core-construction-java:compileJava FROM-CACHE
> Task :runners:core-construction-java:classes UP-TO-DATE
> Task :sdks:java:extensions:google-cloud-platform-core:jar
> Task :sdks:java:io:parquet:compileJava FROM-CACHE
> Task :sdks:java:io:parquet:classes UP-TO-DATE
> Task :sdks:java:io:parquet:jar
> Task :sdks:java:extensions:protobuf:extractIncludeProto
> Task :sdks:java:extensions:protobuf:generateProto NO-SOURCE
> Task :sdks:java:core:jar
> Task :vendor:sdks-java-extensions-protobuf:shadowJar
> Task :runners:core-construction-java:jar
> Task :sdks:java:testing:test-utils:compileJava FROM-CACHE
> Task :sdks:java:testing:test-utils:classes UP-TO-DATE
> Task :sdks:java:extensions:protobuf:compileJava FROM-CACHE
> Task :sdks:java:extensions:protobuf:classes UP-TO-DATE
> Task :sdks:java:testing:test-utils:jar
> Task :runners:core-java:compileJava FROM-CACHE
> Task :runners:core-java:classes UP-TO-DATE
> Task :sdks:java:extensions:protobuf:jar
> Task :runners:core-java:jar
> Task :sdks:java:testing:test-utils:compileTestJava FROM-CACHE
> Task :sdks:java:testing:test-utils:testClasses UP-TO-DATE
> Task :sdks:java:testing:test-utils:testJar
> Task :sdks:java:harness:compileJava FROM-CACHE
> Task :sdks:java:harness:classes UP-TO-DATE
> Task :sdks:java:harness:jar
> Task :sdks:java:core:compileTestJava FROM-CACHE
> Task :sdks:java:core:testClasses
> Task :sdks:java:core:shadowTestJar
> Task :sdks:java:extensions:google-cloud-platform-core:compileTestJava FROM-CACHE
> Task :sdks:java:extensions:google-cloud-platform-core:testClasses UP-TO-DATE
> Task :sdks:java:extensions:google-cloud-platform-core:testJar
> Task :sdks:java:io:mongodb:compileTestJava
Note: <https://ci-beam.apache.org/job/beam_PostCommit_SQL/ws/src/sdks/java/io/mongodb/src/test/java/org/apache/beam/sdk/io/mongodb/MongoDBGridFSIOTest.java> uses or overrides a deprecated API.
Note: Recompile with -Xlint:deprecation for details.
> Task :sdks:java:io:mongodb:testClasses
> Task :sdks:java:io:mongodb:testJar
> Task :sdks:java:harness:shadowJar
> Task :runners:java-fn-execution:compileJava FROM-CACHE
> Task :runners:java-fn-execution:classes UP-TO-DATE
> Task :runners:java-fn-execution:jar
> Task :sdks:java:expansion-service:compileJava FROM-CACHE
> Task :sdks:java:expansion-service:classes UP-TO-DATE
> Task :sdks:java:expansion-service:jar
> Task :runners:direct-java:compileJava FROM-CACHE
> Task :runners:direct-java:classes UP-TO-DATE
> Task :sdks:java:io:kafka:compileJava FROM-CACHE
> Task :sdks:java:io:kafka:classes UP-TO-DATE
> Task :sdks:java:io:kafka:jar
> Task :sdks:java:io:google-cloud-platform:compileJava FROM-CACHE
> Task :sdks:java:io:google-cloud-platform:classes UP-TO-DATE
> Task :sdks:java:io:google-cloud-platform:jar
> Task :runners:direct-java:shadowJar
> Task :sdks:java:io:google-cloud-platform:compileTestJava FROM-CACHE
> Task :sdks:java:io:google-cloud-platform:testClasses
> Task :sdks:java:extensions:sql:compileJava FROM-CACHE
> Task :sdks:java:extensions:sql:classes
> Task :sdks:java:io:google-cloud-platform:testJar
> Task :sdks:java:extensions:sql:compileTestJava
Note: Some input files use or override a deprecated API.
Note: Recompile with -Xlint:deprecation for details.
Note: Some input files use unchecked or unsafe operations.
Note: Recompile with -Xlint:unchecked for details.
> Task :sdks:java:extensions:sql:testClasses
> Task :sdks:java:extensions:sql:integrationTest
org.apache.beam.sdk.extensions.sql.PubsubToBigqueryIT > testSimpleInsert FAILED
java.lang.AssertionError at PubsubToBigqueryIT.java:111
org.apache.beam.sdk.extensions.sql.PubsubToBigqueryIT > testSimpleInsertFlat FAILED
java.lang.AssertionError at PubsubToBigqueryIT.java:162
35 tests completed, 2 failed, 4 skipped
> Task :sdks:java:extensions:sql:integrationTest FAILED
> Task :sdks:java:extensions:sql:jar
> Task :sdks:java:extensions:sql:zetasql:compileJava FROM-CACHE
> Task :sdks:java:extensions:sql:zetasql:classes UP-TO-DATE
> Task :sdks:java:extensions:sql:zetasql:jar
> Task :sdks:java:extensions:sql:jdbc:compileJava
> Task :sdks:java:extensions:sql:jdbc:classes
> Task :sdks:java:extensions:sql:jdbc:compileTestJava
Note: Some input files use or override a deprecated API.
Note: Recompile with -Xlint:deprecation for details.
Note: Some input files use unchecked or unsafe operations.
Note: Recompile with -Xlint:unchecked for details.
> Task :sdks:java:extensions:sql:jdbc:testClasses
> Task :sdks:java:extensions:sql:jdbc:endToEndTest
> Task :sdks:java:extensions:sql:jdbc:postCommit
> Task :sdks:java:extensions:sql:datacatalog:compileJava
> Task :sdks:java:extensions:sql:datacatalog:classes
> Task :sdks:java:extensions:sql:datacatalog:compileTestJava
> Task :sdks:java:extensions:sql:datacatalog:testClasses
> Task :sdks:java:extensions:sql:datacatalog:integrationTest
> Task :sdks:java:extensions:sql:datacatalog:postCommit
FAILURE: Build failed with an exception.
* What went wrong:
Execution failed for task ':sdks:java:extensions:sql:integrationTest'.
> There were failing tests. See the report at: file://<https://ci-beam.apache.org/job/beam_PostCommit_SQL/ws/src/sdks/java/extensions/sql/build/reports/tests/integrationTest/index.html>
* Try:
Run with --stacktrace option to get the stack trace. Run with --info or --debug option to get more log output. Run with --scan to get full insights.
* Get more help at https://help.gradle.org
Deprecated Gradle features were used in this build, making it incompatible with Gradle 6.0.
Use '--warning-mode all' to show the individual deprecation warnings.
See https://docs.gradle.org/5.2.1/userguide/command_line_interface.html#sec:command_line_warnings
BUILD FAILED in 14m 28s
101 actionable tasks: 71 executed, 30 from cache
Publishing build scan...
https://gradle.com/s/a2lf6eio3nkis
Build step 'Invoke Gradle script' changed build result to FAILURE
Build step 'Invoke Gradle script' marked build as failure
---------------------------------------------------------------------
To unsubscribe, e-mail: builds-unsubscribe@beam.apache.org
For additional commands, e-mail: builds-help@beam.apache.org
Build failed in Jenkins: beam_PostCommit_SQL #5208
Posted by Apache Jenkins Server <je...@builds.apache.org>.
See <https://ci-beam.apache.org/job/beam_PostCommit_SQL/5208/display/redirect?page=changes>
Changes:
[yoshiki.obata] [BEAM-9980] add groovy functions for python versions
[yoshiki.obata] [BEAM-9980] update dataflow test-suites to switch python versions using
[yoshiki.obata] [BEAM-9980] version switchable dataflow tasks to be invoked
[yoshiki.obata] [BEAM-9980] :sdks:python:test-suites:dataflow included in
[Luke Cwik] [BEAM-10670] Make key coder deterministic by using upstream PCollection
[Udi Meiri] [BEAM-10697] Remove testPy2Cython from precommit
[noreply] [BEAM-9891] Generate query execution summary table after finishing jobs
------------------------------------------
[...truncated 1.94 KB...]
SPARK_LOCAL_IP=127.0.0.1
[EnvInject] - Variables injected successfully.
[Gradle] - Launching build.
[src] $ <https://ci-beam.apache.org/job/beam_PostCommit_SQL/ws/src/gradlew> --continue --max-workers=12 -Dorg.gradle.jvmargs=-Xms2g -Dorg.gradle.jvmargs=-Xmx4g -Pdocker-pull-licenses :sqlPostCommit
Starting a Gradle Daemon, 3 busy and 1 incompatible Daemons could not be reused, use --status for details
> Task :buildSrc:compileJava NO-SOURCE
> Task :buildSrc:compileGroovy FROM-CACHE
> Task :buildSrc:pluginDescriptors
> Task :buildSrc:processResources
> Task :buildSrc:classes
> Task :buildSrc:jar
> Task :buildSrc:assemble
> Task :buildSrc:spotlessGroovy
> Task :buildSrc:spotlessGroovyCheck
> Task :buildSrc:spotlessGroovyGradle
> Task :buildSrc:spotlessGroovyGradleCheck
> Task :buildSrc:spotlessCheck
> Task :buildSrc:pluginUnderTestMetadata
> Task :buildSrc:compileTestJava NO-SOURCE
> Task :buildSrc:compileTestGroovy NO-SOURCE
> Task :buildSrc:processTestResources NO-SOURCE
> Task :buildSrc:testClasses UP-TO-DATE
> Task :buildSrc:test NO-SOURCE
> Task :buildSrc:validateTaskProperties FROM-CACHE
> Task :buildSrc:check
> Task :buildSrc:build
Configuration on demand is an incubating feature.
> Task :sdks:java:core:generateAvroProtocol NO-SOURCE
> Task :sdks:java:harness:processResources NO-SOURCE
> Task :vendor:sdks-java-extensions-protobuf:processResources NO-SOURCE
> Task :runners:core-java:processResources NO-SOURCE
> Task :sdks:java:fn-execution:processResources NO-SOURCE
> Task :runners:core-construction-java:processResources NO-SOURCE
> Task :runners:direct-java:processResources NO-SOURCE
> Task :runners:java-fn-execution:processResources NO-SOURCE
> Task :sdks:java:extensions:google-cloud-platform-core:processResources NO-SOURCE
> Task :sdks:java:core:generateAvroJava NO-SOURCE
> Task :runners:local-java:processResources NO-SOURCE
> Task :sdks:java:expansion-service:createCheckerFrameworkManifest
> Task :sdks:java:io:kafka:processResources NO-SOURCE
> Task :sdks:java:expansion-service:processResources NO-SOURCE
> Task :sdks:java:io:google-cloud-platform:processResources NO-SOURCE
> Task :sdks:java:extensions:join-library:createCheckerFrameworkManifest
> Task :sdks:java:io:hadoop-common:processResources NO-SOURCE
> Task :sdks:java:io:parquet:processResources NO-SOURCE
> Task :model:fn-execution:extractProto
> Task :sdks:java:extensions:join-library:processResources NO-SOURCE
> Task :sdks:java:extensions:sql:zetasql:processResources NO-SOURCE
> Task :sdks:java:extensions:protobuf:extractProto
> Task :model:job-management:extractProto
> Task :sdks:java:extensions:protobuf:processResources NO-SOURCE
> Task :sdks:java:io:mongodb:processResources NO-SOURCE
> Task :sdks:java:extensions:google-cloud-platform-core:processTestResources NO-SOURCE
> Task :sdks:java:testing:test-utils:processResources NO-SOURCE
> Task :sdks:java:io:common:compileJava NO-SOURCE
> Task :sdks:java:extensions:sql:datacatalog:createCheckerFrameworkManifest
> Task :model:fn-execution:processResources
> Task :sdks:java:extensions:sql:datacatalog:processResources NO-SOURCE
> Task :sdks:java:testing:test-utils:processTestResources NO-SOURCE
> Task :sdks:java:io:mongodb:processTestResources NO-SOURCE
> Task :sdks:java:core:generateGrammarSource FROM-CACHE
> Task :sdks:java:extensions:sql:datacatalog:processTestResources NO-SOURCE
> Task :sdks:java:io:common:processResources NO-SOURCE
> Task :model:job-management:processResources
> Task :sdks:java:io:common:classes UP-TO-DATE
> Task :sdks:java:io:common:jar
> Task :sdks:java:io:common:processTestResources NO-SOURCE
> Task :sdks:java:core:processResources
> Task :sdks:java:core:generateTestAvroProtocol NO-SOURCE
> Task :sdks:java:extensions:sql:jdbc:processResources
> Task :sdks:java:extensions:sql:jdbc:processTestResources NO-SOURCE
> Task :sdks:java:io:google-cloud-platform:processTestResources
> Task :sdks:java:extensions:sql:copyFmppTemplatesFromCalciteCore
> Task :sdks:java:extensions:sql:copyFmppTemplatesFromSrc
> Task :sdks:java:core:generateTestAvroJava
> Task :sdks:java:core:generateTestGrammarSource NO-SOURCE
> Task :sdks:java:core:processTestResources
> Task :model:pipeline:extractIncludeProto
> Task :model:pipeline:extractProto
> Task :sdks:java:extensions:sql:generateFmppSources
> Task :model:pipeline:generateProto
> Task :model:pipeline:compileJava FROM-CACHE
> Task :model:pipeline:processResources
> Task :model:pipeline:classes
> Task :sdks:java:extensions:sql:compileJavacc
Java Compiler Compiler Version 4.0 (Parser Generator)
(type "javacc" with no arguments for help)
Reading from file <https://ci-beam.apache.org/job/beam_PostCommit_SQL/ws/src/sdks/java/extensions/sql/build/generated/fmpp/javacc/Parser.jj> . . .
Note: UNICODE_INPUT option is specified. Please make sure you create the parser/lexer using a Reader with the correct character encoding.
Warning: Lookahead adequacy checking not being performed since option LOOKAHEAD is more than 1. Set option FORCE_LA_CHECK to true to force checking.
> Task :model:pipeline:jar
> Task :model:fn-execution:extractIncludeProto
> Task :model:job-management:extractIncludeProto
> Task :sdks:java:extensions:sql:compileJavacc
File "TokenMgrError.java" does not exist. Will create one.
File "ParseException.java" does not exist. Will create one.
File "Token.java" does not exist. Will create one.
File "SimpleCharStream.java" does not exist. Will create one.
Parser generated with 0 errors and 1 warnings.
> Task :model:job-management:generateProto
> Task :model:fn-execution:generateProto
> Task :sdks:java:extensions:sql:processResources
> Task :sdks:java:extensions:sql:processTestResources
> Task :model:job-management:compileJava FROM-CACHE
> Task :model:job-management:classes
> Task :model:fn-execution:compileJava FROM-CACHE
> Task :model:fn-execution:classes
> Task :model:pipeline:shadowJar
> Task :model:job-management:shadowJar
> Task :model:fn-execution:shadowJar
> Task :sdks:java:core:compileJava FROM-CACHE
> Task :sdks:java:core:classes
> Task :sdks:java:core:shadowJar
> Task :sdks:java:io:common:compileTestJava FROM-CACHE
> Task :sdks:java:extensions:join-library:compileJava FROM-CACHE
> Task :vendor:sdks-java-extensions-protobuf:compileJava FROM-CACHE
> Task :sdks:java:io:common:testClasses UP-TO-DATE
> Task :vendor:sdks-java-extensions-protobuf:classes UP-TO-DATE
> Task :sdks:java:extensions:join-library:classes UP-TO-DATE
> Task :sdks:java:io:common:testJar
> Task :sdks:java:extensions:join-library:jar
> Task :sdks:java:extensions:protobuf:extractIncludeProto
> Task :sdks:java:extensions:protobuf:generateProto NO-SOURCE
> Task :sdks:java:io:mongodb:compileJava FROM-CACHE
> Task :sdks:java:io:mongodb:classes UP-TO-DATE
> Task :runners:local-java:compileJava FROM-CACHE
> Task :runners:local-java:classes UP-TO-DATE
> Task :runners:core-construction-java:compileJava FROM-CACHE
> Task :runners:core-construction-java:classes UP-TO-DATE
> Task :sdks:java:io:mongodb:jar
> Task :runners:local-java:jar
> Task :sdks:java:extensions:protobuf:compileJava FROM-CACHE
> Task :sdks:java:extensions:protobuf:classes UP-TO-DATE
> Task :sdks:java:io:hadoop-common:compileJava FROM-CACHE
> Task :sdks:java:io:hadoop-common:classes UP-TO-DATE
> Task :sdks:java:io:hadoop-common:jar
> Task :sdks:java:extensions:protobuf:jar
> Task :sdks:java:fn-execution:compileJava FROM-CACHE
> Task :sdks:java:fn-execution:classes UP-TO-DATE
> Task :sdks:java:fn-execution:jar
> Task :vendor:sdks-java-extensions-protobuf:shadowJar
> Task :runners:core-construction-java:jar
> Task :sdks:java:io:parquet:compileJava FROM-CACHE
> Task :sdks:java:io:parquet:classes UP-TO-DATE
> Task :sdks:java:io:parquet:jar
> Task :sdks:java:extensions:google-cloud-platform-core:compileJava FROM-CACHE
> Task :sdks:java:extensions:google-cloud-platform-core:classes UP-TO-DATE
> Task :runners:core-java:compileJava FROM-CACHE
> Task :runners:core-java:classes UP-TO-DATE
> Task :sdks:java:extensions:google-cloud-platform-core:jar
> Task :runners:core-java:jar
> Task :sdks:java:core:jar
> Task :sdks:java:harness:compileJava FROM-CACHE
> Task :sdks:java:harness:classes UP-TO-DATE
> Task :sdks:java:testing:test-utils:compileJava FROM-CACHE
> Task :sdks:java:testing:test-utils:classes UP-TO-DATE
> Task :sdks:java:testing:test-utils:jar
> Task :sdks:java:harness:jar
> Task :sdks:java:testing:test-utils:compileTestJava FROM-CACHE
> Task :sdks:java:testing:test-utils:testClasses UP-TO-DATE
> Task :sdks:java:testing:test-utils:testJar
> Task :sdks:java:io:mongodb:compileTestJava FROM-CACHE
> Task :sdks:java:io:mongodb:testClasses UP-TO-DATE
> Task :sdks:java:io:mongodb:testJar
> Task :sdks:java:core:compileTestJava FROM-CACHE
> Task :sdks:java:core:testClasses
> Task :sdks:java:core:shadowTestJar
> Task :sdks:java:extensions:google-cloud-platform-core:compileTestJava FROM-CACHE
> Task :sdks:java:extensions:google-cloud-platform-core:testClasses UP-TO-DATE
> Task :sdks:java:extensions:google-cloud-platform-core:testJar
> Task :sdks:java:harness:shadowJar
> Task :runners:java-fn-execution:compileJava FROM-CACHE
> Task :runners:java-fn-execution:classes UP-TO-DATE
> Task :runners:java-fn-execution:jar
> Task :sdks:java:expansion-service:compileJava FROM-CACHE
> Task :sdks:java:expansion-service:classes UP-TO-DATE
> Task :sdks:java:expansion-service:jar
> Task :runners:direct-java:compileJava FROM-CACHE
> Task :runners:direct-java:classes UP-TO-DATE
> Task :sdks:java:io:kafka:compileJava FROM-CACHE
> Task :sdks:java:io:kafka:classes UP-TO-DATE
> Task :sdks:java:io:kafka:jar
> Task :sdks:java:io:google-cloud-platform:compileJava FROM-CACHE
> Task :sdks:java:io:google-cloud-platform:classes UP-TO-DATE
> Task :sdks:java:io:google-cloud-platform:jar
> Task :runners:direct-java:shadowJar
> Task :sdks:java:io:google-cloud-platform:compileTestJava FROM-CACHE
> Task :sdks:java:io:google-cloud-platform:testClasses
> Task :sdks:java:extensions:sql:compileJava FROM-CACHE
> Task :sdks:java:extensions:sql:classes
> Task :sdks:java:extensions:sql:compileTestJava FROM-CACHE
> Task :sdks:java:extensions:sql:testClasses
> Task :sdks:java:io:google-cloud-platform:testJar
> Task :sdks:java:extensions:sql:integrationTest
org.apache.beam.sdk.extensions.sql.PubsubToBigqueryIT > testSimpleInsert FAILED
java.lang.AssertionError at PubsubToBigqueryIT.java:111
org.apache.beam.sdk.extensions.sql.PubsubToBigqueryIT > testSimpleInsertFlat FAILED
java.lang.AssertionError at PubsubToBigqueryIT.java:162
35 tests completed, 2 failed, 4 skipped
> Task :sdks:java:extensions:sql:integrationTest FAILED
> Task :sdks:java:extensions:sql:jar
> Task :sdks:java:extensions:sql:jdbc:compileJava FROM-CACHE
> Task :sdks:java:extensions:sql:jdbc:classes
> Task :sdks:java:extensions:sql:datacatalog:compileJava FROM-CACHE
> Task :sdks:java:extensions:sql:datacatalog:classes UP-TO-DATE
> Task :sdks:java:extensions:sql:zetasql:compileJava FROM-CACHE
> Task :sdks:java:extensions:sql:zetasql:classes UP-TO-DATE
> Task :sdks:java:extensions:sql:zetasql:jar
> Task :sdks:java:extensions:sql:jdbc:compileTestJava FROM-CACHE
> Task :sdks:java:extensions:sql:jdbc:testClasses UP-TO-DATE
> Task :sdks:java:extensions:sql:datacatalog:compileTestJava FROM-CACHE
> Task :sdks:java:extensions:sql:datacatalog:testClasses UP-TO-DATE
> Task :sdks:java:extensions:sql:jdbc:endToEndTest
> Task :sdks:java:extensions:sql:jdbc:postCommit
> Task :sdks:java:extensions:sql:datacatalog:integrationTest
> Task :sdks:java:extensions:sql:datacatalog:postCommit
FAILURE: Build failed with an exception.
* What went wrong:
Execution failed for task ':sdks:java:extensions:sql:integrationTest'.
> There were failing tests. See the report at: file://<https://ci-beam.apache.org/job/beam_PostCommit_SQL/ws/src/sdks/java/extensions/sql/build/reports/tests/integrationTest/index.html>
* Try:
Run with --stacktrace option to get the stack trace. Run with --info or --debug option to get more log output. Run with --scan to get full insights.
* Get more help at https://help.gradle.org
Deprecated Gradle features were used in this build, making it incompatible with Gradle 6.0.
Use '--warning-mode all' to show the individual deprecation warnings.
See https://docs.gradle.org/5.2.1/userguide/command_line_interface.html#sec:command_line_warnings
BUILD FAILED in 17m 25s
101 actionable tasks: 65 executed, 36 from cache
Publishing build scan...
https://gradle.com/s/q7qzgb3gwhyym
Build step 'Invoke Gradle script' changed build result to FAILURE
Build step 'Invoke Gradle script' marked build as failure
---------------------------------------------------------------------
To unsubscribe, e-mail: builds-unsubscribe@beam.apache.org
For additional commands, e-mail: builds-help@beam.apache.org
Build failed in Jenkins: beam_PostCommit_SQL #5207
Posted by Apache Jenkins Server <je...@builds.apache.org>.
See <https://ci-beam.apache.org/job/beam_PostCommit_SQL/5207/display/redirect?page=changes>
Changes:
[katarzyna.kucharczyk] [BEAM-10672] Added streaming option to combine test
[katarzyna.kucharczyk] [BEAM-10672] Added experimental dataflow param
[katarzyna.kucharczyk] [BEAM-10672] Spottless Apply
[katarzyna.kucharczyk] [BEAM-10672] Updated streaming commands
[katarzyna.kucharczyk] [BEAM-10672] Fixes after review in combine python load test
[katarzyna.kucharczyk] [BEAM-10672] Changed jobType variable into mode to declare if it is
------------------------------------------
[...truncated 4.17 KB...]
> Task :buildSrc:spotlessGroovyGradle
> Task :buildSrc:spotlessGroovyGradleCheck
> Task :buildSrc:spotlessCheck
> Task :buildSrc:pluginUnderTestMetadata
> Task :buildSrc:compileTestJava NO-SOURCE
> Task :buildSrc:compileTestGroovy NO-SOURCE
> Task :buildSrc:processTestResources NO-SOURCE
> Task :buildSrc:testClasses UP-TO-DATE
> Task :buildSrc:test NO-SOURCE
> Task :buildSrc:validateTaskProperties FROM-CACHE
> Task :buildSrc:check
> Task :buildSrc:build
Configuration on demand is an incubating feature.
> Task :runners:core-java:processResources NO-SOURCE
> Task :sdks:java:core:generateAvroProtocol NO-SOURCE
> Task :runners:local-java:processResources NO-SOURCE
> Task :vendor:sdks-java-extensions-protobuf:processResources NO-SOURCE
> Task :runners:java-fn-execution:processResources NO-SOURCE
> Task :runners:core-construction-java:processResources NO-SOURCE
> Task :sdks:java:extensions:google-cloud-platform-core:processResources NO-SOURCE
> Task :sdks:java:fn-execution:processResources NO-SOURCE
> Task :sdks:java:harness:processResources NO-SOURCE
> Task :runners:direct-java:processResources NO-SOURCE
> Task :sdks:java:core:generateAvroJava NO-SOURCE
> Task :sdks:java:io:hadoop-common:processResources NO-SOURCE
> Task :sdks:java:io:mongodb:processResources NO-SOURCE
> Task :sdks:java:io:google-cloud-platform:processResources NO-SOURCE
> Task :sdks:java:io:kafka:processResources NO-SOURCE
> Task :sdks:java:expansion-service:createCheckerFrameworkManifest
> Task :sdks:java:extensions:join-library:createCheckerFrameworkManifest
> Task :model:fn-execution:extractProto
> Task :model:job-management:extractProto
> Task :sdks:java:extensions:protobuf:extractProto
> Task :sdks:java:io:mongodb:processTestResources NO-SOURCE
> Task :sdks:java:io:common:compileJava NO-SOURCE
> Task :sdks:java:extensions:join-library:processResources NO-SOURCE
> Task :sdks:java:extensions:protobuf:processResources NO-SOURCE
> Task :sdks:java:expansion-service:processResources NO-SOURCE
> Task :sdks:java:io:parquet:processResources NO-SOURCE
> Task :sdks:java:extensions:sql:zetasql:processResources NO-SOURCE
> Task :sdks:java:extensions:google-cloud-platform-core:processTestResources NO-SOURCE
> Task :sdks:java:extensions:sql:datacatalog:createCheckerFrameworkManifest
> Task :sdks:java:testing:test-utils:processResources NO-SOURCE
> Task :sdks:java:io:common:processResources NO-SOURCE
> Task :sdks:java:extensions:sql:datacatalog:processResources NO-SOURCE
> Task :sdks:java:extensions:sql:datacatalog:processTestResources NO-SOURCE
> Task :sdks:java:io:common:classes UP-TO-DATE
> Task :model:job-management:processResources
> Task :sdks:java:testing:test-utils:processTestResources NO-SOURCE
> Task :sdks:java:core:generateGrammarSource FROM-CACHE
> Task :model:fn-execution:processResources
> Task :sdks:java:io:common:jar
> Task :sdks:java:io:common:processTestResources NO-SOURCE
> Task :sdks:java:extensions:sql:jdbc:processResources
> Task :sdks:java:extensions:sql:jdbc:processTestResources NO-SOURCE
> Task :sdks:java:core:processResources
> Task :sdks:java:core:generateTestAvroProtocol NO-SOURCE
> Task :sdks:java:io:google-cloud-platform:processTestResources
> Task :sdks:java:core:generateTestAvroJava
> Task :sdks:java:core:generateTestGrammarSource NO-SOURCE
> Task :sdks:java:core:processTestResources
> Task :sdks:java:extensions:sql:copyFmppTemplatesFromCalciteCore
> Task :sdks:java:extensions:sql:copyFmppTemplatesFromSrc
> Task :model:pipeline:extractIncludeProto
> Task :model:pipeline:extractProto
> Task :model:pipeline:generateProto
> Task :model:pipeline:compileJava FROM-CACHE
> Task :model:pipeline:processResources
> Task :model:pipeline:classes
> Task :model:pipeline:jar
> Task :model:job-management:extractIncludeProto
> Task :model:fn-execution:extractIncludeProto
> Task :sdks:java:extensions:sql:generateFmppSources
> Task :model:job-management:generateProto
> Task :model:fn-execution:generateProto
> Task :model:job-management:compileJava FROM-CACHE
> Task :model:job-management:classes
> Task :model:fn-execution:compileJava FROM-CACHE
> Task :model:fn-execution:classes
> Task :sdks:java:extensions:sql:compileJavacc
Java Compiler Compiler Version 4.0 (Parser Generator)
(type "javacc" with no arguments for help)
Reading from file <https://ci-beam.apache.org/job/beam_PostCommit_SQL/ws/src/sdks/java/extensions/sql/build/generated/fmpp/javacc/Parser.jj> . . .
Note: UNICODE_INPUT option is specified. Please make sure you create the parser/lexer using a Reader with the correct character encoding.
Warning: Lookahead adequacy checking not being performed since option LOOKAHEAD is more than 1. Set option FORCE_LA_CHECK to true to force checking.
File "TokenMgrError.java" does not exist. Will create one.
File "ParseException.java" does not exist. Will create one.
File "Token.java" does not exist. Will create one.
File "SimpleCharStream.java" does not exist. Will create one.
Parser generated with 0 errors and 1 warnings.
> Task :sdks:java:extensions:sql:processResources
> Task :sdks:java:extensions:sql:processTestResources
> Task :model:pipeline:shadowJar
> Task :model:job-management:shadowJar
> Task :model:fn-execution:shadowJar
> Task :sdks:java:core:compileJava FROM-CACHE
> Task :sdks:java:core:classes
> Task :sdks:java:core:shadowJar
> Task :sdks:java:extensions:join-library:compileJava FROM-CACHE
> Task :sdks:java:extensions:join-library:classes UP-TO-DATE
> Task :sdks:java:io:mongodb:compileJava FROM-CACHE
> Task :sdks:java:io:mongodb:classes UP-TO-DATE
> Task :sdks:java:extensions:join-library:jar
> Task :sdks:java:io:mongodb:jar
> Task :runners:local-java:compileJava FROM-CACHE
> Task :sdks:java:io:common:compileTestJava FROM-CACHE
> Task :sdks:java:io:hadoop-common:compileJava FROM-CACHE
> Task :runners:local-java:classes UP-TO-DATE
> Task :sdks:java:io:hadoop-common:classes UP-TO-DATE
> Task :sdks:java:io:common:testClasses UP-TO-DATE
> Task :vendor:sdks-java-extensions-protobuf:compileJava FROM-CACHE
> Task :vendor:sdks-java-extensions-protobuf:classes UP-TO-DATE
> Task :runners:local-java:jar
> Task :sdks:java:io:hadoop-common:jar
> Task :sdks:java:io:common:testJar
> Task :sdks:java:extensions:protobuf:extractIncludeProto
> Task :sdks:java:extensions:protobuf:generateProto NO-SOURCE
> Task :sdks:java:io:parquet:compileJava FROM-CACHE
> Task :sdks:java:io:parquet:classes UP-TO-DATE
> Task :runners:core-construction-java:compileJava FROM-CACHE
> Task :runners:core-construction-java:classes UP-TO-DATE
> Task :sdks:java:io:parquet:jar
> Task :sdks:java:fn-execution:compileJava FROM-CACHE
> Task :sdks:java:fn-execution:classes UP-TO-DATE
> Task :sdks:java:extensions:protobuf:compileJava FROM-CACHE
> Task :sdks:java:extensions:protobuf:classes UP-TO-DATE
> Task :vendor:sdks-java-extensions-protobuf:shadowJar
> Task :sdks:java:extensions:protobuf:jar
> Task :sdks:java:fn-execution:jar
> Task :sdks:java:extensions:google-cloud-platform-core:compileJava FROM-CACHE
> Task :sdks:java:extensions:google-cloud-platform-core:classes UP-TO-DATE
> Task :sdks:java:extensions:google-cloud-platform-core:jar
> Task :runners:core-construction-java:jar
> Task :sdks:java:testing:test-utils:compileJava FROM-CACHE
> Task :sdks:java:testing:test-utils:classes UP-TO-DATE
> Task :sdks:java:testing:test-utils:jar
> Task :sdks:java:testing:test-utils:compileTestJava FROM-CACHE
> Task :sdks:java:testing:test-utils:testClasses UP-TO-DATE
> Task :sdks:java:testing:test-utils:testJar
> Task :sdks:java:core:jar
> Task :runners:core-java:compileJava FROM-CACHE
> Task :runners:core-java:classes UP-TO-DATE
> Task :sdks:java:io:mongodb:compileTestJava FROM-CACHE
> Task :sdks:java:io:mongodb:testClasses UP-TO-DATE
> Task :sdks:java:io:mongodb:testJar
> Task :runners:core-java:jar
> Task :sdks:java:harness:compileJava FROM-CACHE
> Task :sdks:java:harness:classes UP-TO-DATE
> Task :sdks:java:harness:jar
> Task :sdks:java:core:compileTestJava FROM-CACHE
> Task :sdks:java:core:testClasses
> Task :sdks:java:core:shadowTestJar
> Task :sdks:java:extensions:google-cloud-platform-core:compileTestJava FROM-CACHE
> Task :sdks:java:extensions:google-cloud-platform-core:testClasses UP-TO-DATE
> Task :sdks:java:extensions:google-cloud-platform-core:testJar
> Task :sdks:java:harness:shadowJar
> Task :runners:java-fn-execution:compileJava FROM-CACHE
> Task :runners:java-fn-execution:classes UP-TO-DATE
> Task :runners:java-fn-execution:jar
> Task :sdks:java:expansion-service:compileJava FROM-CACHE
> Task :sdks:java:expansion-service:classes UP-TO-DATE
> Task :sdks:java:expansion-service:jar
> Task :runners:direct-java:compileJava FROM-CACHE
> Task :runners:direct-java:classes UP-TO-DATE
> Task :sdks:java:io:kafka:compileJava FROM-CACHE
> Task :sdks:java:io:kafka:classes UP-TO-DATE
> Task :sdks:java:io:kafka:jar
> Task :sdks:java:io:google-cloud-platform:compileJava FROM-CACHE
> Task :sdks:java:io:google-cloud-platform:classes UP-TO-DATE
> Task :sdks:java:io:google-cloud-platform:jar
> Task :runners:direct-java:shadowJar
> Task :sdks:java:io:google-cloud-platform:compileTestJava FROM-CACHE
> Task :sdks:java:io:google-cloud-platform:testClasses
> Task :sdks:java:extensions:sql:compileJava FROM-CACHE
> Task :sdks:java:extensions:sql:classes
> Task :sdks:java:io:google-cloud-platform:testJar
> Task :sdks:java:extensions:sql:compileTestJava FROM-CACHE
> Task :sdks:java:extensions:sql:testClasses
> Task :sdks:java:extensions:sql:integrationTest
org.apache.beam.sdk.extensions.sql.meta.provider.pubsub.PubsubJsonIT > testSQLInsertJsonRowsToPubsubFlat FAILED
io.grpc.StatusRuntimeException
org.apache.beam.sdk.extensions.sql.meta.provider.pubsub.PubsubJsonIT > testSQLSelectsPayloadContentFlat FAILED
io.grpc.StatusRuntimeException
org.apache.beam.sdk.extensions.sql.meta.provider.pubsub.PubsubJsonIT > testSQLSelectsPayloadContent FAILED
io.grpc.StatusRuntimeException
org.apache.beam.sdk.extensions.sql.meta.provider.pubsub.PubsubJsonIT > testSQLReadAndWriteWithSameFlatTableDefinition FAILED
io.grpc.StatusRuntimeException
org.apache.beam.sdk.extensions.sql.meta.provider.pubsub.PubsubJsonIT > testSQLInsertJsonRowsToPubsubWithTimestampAttributeFlat FAILED
io.grpc.StatusRuntimeException
org.apache.beam.sdk.extensions.sql.meta.provider.pubsub.PubsubJsonIT > testWritesJsonRowsToPubsub FAILED
io.grpc.StatusRuntimeException
org.apache.beam.sdk.extensions.sql.PubsubToBigqueryIT > testSimpleInsert FAILED
io.grpc.StatusRuntimeException
org.apache.beam.sdk.extensions.sql.PubsubToBigqueryIT > testSimpleInsertFlat FAILED
io.grpc.StatusRuntimeException
35 tests completed, 8 failed, 4 skipped
> Task :sdks:java:extensions:sql:integrationTest FAILED
> Task :sdks:java:extensions:sql:jar
> Task :sdks:java:extensions:sql:jdbc:compileJava FROM-CACHE
> Task :sdks:java:extensions:sql:jdbc:classes
> Task :sdks:java:extensions:sql:zetasql:compileJava FROM-CACHE
> Task :sdks:java:extensions:sql:datacatalog:compileJava FROM-CACHE
> Task :sdks:java:extensions:sql:zetasql:classes UP-TO-DATE
> Task :sdks:java:extensions:sql:datacatalog:classes UP-TO-DATE
> Task :sdks:java:extensions:sql:zetasql:jar
> Task :sdks:java:extensions:sql:datacatalog:compileTestJava FROM-CACHE
> Task :sdks:java:extensions:sql:datacatalog:testClasses UP-TO-DATE
> Task :sdks:java:extensions:sql:jdbc:compileTestJava FROM-CACHE
> Task :sdks:java:extensions:sql:jdbc:testClasses UP-TO-DATE
> Task :sdks:java:extensions:sql:jdbc:endToEndTest
> Task :sdks:java:extensions:sql:jdbc:postCommit
> Task :sdks:java:extensions:sql:datacatalog:integrationTest
> Task :sdks:java:extensions:sql:datacatalog:postCommit
FAILURE: Build failed with an exception.
* What went wrong:
Execution failed for task ':sdks:java:extensions:sql:integrationTest'.
> There were failing tests. See the report at: file://<https://ci-beam.apache.org/job/beam_PostCommit_SQL/ws/src/sdks/java/extensions/sql/build/reports/tests/integrationTest/index.html>
* Try:
Run with --stacktrace option to get the stack trace. Run with --info or --debug option to get more log output. Run with --scan to get full insights.
* Get more help at https://help.gradle.org
Deprecated Gradle features were used in this build, making it incompatible with Gradle 6.0.
Use '--warning-mode all' to show the individual deprecation warnings.
See https://docs.gradle.org/5.2.1/userguide/command_line_interface.html#sec:command_line_warnings
BUILD FAILED in 3m 22s
101 actionable tasks: 65 executed, 36 from cache
Publishing build scan...
https://gradle.com/s/6fukcpt47hmne
Build step 'Invoke Gradle script' changed build result to FAILURE
Build step 'Invoke Gradle script' marked build as failure
---------------------------------------------------------------------
To unsubscribe, e-mail: builds-unsubscribe@beam.apache.org
For additional commands, e-mail: builds-help@beam.apache.org
Build failed in Jenkins: beam_PostCommit_SQL #5206
Posted by Apache Jenkins Server <je...@builds.apache.org>.
See <https://ci-beam.apache.org/job/beam_PostCommit_SQL/5206/display/redirect>
Changes:
------------------------------------------
[...truncated 4.16 KB...]
> Task :buildSrc:spotlessGroovyGradle
> Task :buildSrc:spotlessGroovyGradleCheck
> Task :buildSrc:spotlessCheck
> Task :buildSrc:pluginUnderTestMetadata
> Task :buildSrc:compileTestJava NO-SOURCE
> Task :buildSrc:compileTestGroovy NO-SOURCE
> Task :buildSrc:processTestResources NO-SOURCE
> Task :buildSrc:testClasses UP-TO-DATE
> Task :buildSrc:test NO-SOURCE
> Task :buildSrc:validateTaskProperties FROM-CACHE
> Task :buildSrc:check
> Task :buildSrc:build
Configuration on demand is an incubating feature.
> Task :sdks:java:core:generateAvroProtocol NO-SOURCE
> Task :sdks:java:fn-execution:processResources NO-SOURCE
> Task :runners:core-java:processResources NO-SOURCE
> Task :vendor:sdks-java-extensions-protobuf:processResources NO-SOURCE
> Task :sdks:java:extensions:google-cloud-platform-core:processResources NO-SOURCE
> Task :runners:java-fn-execution:processResources NO-SOURCE
> Task :sdks:java:harness:processResources NO-SOURCE
> Task :runners:core-construction-java:processResources NO-SOURCE
> Task :sdks:java:core:generateAvroJava NO-SOURCE
> Task :runners:local-java:processResources NO-SOURCE
> Task :runners:direct-java:processResources NO-SOURCE
> Task :sdks:java:io:google-cloud-platform:processResources NO-SOURCE
> Task :sdks:java:io:kafka:processResources NO-SOURCE
> Task :sdks:java:io:mongodb:processResources NO-SOURCE
> Task :sdks:java:io:hadoop-common:processResources NO-SOURCE
> Task :sdks:java:io:mongodb:processTestResources NO-SOURCE
> Task :sdks:java:io:common:compileJava NO-SOURCE
> Task :sdks:java:io:parquet:processResources NO-SOURCE
> Task :model:fn-execution:extractProto
> Task :sdks:java:extensions:protobuf:extractProto
> Task :sdks:java:expansion-service:createCheckerFrameworkManifest
> Task :sdks:java:extensions:join-library:createCheckerFrameworkManifest
> Task :sdks:java:expansion-service:processResources NO-SOURCE
> Task :sdks:java:io:common:processResources NO-SOURCE
> Task :sdks:java:extensions:sql:datacatalog:createCheckerFrameworkManifest
> Task :model:job-management:extractProto
> Task :sdks:java:io:common:classes UP-TO-DATE
> Task :sdks:java:extensions:google-cloud-platform-core:processTestResources NO-SOURCE
> Task :sdks:java:extensions:join-library:processResources NO-SOURCE
> Task :sdks:java:extensions:protobuf:processResources NO-SOURCE
> Task :sdks:java:extensions:sql:zetasql:processResources NO-SOURCE
> Task :sdks:java:testing:test-utils:processResources NO-SOURCE
> Task :model:job-management:processResources
> Task :sdks:java:extensions:sql:datacatalog:processResources NO-SOURCE
> Task :sdks:java:testing:test-utils:processTestResources NO-SOURCE
> Task :sdks:java:extensions:sql:datacatalog:processTestResources NO-SOURCE
> Task :sdks:java:io:common:jar
> Task :sdks:java:core:generateGrammarSource FROM-CACHE
> Task :sdks:java:io:common:processTestResources NO-SOURCE
> Task :model:fn-execution:processResources
> Task :sdks:java:core:processResources
> Task :sdks:java:core:generateTestAvroProtocol NO-SOURCE
> Task :sdks:java:extensions:sql:jdbc:processResources
> Task :sdks:java:extensions:sql:jdbc:processTestResources NO-SOURCE
> Task :sdks:java:io:google-cloud-platform:processTestResources
> Task :sdks:java:core:generateTestAvroJava
> Task :sdks:java:core:generateTestGrammarSource NO-SOURCE
> Task :sdks:java:core:processTestResources
> Task :sdks:java:extensions:sql:copyFmppTemplatesFromCalciteCore
> Task :sdks:java:extensions:sql:copyFmppTemplatesFromSrc
> Task :model:pipeline:extractIncludeProto
> Task :model:pipeline:extractProto
> Task :model:pipeline:generateProto
> Task :model:pipeline:compileJava FROM-CACHE
> Task :model:pipeline:processResources
> Task :model:pipeline:classes
> Task :sdks:java:extensions:sql:generateFmppSources
> Task :model:pipeline:jar
> Task :model:fn-execution:extractIncludeProto
> Task :model:job-management:extractIncludeProto
> Task :model:fn-execution:generateProto
> Task :model:job-management:generateProto
> Task :sdks:java:extensions:sql:compileJavacc
Java Compiler Compiler Version 4.0 (Parser Generator)
(type "javacc" with no arguments for help)
Reading from file <https://ci-beam.apache.org/job/beam_PostCommit_SQL/ws/src/sdks/java/extensions/sql/build/generated/fmpp/javacc/Parser.jj> . . .
Note: UNICODE_INPUT option is specified. Please make sure you create the parser/lexer using a Reader with the correct character encoding.
Warning: Lookahead adequacy checking not being performed since option LOOKAHEAD is more than 1. Set option FORCE_LA_CHECK to true to force checking.
File "TokenMgrError.java" does not exist. Will create one.
File "ParseException.java" does not exist. Will create one.
File "Token.java" does not exist. Will create one.
File "SimpleCharStream.java" does not exist. Will create one.
Parser generated with 0 errors and 1 warnings.
> Task :model:pipeline:shadowJar
> Task :sdks:java:extensions:sql:processResources
> Task :sdks:java:extensions:sql:processTestResources
> Task :model:job-management:compileJava FROM-CACHE
> Task :model:job-management:classes
> Task :model:fn-execution:compileJava FROM-CACHE
> Task :model:fn-execution:classes
> Task :model:job-management:shadowJar
> Task :model:fn-execution:shadowJar
> Task :sdks:java:core:compileJava FROM-CACHE
> Task :sdks:java:core:classes
> Task :sdks:java:core:shadowJar
> Task :sdks:java:extensions:protobuf:extractIncludeProto
> Task :sdks:java:extensions:protobuf:generateProto NO-SOURCE
> Task :sdks:java:core:jar
> Task :runners:local-java:compileJava FROM-CACHE
> Task :runners:local-java:classes UP-TO-DATE
> Task :sdks:java:io:hadoop-common:compileJava FROM-CACHE
> Task :sdks:java:io:hadoop-common:classes UP-TO-DATE
> Task :sdks:java:io:mongodb:compileJava FROM-CACHE
> Task :sdks:java:io:mongodb:classes UP-TO-DATE
> Task :sdks:java:io:common:compileTestJava FROM-CACHE
> Task :sdks:java:io:common:testClasses UP-TO-DATE
> Task :sdks:java:fn-execution:compileJava FROM-CACHE
> Task :sdks:java:fn-execution:classes UP-TO-DATE
> Task :sdks:java:io:hadoop-common:jar
> Task :runners:local-java:jar
> Task :sdks:java:extensions:protobuf:compileJava FROM-CACHE
> Task :sdks:java:extensions:google-cloud-platform-core:compileJava FROM-CACHE
> Task :vendor:sdks-java-extensions-protobuf:compileJava FROM-CACHE
> Task :vendor:sdks-java-extensions-protobuf:classes UP-TO-DATE
> Task :sdks:java:extensions:google-cloud-platform-core:classes UP-TO-DATE
> Task :sdks:java:extensions:protobuf:classes UP-TO-DATE
> Task :sdks:java:io:common:testJar
> Task :sdks:java:io:mongodb:jar
> Task :sdks:java:extensions:join-library:compileJava FROM-CACHE
> Task :runners:core-construction-java:compileJava FROM-CACHE
> Task :sdks:java:extensions:join-library:classes UP-TO-DATE
> Task :runners:core-construction-java:classes UP-TO-DATE
> Task :sdks:java:extensions:join-library:jar
> Task :sdks:java:extensions:google-cloud-platform-core:jar
> Task :sdks:java:fn-execution:jar
> Task :sdks:java:extensions:protobuf:jar
> Task :sdks:java:testing:test-utils:compileJava FROM-CACHE
> Task :sdks:java:testing:test-utils:classes UP-TO-DATE
> Task :sdks:java:io:parquet:compileJava FROM-CACHE
> Task :sdks:java:io:parquet:classes UP-TO-DATE
> Task :sdks:java:io:parquet:jar
> Task :sdks:java:testing:test-utils:jar
> Task :vendor:sdks-java-extensions-protobuf:shadowJar
> Task :sdks:java:testing:test-utils:compileTestJava FROM-CACHE
> Task :sdks:java:testing:test-utils:testClasses UP-TO-DATE
> Task :sdks:java:testing:test-utils:testJar
> Task :runners:core-construction-java:jar
> Task :sdks:java:core:compileTestJava FROM-CACHE
> Task :sdks:java:core:testClasses
> Task :runners:core-java:compileJava FROM-CACHE
> Task :runners:core-java:classes UP-TO-DATE
> Task :sdks:java:io:mongodb:compileTestJava FROM-CACHE
> Task :sdks:java:io:mongodb:testClasses UP-TO-DATE
> Task :sdks:java:io:mongodb:testJar
> Task :runners:core-java:jar
> Task :sdks:java:harness:compileJava FROM-CACHE
> Task :sdks:java:harness:classes UP-TO-DATE
> Task :sdks:java:harness:jar
> Task :sdks:java:core:shadowTestJar
> Task :sdks:java:extensions:google-cloud-platform-core:compileTestJava FROM-CACHE
> Task :sdks:java:extensions:google-cloud-platform-core:testClasses UP-TO-DATE
> Task :sdks:java:extensions:google-cloud-platform-core:testJar
> Task :sdks:java:harness:shadowJar
> Task :runners:java-fn-execution:compileJava FROM-CACHE
> Task :runners:java-fn-execution:classes UP-TO-DATE
> Task :runners:java-fn-execution:jar
> Task :runners:direct-java:compileJava FROM-CACHE
> Task :runners:direct-java:classes UP-TO-DATE
> Task :sdks:java:expansion-service:compileJava FROM-CACHE
> Task :sdks:java:expansion-service:classes UP-TO-DATE
> Task :sdks:java:expansion-service:jar
> Task :runners:direct-java:shadowJar
> Task :sdks:java:io:kafka:compileJava FROM-CACHE
> Task :sdks:java:io:kafka:classes UP-TO-DATE
> Task :sdks:java:io:kafka:jar
> Task :sdks:java:io:google-cloud-platform:compileJava FROM-CACHE
> Task :sdks:java:io:google-cloud-platform:classes UP-TO-DATE
> Task :sdks:java:io:google-cloud-platform:jar
> Task :sdks:java:extensions:sql:compileJava FROM-CACHE
> Task :sdks:java:extensions:sql:classes
> Task :sdks:java:io:google-cloud-platform:compileTestJava FROM-CACHE
> Task :sdks:java:io:google-cloud-platform:testClasses
> Task :sdks:java:io:google-cloud-platform:testJar
> Task :sdks:java:extensions:sql:compileTestJava FROM-CACHE
> Task :sdks:java:extensions:sql:testClasses
> Task :sdks:java:extensions:sql:integrationTest
org.apache.beam.sdk.extensions.sql.meta.provider.pubsub.PubsubJsonIT > testSQLInsertJsonRowsToPubsubFlat FAILED
io.grpc.StatusRuntimeException
org.apache.beam.sdk.extensions.sql.meta.provider.pubsub.PubsubJsonIT > testSQLSelectsPayloadContentFlat FAILED
io.grpc.StatusRuntimeException
org.apache.beam.sdk.extensions.sql.meta.provider.pubsub.PubsubJsonIT > testSQLSelectsPayloadContent FAILED
io.grpc.StatusRuntimeException
org.apache.beam.sdk.extensions.sql.meta.provider.pubsub.PubsubJsonIT > testSQLReadAndWriteWithSameFlatTableDefinition FAILED
io.grpc.StatusRuntimeException
org.apache.beam.sdk.extensions.sql.meta.provider.pubsub.PubsubJsonIT > testSQLInsertJsonRowsToPubsubWithTimestampAttributeFlat FAILED
io.grpc.StatusRuntimeException
org.apache.beam.sdk.extensions.sql.meta.provider.pubsub.PubsubJsonIT > testWritesJsonRowsToPubsub FAILED
io.grpc.StatusRuntimeException
org.apache.beam.sdk.extensions.sql.PubsubToBigqueryIT > testSimpleInsert FAILED
io.grpc.StatusRuntimeException
org.apache.beam.sdk.extensions.sql.PubsubToBigqueryIT > testSimpleInsertFlat FAILED
io.grpc.StatusRuntimeException
35 tests completed, 8 failed, 4 skipped
> Task :sdks:java:extensions:sql:integrationTest FAILED
> Task :sdks:java:extensions:sql:jar
> Task :sdks:java:extensions:sql:jdbc:compileJava FROM-CACHE
> Task :sdks:java:extensions:sql:jdbc:classes
> Task :sdks:java:extensions:sql:zetasql:compileJava FROM-CACHE
> Task :sdks:java:extensions:sql:zetasql:classes UP-TO-DATE
> Task :sdks:java:extensions:sql:zetasql:jar
> Task :sdks:java:extensions:sql:datacatalog:compileJava FROM-CACHE
> Task :sdks:java:extensions:sql:datacatalog:classes UP-TO-DATE
> Task :sdks:java:extensions:sql:datacatalog:compileTestJava FROM-CACHE
> Task :sdks:java:extensions:sql:datacatalog:testClasses UP-TO-DATE
> Task :sdks:java:extensions:sql:jdbc:compileTestJava FROM-CACHE
> Task :sdks:java:extensions:sql:jdbc:testClasses UP-TO-DATE
> Task :sdks:java:extensions:sql:jdbc:endToEndTest
> Task :sdks:java:extensions:sql:jdbc:postCommit
> Task :sdks:java:extensions:sql:datacatalog:integrationTest
> Task :sdks:java:extensions:sql:datacatalog:postCommit
FAILURE: Build failed with an exception.
* What went wrong:
Execution failed for task ':sdks:java:extensions:sql:integrationTest'.
> There were failing tests. See the report at: file://<https://ci-beam.apache.org/job/beam_PostCommit_SQL/ws/src/sdks/java/extensions/sql/build/reports/tests/integrationTest/index.html>
* Try:
Run with --stacktrace option to get the stack trace. Run with --info or --debug option to get more log output. Run with --scan to get full insights.
* Get more help at https://help.gradle.org
Deprecated Gradle features were used in this build, making it incompatible with Gradle 6.0.
Use '--warning-mode all' to show the individual deprecation warnings.
See https://docs.gradle.org/5.2.1/userguide/command_line_interface.html#sec:command_line_warnings
BUILD FAILED in 3m 35s
101 actionable tasks: 65 executed, 36 from cache
Publishing build scan...
https://gradle.com/s/5xbrspaobg7ps
Build step 'Invoke Gradle script' changed build result to FAILURE
Build step 'Invoke Gradle script' marked build as failure
---------------------------------------------------------------------
To unsubscribe, e-mail: builds-unsubscribe@beam.apache.org
For additional commands, e-mail: builds-help@beam.apache.org
Build failed in Jenkins: beam_PostCommit_SQL #5205
Posted by Apache Jenkins Server <je...@builds.apache.org>.
See <https://ci-beam.apache.org/job/beam_PostCommit_SQL/5205/display/redirect>
Changes:
------------------------------------------
[...truncated 4.16 KB...]
> Task :buildSrc:spotlessGroovyGradle
> Task :buildSrc:spotlessGroovyGradleCheck
> Task :buildSrc:spotlessCheck
> Task :buildSrc:pluginUnderTestMetadata
> Task :buildSrc:compileTestJava NO-SOURCE
> Task :buildSrc:compileTestGroovy NO-SOURCE
> Task :buildSrc:processTestResources NO-SOURCE
> Task :buildSrc:testClasses UP-TO-DATE
> Task :buildSrc:test NO-SOURCE
> Task :buildSrc:validateTaskProperties FROM-CACHE
> Task :buildSrc:check
> Task :buildSrc:build
Configuration on demand is an incubating feature.
> Task :vendor:sdks-java-extensions-protobuf:processResources NO-SOURCE
> Task :runners:core-java:processResources NO-SOURCE
> Task :sdks:java:fn-execution:processResources NO-SOURCE
> Task :runners:local-java:processResources NO-SOURCE
> Task :sdks:java:extensions:google-cloud-platform-core:processResources NO-SOURCE
> Task :sdks:java:core:generateAvroProtocol NO-SOURCE
> Task :runners:java-fn-execution:processResources NO-SOURCE
> Task :sdks:java:harness:processResources NO-SOURCE
> Task :runners:core-construction-java:processResources NO-SOURCE
> Task :runners:direct-java:processResources NO-SOURCE
> Task :sdks:java:core:generateAvroJava NO-SOURCE
> Task :sdks:java:io:google-cloud-platform:processResources NO-SOURCE
> Task :sdks:java:io:hadoop-common:processResources NO-SOURCE
> Task :sdks:java:io:kafka:processResources NO-SOURCE
> Task :sdks:java:io:parquet:processResources NO-SOURCE
> Task :sdks:java:testing:test-utils:processResources NO-SOURCE
> Task :model:job-management:extractProto
> Task :model:fn-execution:extractProto
> Task :sdks:java:extensions:protobuf:extractProto
> Task :sdks:java:io:mongodb:processResources NO-SOURCE
> Task :sdks:java:testing:test-utils:processTestResources NO-SOURCE
> Task :sdks:java:extensions:protobuf:processResources NO-SOURCE
> Task :sdks:java:expansion-service:createCheckerFrameworkManifest
> Task :sdks:java:extensions:sql:datacatalog:createCheckerFrameworkManifest
> Task :sdks:java:extensions:join-library:createCheckerFrameworkManifest
> Task :sdks:java:io:common:compileJava NO-SOURCE
> Task :sdks:java:expansion-service:processResources NO-SOURCE
> Task :sdks:java:extensions:sql:zetasql:processResources NO-SOURCE
> Task :sdks:java:io:mongodb:processTestResources NO-SOURCE
> Task :sdks:java:extensions:sql:datacatalog:processResources NO-SOURCE
> Task :sdks:java:extensions:join-library:processResources NO-SOURCE
> Task :sdks:java:extensions:google-cloud-platform-core:processTestResources NO-SOURCE
> Task :sdks:java:extensions:sql:datacatalog:processTestResources NO-SOURCE
> Task :sdks:java:io:common:processResources NO-SOURCE
> Task :sdks:java:io:common:classes UP-TO-DATE
> Task :model:job-management:processResources
> Task :model:fn-execution:processResources
> Task :sdks:java:core:generateGrammarSource FROM-CACHE
> Task :sdks:java:io:common:jar
> Task :sdks:java:io:common:processTestResources NO-SOURCE
> Task :sdks:java:core:processResources
> Task :sdks:java:core:generateTestAvroProtocol NO-SOURCE
> Task :sdks:java:extensions:sql:jdbc:processResources
> Task :sdks:java:extensions:sql:jdbc:processTestResources NO-SOURCE
> Task :sdks:java:io:google-cloud-platform:processTestResources
> Task :sdks:java:core:generateTestAvroJava
> Task :sdks:java:core:generateTestGrammarSource NO-SOURCE
> Task :sdks:java:core:processTestResources
> Task :sdks:java:extensions:sql:copyFmppTemplatesFromCalciteCore
> Task :sdks:java:extensions:sql:copyFmppTemplatesFromSrc
> Task :model:pipeline:extractIncludeProto
> Task :model:pipeline:extractProto
> Task :model:pipeline:generateProto
> Task :sdks:java:extensions:sql:generateFmppSources
> Task :model:pipeline:compileJava FROM-CACHE
> Task :model:pipeline:processResources
> Task :model:pipeline:classes
> Task :model:pipeline:jar
> Task :sdks:java:extensions:sql:compileJavacc
Java Compiler Compiler Version 4.0 (Parser Generator)
(type "javacc" with no arguments for help)
Reading from file <https://ci-beam.apache.org/job/beam_PostCommit_SQL/ws/src/sdks/java/extensions/sql/build/generated/fmpp/javacc/Parser.jj> . . .
Warning: Lookahead adequacy checking not being performed since option LOOKAHEAD is more than 1. Set option FORCE_LA_CHECK to true to force checking.
Note: UNICODE_INPUT option is specified. Please make sure you create the parser/lexer using a Reader with the correct character encoding.
File "TokenMgrError.java" does not exist. Will create one.
File "ParseException.java" does not exist. Will create one.
File "Token.java" does not exist. Will create one.
File "SimpleCharStream.java" does not exist. Will create one.
Parser generated with 0 errors and 1 warnings.
> Task :sdks:java:extensions:sql:processResources
> Task :sdks:java:extensions:sql:processTestResources
> Task :model:job-management:extractIncludeProto
> Task :model:fn-execution:extractIncludeProto
> Task :model:job-management:generateProto
> Task :model:fn-execution:generateProto
> Task :model:job-management:compileJava FROM-CACHE
> Task :model:job-management:classes
> Task :model:fn-execution:compileJava FROM-CACHE
> Task :model:fn-execution:classes
> Task :model:pipeline:shadowJar
> Task :model:job-management:shadowJar
> Task :model:fn-execution:shadowJar
> Task :sdks:java:core:compileJava FROM-CACHE
> Task :sdks:java:core:classes
> Task :sdks:java:core:shadowJar
> Task :sdks:java:io:hadoop-common:compileJava FROM-CACHE
> Task :sdks:java:io:hadoop-common:classes UP-TO-DATE
> Task :runners:local-java:compileJava FROM-CACHE
> Task :runners:local-java:classes UP-TO-DATE
> Task :sdks:java:io:hadoop-common:jar
> Task :runners:core-construction-java:compileJava FROM-CACHE
> Task :runners:core-construction-java:classes UP-TO-DATE
> Task :runners:local-java:jar
> Task :sdks:java:io:mongodb:compileJava FROM-CACHE
> Task :sdks:java:io:mongodb:classes UP-TO-DATE
> Task :vendor:sdks-java-extensions-protobuf:compileJava FROM-CACHE
> Task :vendor:sdks-java-extensions-protobuf:classes UP-TO-DATE
> Task :sdks:java:io:common:compileTestJava FROM-CACHE
> Task :sdks:java:io:common:testClasses UP-TO-DATE
> Task :sdks:java:extensions:join-library:compileJava FROM-CACHE
> Task :sdks:java:extensions:join-library:classes UP-TO-DATE
> Task :sdks:java:extensions:join-library:jar
> Task :sdks:java:io:mongodb:jar
> Task :sdks:java:io:common:testJar
> Task :sdks:java:extensions:protobuf:extractIncludeProto
> Task :sdks:java:extensions:protobuf:generateProto NO-SOURCE
> Task :sdks:java:fn-execution:compileJava FROM-CACHE
> Task :sdks:java:fn-execution:classes UP-TO-DATE
> Task :sdks:java:io:parquet:compileJava FROM-CACHE
> Task :sdks:java:io:parquet:classes UP-TO-DATE
> Task :sdks:java:extensions:protobuf:compileJava FROM-CACHE
> Task :sdks:java:extensions:protobuf:classes UP-TO-DATE
> Task :sdks:java:io:parquet:jar
> Task :sdks:java:fn-execution:jar
> Task :sdks:java:extensions:protobuf:jar
> Task :vendor:sdks-java-extensions-protobuf:shadowJar
> Task :sdks:java:extensions:google-cloud-platform-core:compileJava FROM-CACHE
> Task :sdks:java:extensions:google-cloud-platform-core:classes UP-TO-DATE
> Task :runners:core-construction-java:jar
> Task :sdks:java:extensions:google-cloud-platform-core:jar
> Task :sdks:java:testing:test-utils:compileJava FROM-CACHE
> Task :sdks:java:testing:test-utils:classes UP-TO-DATE
> Task :sdks:java:testing:test-utils:jar
> Task :runners:core-java:compileJava FROM-CACHE
> Task :runners:core-java:classes UP-TO-DATE
> Task :sdks:java:testing:test-utils:compileTestJava FROM-CACHE
> Task :sdks:java:testing:test-utils:testClasses UP-TO-DATE
> Task :sdks:java:testing:test-utils:testJar
> Task :sdks:java:core:jar
> Task :sdks:java:io:mongodb:compileTestJava FROM-CACHE
> Task :sdks:java:io:mongodb:testClasses UP-TO-DATE
> Task :sdks:java:io:mongodb:testJar
> Task :runners:core-java:jar
> Task :sdks:java:harness:compileJava FROM-CACHE
> Task :sdks:java:harness:classes UP-TO-DATE
> Task :sdks:java:harness:jar
> Task :sdks:java:core:compileTestJava FROM-CACHE
> Task :sdks:java:core:testClasses
> Task :sdks:java:core:shadowTestJar
> Task :sdks:java:extensions:google-cloud-platform-core:compileTestJava FROM-CACHE
> Task :sdks:java:extensions:google-cloud-platform-core:testClasses UP-TO-DATE
> Task :sdks:java:extensions:google-cloud-platform-core:testJar
> Task :sdks:java:harness:shadowJar
> Task :runners:java-fn-execution:compileJava FROM-CACHE
> Task :runners:java-fn-execution:classes UP-TO-DATE
> Task :runners:java-fn-execution:jar
> Task :sdks:java:expansion-service:compileJava FROM-CACHE
> Task :sdks:java:expansion-service:classes UP-TO-DATE
> Task :sdks:java:expansion-service:jar
> Task :runners:direct-java:compileJava FROM-CACHE
> Task :runners:direct-java:classes UP-TO-DATE
> Task :sdks:java:io:kafka:compileJava FROM-CACHE
> Task :sdks:java:io:kafka:classes UP-TO-DATE
> Task :sdks:java:io:kafka:jar
> Task :sdks:java:io:google-cloud-platform:compileJava FROM-CACHE
> Task :sdks:java:io:google-cloud-platform:classes UP-TO-DATE
> Task :sdks:java:io:google-cloud-platform:jar
> Task :runners:direct-java:shadowJar
> Task :sdks:java:io:google-cloud-platform:compileTestJava FROM-CACHE
> Task :sdks:java:io:google-cloud-platform:testClasses
> Task :sdks:java:io:google-cloud-platform:testJar
> Task :sdks:java:extensions:sql:compileJava FROM-CACHE
> Task :sdks:java:extensions:sql:classes
> Task :sdks:java:extensions:sql:compileTestJava FROM-CACHE
> Task :sdks:java:extensions:sql:testClasses
> Task :sdks:java:extensions:sql:integrationTest
org.apache.beam.sdk.extensions.sql.meta.provider.pubsub.PubsubJsonIT > testSQLInsertJsonRowsToPubsubFlat FAILED
io.grpc.StatusRuntimeException
org.apache.beam.sdk.extensions.sql.meta.provider.pubsub.PubsubJsonIT > testSQLSelectsPayloadContentFlat FAILED
io.grpc.StatusRuntimeException
org.apache.beam.sdk.extensions.sql.meta.provider.pubsub.PubsubJsonIT > testSQLSelectsPayloadContent FAILED
io.grpc.StatusRuntimeException
org.apache.beam.sdk.extensions.sql.meta.provider.pubsub.PubsubJsonIT > testSQLReadAndWriteWithSameFlatTableDefinition FAILED
io.grpc.StatusRuntimeException
org.apache.beam.sdk.extensions.sql.meta.provider.pubsub.PubsubJsonIT > testSQLInsertJsonRowsToPubsubWithTimestampAttributeFlat FAILED
io.grpc.StatusRuntimeException
org.apache.beam.sdk.extensions.sql.meta.provider.pubsub.PubsubJsonIT > testWritesJsonRowsToPubsub FAILED
io.grpc.StatusRuntimeException
org.apache.beam.sdk.extensions.sql.PubsubToBigqueryIT > testSimpleInsert FAILED
io.grpc.StatusRuntimeException
org.apache.beam.sdk.extensions.sql.PubsubToBigqueryIT > testSimpleInsertFlat FAILED
io.grpc.StatusRuntimeException
35 tests completed, 8 failed, 4 skipped
> Task :sdks:java:extensions:sql:integrationTest FAILED
> Task :sdks:java:extensions:sql:jar
> Task :sdks:java:extensions:sql:zetasql:compileJava FROM-CACHE
> Task :sdks:java:extensions:sql:zetasql:classes UP-TO-DATE
> Task :sdks:java:extensions:sql:jdbc:compileJava FROM-CACHE
> Task :sdks:java:extensions:sql:jdbc:classes
> Task :sdks:java:extensions:sql:zetasql:jar
> Task :sdks:java:extensions:sql:datacatalog:compileJava FROM-CACHE
> Task :sdks:java:extensions:sql:datacatalog:classes UP-TO-DATE
> Task :sdks:java:extensions:sql:jdbc:compileTestJava FROM-CACHE
> Task :sdks:java:extensions:sql:jdbc:testClasses UP-TO-DATE
> Task :sdks:java:extensions:sql:datacatalog:compileTestJava FROM-CACHE
> Task :sdks:java:extensions:sql:datacatalog:testClasses UP-TO-DATE
> Task :sdks:java:extensions:sql:jdbc:endToEndTest
> Task :sdks:java:extensions:sql:jdbc:postCommit
> Task :sdks:java:extensions:sql:datacatalog:integrationTest
> Task :sdks:java:extensions:sql:datacatalog:postCommit
FAILURE: Build failed with an exception.
* What went wrong:
Execution failed for task ':sdks:java:extensions:sql:integrationTest'.
> There were failing tests. See the report at: file://<https://ci-beam.apache.org/job/beam_PostCommit_SQL/ws/src/sdks/java/extensions/sql/build/reports/tests/integrationTest/index.html>
* Try:
Run with --stacktrace option to get the stack trace. Run with --info or --debug option to get more log output. Run with --scan to get full insights.
* Get more help at https://help.gradle.org
Deprecated Gradle features were used in this build, making it incompatible with Gradle 6.0.
Use '--warning-mode all' to show the individual deprecation warnings.
See https://docs.gradle.org/5.2.1/userguide/command_line_interface.html#sec:command_line_warnings
BUILD FAILED in 3m 48s
101 actionable tasks: 65 executed, 36 from cache
Publishing build scan...
https://gradle.com/s/mrcxbcjb26juu
Build step 'Invoke Gradle script' changed build result to FAILURE
Build step 'Invoke Gradle script' marked build as failure
---------------------------------------------------------------------
To unsubscribe, e-mail: builds-unsubscribe@beam.apache.org
For additional commands, e-mail: builds-help@beam.apache.org
Build failed in Jenkins: beam_PostCommit_SQL #5204
Posted by Apache Jenkins Server <je...@builds.apache.org>.
See <https://ci-beam.apache.org/job/beam_PostCommit_SQL/5204/display/redirect>
Changes:
------------------------------------------
[...truncated 4.16 KB...]
> Task :buildSrc:spotlessGroovyGradle
> Task :buildSrc:spotlessGroovyGradleCheck
> Task :buildSrc:spotlessCheck
> Task :buildSrc:pluginUnderTestMetadata
> Task :buildSrc:compileTestJava NO-SOURCE
> Task :buildSrc:compileTestGroovy NO-SOURCE
> Task :buildSrc:processTestResources NO-SOURCE
> Task :buildSrc:testClasses UP-TO-DATE
> Task :buildSrc:test NO-SOURCE
> Task :buildSrc:validateTaskProperties FROM-CACHE
> Task :buildSrc:check
> Task :buildSrc:build
Configuration on demand is an incubating feature.
> Task :runners:local-java:processResources NO-SOURCE
> Task :runners:core-java:processResources NO-SOURCE
> Task :sdks:java:harness:processResources NO-SOURCE
> Task :sdks:java:fn-execution:processResources NO-SOURCE
> Task :runners:java-fn-execution:processResources NO-SOURCE
> Task :runners:core-construction-java:processResources NO-SOURCE
> Task :vendor:sdks-java-extensions-protobuf:processResources NO-SOURCE
> Task :sdks:java:core:generateAvroProtocol NO-SOURCE
> Task :sdks:java:extensions:google-cloud-platform-core:processResources NO-SOURCE
> Task :runners:direct-java:processResources NO-SOURCE
> Task :sdks:java:core:generateAvroJava NO-SOURCE
> Task :sdks:java:io:kafka:processResources NO-SOURCE
> Task :sdks:java:io:hadoop-common:processResources NO-SOURCE
> Task :sdks:java:io:mongodb:processResources NO-SOURCE
> Task :sdks:java:io:google-cloud-platform:processResources NO-SOURCE
> Task :sdks:java:expansion-service:createCheckerFrameworkManifest
> Task :model:fn-execution:extractProto
> Task :sdks:java:extensions:join-library:createCheckerFrameworkManifest
> Task :sdks:java:extensions:protobuf:extractProto
> Task :model:job-management:extractProto
> Task :sdks:java:io:mongodb:processTestResources NO-SOURCE
> Task :sdks:java:extensions:join-library:processResources NO-SOURCE
> Task :sdks:java:io:common:compileJava NO-SOURCE
> Task :sdks:java:extensions:protobuf:processResources NO-SOURCE
> Task :sdks:java:expansion-service:processResources NO-SOURCE
> Task :sdks:java:io:parquet:processResources NO-SOURCE
> Task :sdks:java:testing:test-utils:processResources NO-SOURCE
> Task :sdks:java:testing:test-utils:processTestResources NO-SOURCE
> Task :sdks:java:extensions:sql:zetasql:processResources NO-SOURCE
> Task :model:job-management:processResources
> Task :sdks:java:extensions:google-cloud-platform-core:processTestResources NO-SOURCE
> Task :model:fn-execution:processResources
> Task :sdks:java:extensions:sql:datacatalog:createCheckerFrameworkManifest
> Task :sdks:java:extensions:sql:datacatalog:processResources NO-SOURCE
> Task :sdks:java:extensions:sql:datacatalog:processTestResources NO-SOURCE
> Task :sdks:java:io:common:processResources NO-SOURCE
> Task :sdks:java:io:common:classes UP-TO-DATE
> Task :sdks:java:io:common:jar
> Task :sdks:java:io:common:processTestResources NO-SOURCE
> Task :sdks:java:core:generateGrammarSource FROM-CACHE
> Task :sdks:java:core:processResources
> Task :sdks:java:core:generateTestAvroProtocol NO-SOURCE
> Task :sdks:java:extensions:sql:jdbc:processResources
> Task :sdks:java:extensions:sql:jdbc:processTestResources NO-SOURCE
> Task :sdks:java:io:google-cloud-platform:processTestResources
> Task :sdks:java:core:generateTestAvroJava
> Task :sdks:java:core:generateTestGrammarSource NO-SOURCE
> Task :sdks:java:core:processTestResources
> Task :sdks:java:extensions:sql:copyFmppTemplatesFromCalciteCore
> Task :sdks:java:extensions:sql:copyFmppTemplatesFromSrc
> Task :model:pipeline:extractIncludeProto
> Task :model:pipeline:extractProto
> Task :model:pipeline:generateProto
> Task :sdks:java:extensions:sql:generateFmppSources
> Task :model:pipeline:compileJava FROM-CACHE
> Task :model:pipeline:processResources
> Task :model:pipeline:classes
> Task :model:pipeline:jar
> Task :sdks:java:extensions:sql:compileJavacc
Java Compiler Compiler Version 4.0 (Parser Generator)
(type "javacc" with no arguments for help)
Reading from file <https://ci-beam.apache.org/job/beam_PostCommit_SQL/ws/src/sdks/java/extensions/sql/build/generated/fmpp/javacc/Parser.jj> . . .
Note: UNICODE_INPUT option is specified. Please make sure you create the parser/lexer using a Reader with the correct character encoding.
Warning: Lookahead adequacy checking not being performed since option LOOKAHEAD is more than 1. Set option FORCE_LA_CHECK to true to force checking.
File "TokenMgrError.java" does not exist. Will create one.
File "ParseException.java" does not exist. Will create one.
File "Token.java" does not exist. Will create one.
File "SimpleCharStream.java" does not exist. Will create one.
Parser generated with 0 errors and 1 warnings.
> Task :model:fn-execution:extractIncludeProto
> Task :sdks:java:extensions:sql:processResources
> Task :sdks:java:extensions:sql:processTestResources
> Task :model:fn-execution:generateProto
> Task :model:job-management:extractIncludeProto
> Task :model:job-management:generateProto
> Task :model:fn-execution:compileJava FROM-CACHE
> Task :model:fn-execution:classes
> Task :model:job-management:compileJava FROM-CACHE
> Task :model:job-management:classes
> Task :model:pipeline:shadowJar
> Task :model:job-management:shadowJar
> Task :model:fn-execution:shadowJar
> Task :sdks:java:core:compileJava FROM-CACHE
> Task :sdks:java:core:classes
> Task :sdks:java:core:shadowJar
> Task :vendor:sdks-java-extensions-protobuf:compileJava FROM-CACHE
> Task :vendor:sdks-java-extensions-protobuf:classes UP-TO-DATE
> Task :sdks:java:io:hadoop-common:compileJava FROM-CACHE
> Task :sdks:java:io:hadoop-common:classes UP-TO-DATE
> Task :sdks:java:io:hadoop-common:jar
> Task :vendor:sdks-java-extensions-protobuf:shadowJar
> Task :runners:local-java:compileJava FROM-CACHE
> Task :runners:local-java:classes UP-TO-DATE
> Task :sdks:java:extensions:join-library:compileJava FROM-CACHE
> Task :sdks:java:extensions:join-library:classes UP-TO-DATE
> Task :runners:local-java:jar
> Task :sdks:java:extensions:join-library:jar
> Task :sdks:java:io:common:compileTestJava FROM-CACHE
> Task :sdks:java:io:common:testClasses UP-TO-DATE
> Task :sdks:java:core:jar
> Task :sdks:java:extensions:google-cloud-platform-core:compileJava FROM-CACHE
> Task :sdks:java:extensions:google-cloud-platform-core:classes UP-TO-DATE
> Task :sdks:java:extensions:protobuf:extractIncludeProto
> Task :sdks:java:io:mongodb:compileJava FROM-CACHE
> Task :sdks:java:io:mongodb:classes UP-TO-DATE
> Task :sdks:java:extensions:protobuf:generateProto NO-SOURCE
> Task :sdks:java:extensions:protobuf:compileJava FROM-CACHE
> Task :sdks:java:extensions:protobuf:classes UP-TO-DATE
> Task :sdks:java:fn-execution:compileJava FROM-CACHE
> Task :sdks:java:io:parquet:compileJava FROM-CACHE
> Task :sdks:java:fn-execution:classes UP-TO-DATE
> Task :sdks:java:io:parquet:classes UP-TO-DATE
> Task :runners:core-construction-java:compileJava FROM-CACHE
> Task :runners:core-construction-java:classes UP-TO-DATE
> Task :sdks:java:io:parquet:jar
> Task :sdks:java:io:common:testJar
> Task :sdks:java:io:mongodb:jar
> Task :sdks:java:extensions:google-cloud-platform-core:jar
> Task :sdks:java:extensions:protobuf:jar
> Task :sdks:java:fn-execution:jar
> Task :sdks:java:testing:test-utils:compileJava FROM-CACHE
> Task :sdks:java:testing:test-utils:classes UP-TO-DATE
> Task :sdks:java:testing:test-utils:jar
> Task :runners:core-construction-java:jar
> Task :sdks:java:testing:test-utils:compileTestJava FROM-CACHE
> Task :sdks:java:testing:test-utils:testClasses UP-TO-DATE
> Task :sdks:java:testing:test-utils:testJar
> Task :sdks:java:io:mongodb:compileTestJava FROM-CACHE
> Task :sdks:java:io:mongodb:testClasses UP-TO-DATE
> Task :sdks:java:io:mongodb:testJar
> Task :runners:core-java:compileJava FROM-CACHE
> Task :runners:core-java:classes UP-TO-DATE
> Task :runners:core-java:jar
> Task :sdks:java:harness:compileJava FROM-CACHE
> Task :sdks:java:harness:classes UP-TO-DATE
> Task :sdks:java:harness:jar
> Task :sdks:java:core:compileTestJava FROM-CACHE
> Task :sdks:java:core:testClasses
> Task :sdks:java:core:shadowTestJar
> Task :sdks:java:extensions:google-cloud-platform-core:compileTestJava FROM-CACHE
> Task :sdks:java:extensions:google-cloud-platform-core:testClasses UP-TO-DATE
> Task :sdks:java:extensions:google-cloud-platform-core:testJar
> Task :sdks:java:harness:shadowJar
> Task :runners:java-fn-execution:compileJava FROM-CACHE
> Task :runners:java-fn-execution:classes UP-TO-DATE
> Task :runners:java-fn-execution:jar
> Task :sdks:java:expansion-service:compileJava FROM-CACHE
> Task :sdks:java:expansion-service:classes UP-TO-DATE
> Task :runners:direct-java:compileJava FROM-CACHE
> Task :runners:direct-java:classes UP-TO-DATE
> Task :sdks:java:expansion-service:jar
> Task :sdks:java:io:kafka:compileJava FROM-CACHE
> Task :sdks:java:io:kafka:classes UP-TO-DATE
> Task :sdks:java:io:kafka:jar
> Task :sdks:java:io:google-cloud-platform:compileJava FROM-CACHE
> Task :sdks:java:io:google-cloud-platform:classes UP-TO-DATE
> Task :runners:direct-java:shadowJar
> Task :sdks:java:io:google-cloud-platform:jar
> Task :sdks:java:io:google-cloud-platform:compileTestJava FROM-CACHE
> Task :sdks:java:io:google-cloud-platform:testClasses
> Task :sdks:java:io:google-cloud-platform:testJar
> Task :sdks:java:extensions:sql:compileJava FROM-CACHE
> Task :sdks:java:extensions:sql:classes
> Task :sdks:java:extensions:sql:compileTestJava FROM-CACHE
> Task :sdks:java:extensions:sql:testClasses
> Task :sdks:java:extensions:sql:integrationTest
org.apache.beam.sdk.extensions.sql.meta.provider.pubsub.PubsubJsonIT > testSQLInsertJsonRowsToPubsubFlat FAILED
io.grpc.StatusRuntimeException
org.apache.beam.sdk.extensions.sql.meta.provider.pubsub.PubsubJsonIT > testSQLSelectsPayloadContentFlat FAILED
io.grpc.StatusRuntimeException
org.apache.beam.sdk.extensions.sql.meta.provider.pubsub.PubsubJsonIT > testSQLSelectsPayloadContent FAILED
io.grpc.StatusRuntimeException
org.apache.beam.sdk.extensions.sql.meta.provider.pubsub.PubsubJsonIT > testSQLReadAndWriteWithSameFlatTableDefinition FAILED
io.grpc.StatusRuntimeException
org.apache.beam.sdk.extensions.sql.meta.provider.pubsub.PubsubJsonIT > testSQLInsertJsonRowsToPubsubWithTimestampAttributeFlat FAILED
io.grpc.StatusRuntimeException
org.apache.beam.sdk.extensions.sql.meta.provider.pubsub.PubsubJsonIT > testWritesJsonRowsToPubsub FAILED
io.grpc.StatusRuntimeException
org.apache.beam.sdk.extensions.sql.PubsubToBigqueryIT > testSimpleInsert FAILED
io.grpc.StatusRuntimeException
org.apache.beam.sdk.extensions.sql.PubsubToBigqueryIT > testSimpleInsertFlat FAILED
io.grpc.StatusRuntimeException
35 tests completed, 8 failed, 4 skipped
> Task :sdks:java:extensions:sql:integrationTest FAILED
> Task :sdks:java:extensions:sql:jar
> Task :sdks:java:extensions:sql:jdbc:compileJava FROM-CACHE
> Task :sdks:java:extensions:sql:jdbc:classes
> Task :sdks:java:extensions:sql:datacatalog:compileJava FROM-CACHE
> Task :sdks:java:extensions:sql:datacatalog:classes UP-TO-DATE
> Task :sdks:java:extensions:sql:zetasql:compileJava FROM-CACHE
> Task :sdks:java:extensions:sql:zetasql:classes UP-TO-DATE
> Task :sdks:java:extensions:sql:zetasql:jar
> Task :sdks:java:extensions:sql:datacatalog:compileTestJava FROM-CACHE
> Task :sdks:java:extensions:sql:datacatalog:testClasses UP-TO-DATE
> Task :sdks:java:extensions:sql:jdbc:compileTestJava FROM-CACHE
> Task :sdks:java:extensions:sql:jdbc:testClasses UP-TO-DATE
> Task :sdks:java:extensions:sql:jdbc:endToEndTest
> Task :sdks:java:extensions:sql:jdbc:postCommit
> Task :sdks:java:extensions:sql:datacatalog:integrationTest
> Task :sdks:java:extensions:sql:datacatalog:postCommit
FAILURE: Build failed with an exception.
* What went wrong:
Execution failed for task ':sdks:java:extensions:sql:integrationTest'.
> There were failing tests. See the report at: file://<https://ci-beam.apache.org/job/beam_PostCommit_SQL/ws/src/sdks/java/extensions/sql/build/reports/tests/integrationTest/index.html>
* Try:
Run with --stacktrace option to get the stack trace. Run with --info or --debug option to get more log output. Run with --scan to get full insights.
* Get more help at https://help.gradle.org
Deprecated Gradle features were used in this build, making it incompatible with Gradle 6.0.
Use '--warning-mode all' to show the individual deprecation warnings.
See https://docs.gradle.org/5.2.1/userguide/command_line_interface.html#sec:command_line_warnings
BUILD FAILED in 3m 43s
101 actionable tasks: 65 executed, 36 from cache
Publishing build scan...
https://gradle.com/s/ji6gyvatzoo62
Build step 'Invoke Gradle script' changed build result to FAILURE
Build step 'Invoke Gradle script' marked build as failure
---------------------------------------------------------------------
To unsubscribe, e-mail: builds-unsubscribe@beam.apache.org
For additional commands, e-mail: builds-help@beam.apache.org
Build failed in Jenkins: beam_PostCommit_SQL #5203
Posted by Apache Jenkins Server <je...@builds.apache.org>.
See <https://ci-beam.apache.org/job/beam_PostCommit_SQL/5203/display/redirect>
Changes:
------------------------------------------
[...truncated 7.64 KB...]
> Task :sdks:java:core:generateAvroProtocol NO-SOURCE
> Task :vendor:sdks-java-extensions-protobuf:processResources NO-SOURCE
> Task :sdks:java:extensions:google-cloud-platform-core:processResources NO-SOURCE
> Task :sdks:java:harness:processResources NO-SOURCE
> Task :runners:local-java:processResources NO-SOURCE
> Task :sdks:java:fn-execution:processResources NO-SOURCE
> Task :sdks:java:core:generateAvroJava NO-SOURCE
> Task :runners:direct-java:processResources NO-SOURCE
> Task :model:job-management:extractProto
> Task :model:fn-execution:extractProto
> Task :sdks:java:expansion-service:createCheckerFrameworkManifest
> Task :sdks:java:expansion-service:processResources NO-SOURCE
> Task :sdks:java:extensions:join-library:createCheckerFrameworkManifest
> Task :sdks:java:io:parquet:processResources NO-SOURCE
> Task :sdks:java:io:hadoop-common:processResources NO-SOURCE
> Task :sdks:java:io:kafka:processResources NO-SOURCE
> Task :sdks:java:extensions:protobuf:extractProto
> Task :sdks:java:extensions:join-library:processResources NO-SOURCE
> Task :sdks:java:io:google-cloud-platform:processResources NO-SOURCE
> Task :sdks:java:io:common:compileJava NO-SOURCE
> Task :sdks:java:io:common:processResources NO-SOURCE
> Task :sdks:java:extensions:protobuf:processResources NO-SOURCE
> Task :sdks:java:io:common:classes UP-TO-DATE
> Task :sdks:java:io:mongodb:processResources NO-SOURCE
> Task :sdks:java:testing:test-utils:processResources NO-SOURCE
> Task :model:job-management:processResources
> Task :sdks:java:extensions:google-cloud-platform-core:processTestResources NO-SOURCE
> Task :sdks:java:extensions:sql:zetasql:processResources NO-SOURCE
> Task :sdks:java:extensions:sql:datacatalog:createCheckerFrameworkManifest
> Task :sdks:java:testing:test-utils:processTestResources NO-SOURCE
> Task :sdks:java:extensions:sql:datacatalog:processResources NO-SOURCE
> Task :sdks:java:io:mongodb:processTestResources NO-SOURCE
> Task :sdks:java:extensions:sql:datacatalog:processTestResources NO-SOURCE
> Task :model:fn-execution:processResources
> Task :sdks:java:core:generateGrammarSource FROM-CACHE
> Task :sdks:java:io:common:jar
> Task :sdks:java:io:common:processTestResources NO-SOURCE
> Task :sdks:java:core:processResources
> Task :sdks:java:core:generateTestAvroProtocol NO-SOURCE
> Task :sdks:java:extensions:sql:jdbc:processResources
> Task :sdks:java:extensions:sql:jdbc:processTestResources NO-SOURCE
> Task :sdks:java:io:google-cloud-platform:processTestResources
> Task :sdks:java:core:generateTestAvroJava
> Task :sdks:java:core:generateTestGrammarSource NO-SOURCE
> Task :sdks:java:core:processTestResources
> Task :model:pipeline:extractIncludeProto
> Task :model:pipeline:extractProto
> Task :sdks:java:extensions:sql:copyFmppTemplatesFromCalciteCore
> Task :sdks:java:extensions:sql:copyFmppTemplatesFromSrc
> Task :model:pipeline:generateProto
> Task :model:pipeline:compileJava FROM-CACHE
> Task :model:pipeline:processResources
> Task :model:pipeline:classes
> Task :model:pipeline:jar
> Task :model:job-management:extractIncludeProto
> Task :model:fn-execution:extractIncludeProto
> Task :model:job-management:generateProto
> Task :model:fn-execution:generateProto
> Task :model:job-management:compileJava FROM-CACHE
> Task :model:job-management:classes
> Task :sdks:java:extensions:sql:generateFmppSources
> Task :model:fn-execution:compileJava FROM-CACHE
> Task :model:fn-execution:classes
> Task :model:pipeline:shadowJar
> Task :sdks:java:extensions:sql:compileJavacc
Java Compiler Compiler Version 4.0 (Parser Generator)
(type "javacc" with no arguments for help)
Reading from file <https://ci-beam.apache.org/job/beam_PostCommit_SQL/ws/src/sdks/java/extensions/sql/build/generated/fmpp/javacc/Parser.jj> . . .
Note: UNICODE_INPUT option is specified. Please make sure you create the parser/lexer using a Reader with the correct character encoding.
Warning: Lookahead adequacy checking not being performed since option LOOKAHEAD is more than 1. Set option FORCE_LA_CHECK to true to force checking.
File "TokenMgrError.java" does not exist. Will create one.
File "ParseException.java" does not exist. Will create one.
File "Token.java" does not exist. Will create one.
File "SimpleCharStream.java" does not exist. Will create one.
Parser generated with 0 errors and 1 warnings.
> Task :sdks:java:extensions:sql:processResources
> Task :sdks:java:extensions:sql:processTestResources
> Task :model:job-management:shadowJar
> Task :model:fn-execution:shadowJar
> Task :sdks:java:core:compileJava FROM-CACHE
> Task :sdks:java:core:classes
> Task :sdks:java:core:shadowJar
> Task :sdks:java:extensions:protobuf:extractIncludeProto
> Task :sdks:java:extensions:protobuf:generateProto NO-SOURCE
> Task :sdks:java:core:jar
> Task :sdks:java:extensions:join-library:compileJava FROM-CACHE
> Task :sdks:java:extensions:join-library:classes UP-TO-DATE
> Task :runners:local-java:compileJava FROM-CACHE
> Task :runners:local-java:classes UP-TO-DATE
> Task :sdks:java:extensions:protobuf:compileJava FROM-CACHE
> Task :sdks:java:extensions:protobuf:classes UP-TO-DATE
> Task :sdks:java:extensions:join-library:jar
> Task :sdks:java:extensions:google-cloud-platform-core:compileJava FROM-CACHE
> Task :sdks:java:extensions:google-cloud-platform-core:classes UP-TO-DATE
> Task :sdks:java:io:hadoop-common:compileJava FROM-CACHE
> Task :sdks:java:io:hadoop-common:classes UP-TO-DATE
> Task :sdks:java:io:common:compileTestJava FROM-CACHE
> Task :sdks:java:io:common:testClasses UP-TO-DATE
> Task :runners:local-java:jar
> Task :sdks:java:io:mongodb:compileJava FROM-CACHE
> Task :sdks:java:io:mongodb:classes UP-TO-DATE
> Task :sdks:java:fn-execution:compileJava FROM-CACHE
> Task :sdks:java:fn-execution:classes UP-TO-DATE
> Task :sdks:java:io:hadoop-common:jar
> Task :vendor:sdks-java-extensions-protobuf:compileJava FROM-CACHE
> Task :vendor:sdks-java-extensions-protobuf:classes UP-TO-DATE
> Task :sdks:java:extensions:google-cloud-platform-core:jar
> Task :sdks:java:fn-execution:jar
> Task :sdks:java:io:common:testJar
> Task :runners:core-construction-java:compileJava FROM-CACHE
> Task :runners:core-construction-java:classes UP-TO-DATE
> Task :sdks:java:extensions:protobuf:jar
> Task :sdks:java:io:mongodb:jar
> Task :sdks:java:testing:test-utils:compileJava FROM-CACHE
> Task :sdks:java:testing:test-utils:classes UP-TO-DATE
> Task :sdks:java:testing:test-utils:jar
> Task :sdks:java:io:parquet:compileJava FROM-CACHE
> Task :sdks:java:io:parquet:classes UP-TO-DATE
> Task :sdks:java:io:parquet:jar
> Task :sdks:java:testing:test-utils:compileTestJava FROM-CACHE
> Task :sdks:java:testing:test-utils:testClasses UP-TO-DATE
> Task :vendor:sdks-java-extensions-protobuf:shadowJar
> Task :sdks:java:testing:test-utils:testJar
> Task :runners:core-construction-java:jar
> Task :runners:core-java:compileJava FROM-CACHE
> Task :runners:core-java:classes UP-TO-DATE
> Task :runners:core-java:jar
> Task :sdks:java:harness:compileJava FROM-CACHE
> Task :sdks:java:harness:classes UP-TO-DATE
> Task :sdks:java:harness:jar
> Task :sdks:java:core:compileTestJava FROM-CACHE
> Task :sdks:java:core:testClasses
> Task :sdks:java:core:shadowTestJar
> Task :sdks:java:extensions:google-cloud-platform-core:compileTestJava FROM-CACHE
> Task :sdks:java:extensions:google-cloud-platform-core:testClasses UP-TO-DATE
> Task :sdks:java:extensions:google-cloud-platform-core:testJar
> Task :sdks:java:io:mongodb:compileTestJava
Note: <https://ci-beam.apache.org/job/beam_PostCommit_SQL/ws/src/sdks/java/io/mongodb/src/test/java/org/apache/beam/sdk/io/mongodb/MongoDBGridFSIOTest.java> uses or overrides a deprecated API.
Note: Recompile with -Xlint:deprecation for details.
> Task :sdks:java:io:mongodb:testClasses
> Task :sdks:java:io:mongodb:testJar
> Task :sdks:java:harness:shadowJar
> Task :runners:java-fn-execution:compileJava FROM-CACHE
> Task :runners:java-fn-execution:classes UP-TO-DATE
> Task :runners:java-fn-execution:jar
> Task :sdks:java:expansion-service:compileJava FROM-CACHE
> Task :sdks:java:expansion-service:classes UP-TO-DATE
> Task :sdks:java:expansion-service:jar
> Task :runners:direct-java:compileJava FROM-CACHE
> Task :runners:direct-java:classes UP-TO-DATE
> Task :sdks:java:io:kafka:compileJava FROM-CACHE
> Task :sdks:java:io:kafka:classes UP-TO-DATE
> Task :sdks:java:io:kafka:jar
> Task :sdks:java:io:google-cloud-platform:compileJava FROM-CACHE
> Task :sdks:java:io:google-cloud-platform:classes UP-TO-DATE
> Task :sdks:java:io:google-cloud-platform:jar
> Task :runners:direct-java:shadowJar
> Task :sdks:java:io:google-cloud-platform:compileTestJava FROM-CACHE
> Task :sdks:java:io:google-cloud-platform:testClasses
> Task :sdks:java:io:google-cloud-platform:testJar
> Task :sdks:java:extensions:sql:compileJava FROM-CACHE
> Task :sdks:java:extensions:sql:classes
> Task :sdks:java:extensions:sql:compileTestJava
Note: Some input files use or override a deprecated API.
Note: Recompile with -Xlint:deprecation for details.
Note: Some input files use unchecked or unsafe operations.
Note: Recompile with -Xlint:unchecked for details.
> Task :sdks:java:extensions:sql:testClasses
> Task :sdks:java:extensions:sql:integrationTest
org.apache.beam.sdk.extensions.sql.meta.provider.pubsub.PubsubJsonIT > testSQLInsertJsonRowsToPubsubFlat FAILED
io.grpc.StatusRuntimeException
org.apache.beam.sdk.extensions.sql.meta.provider.pubsub.PubsubJsonIT > testSQLSelectsPayloadContentFlat FAILED
io.grpc.StatusRuntimeException
org.apache.beam.sdk.extensions.sql.meta.provider.pubsub.PubsubJsonIT > testSQLSelectsPayloadContent FAILED
io.grpc.StatusRuntimeException
org.apache.beam.sdk.extensions.sql.meta.provider.pubsub.PubsubJsonIT > testSQLReadAndWriteWithSameFlatTableDefinition FAILED
io.grpc.StatusRuntimeException
org.apache.beam.sdk.extensions.sql.meta.provider.pubsub.PubsubJsonIT > testSQLInsertJsonRowsToPubsubWithTimestampAttributeFlat FAILED
io.grpc.StatusRuntimeException
org.apache.beam.sdk.extensions.sql.meta.provider.pubsub.PubsubJsonIT > testWritesJsonRowsToPubsub FAILED
io.grpc.StatusRuntimeException
org.apache.beam.sdk.extensions.sql.PubsubToBigqueryIT > testSimpleInsert FAILED
io.grpc.StatusRuntimeException
org.apache.beam.sdk.extensions.sql.PubsubToBigqueryIT > testSimpleInsertFlat FAILED
io.grpc.StatusRuntimeException
35 tests completed, 8 failed, 4 skipped
> Task :sdks:java:extensions:sql:integrationTest FAILED
> Task :sdks:java:extensions:sql:jar
> Task :sdks:java:extensions:sql:zetasql:compileJava FROM-CACHE
> Task :sdks:java:extensions:sql:zetasql:classes UP-TO-DATE
> Task :sdks:java:extensions:sql:zetasql:jar
> Task :sdks:java:extensions:sql:jdbc:compileJava
> Task :sdks:java:extensions:sql:jdbc:classes
> Task :sdks:java:extensions:sql:jdbc:compileTestJava
Note: Some input files use or override a deprecated API.
Note: Recompile with -Xlint:deprecation for details.
Note: Some input files use unchecked or unsafe operations.
Note: Recompile with -Xlint:unchecked for details.
> Task :sdks:java:extensions:sql:jdbc:testClasses
> Task :sdks:java:extensions:sql:jdbc:endToEndTest
> Task :sdks:java:extensions:sql:jdbc:postCommit
> Task :sdks:java:extensions:sql:datacatalog:compileJava
> Task :sdks:java:extensions:sql:datacatalog:classes
> Task :sdks:java:extensions:sql:datacatalog:compileTestJava
> Task :sdks:java:extensions:sql:datacatalog:testClasses
> Task :sdks:java:extensions:sql:datacatalog:integrationTest
> Task :sdks:java:extensions:sql:datacatalog:postCommit
FAILURE: Build failed with an exception.
* What went wrong:
Execution failed for task ':sdks:java:extensions:sql:integrationTest'.
> There were failing tests. See the report at: file://<https://ci-beam.apache.org/job/beam_PostCommit_SQL/ws/src/sdks/java/extensions/sql/build/reports/tests/integrationTest/index.html>
* Try:
Run with --stacktrace option to get the stack trace. Run with --info or --debug option to get more log output. Run with --scan to get full insights.
* Get more help at https://help.gradle.org
Deprecated Gradle features were used in this build, making it incompatible with Gradle 6.0.
Use '--warning-mode all' to show the individual deprecation warnings.
See https://docs.gradle.org/5.2.1/userguide/command_line_interface.html#sec:command_line_warnings
BUILD FAILED in 3m 59s
101 actionable tasks: 71 executed, 30 from cache
Publishing build scan...
https://gradle.com/s/ojpl6bq64ovu4
Build step 'Invoke Gradle script' changed build result to FAILURE
Build step 'Invoke Gradle script' marked build as failure
---------------------------------------------------------------------
To unsubscribe, e-mail: builds-unsubscribe@beam.apache.org
For additional commands, e-mail: builds-help@beam.apache.org
Build failed in Jenkins: beam_PostCommit_SQL #5202
Posted by Apache Jenkins Server <je...@builds.apache.org>.
See <https://ci-beam.apache.org/job/beam_PostCommit_SQL/5202/display/redirect>
Changes:
------------------------------------------
[...truncated 4.85 KB...]
> Task :buildSrc:pluginUnderTestMetadata
> Task :buildSrc:compileTestJava NO-SOURCE
> Task :buildSrc:compileTestGroovy NO-SOURCE
> Task :buildSrc:processTestResources NO-SOURCE
> Task :buildSrc:testClasses UP-TO-DATE
> Task :buildSrc:test NO-SOURCE
> Task :buildSrc:validateTaskProperties FROM-CACHE
> Task :buildSrc:check
> Task :buildSrc:build
Configuration on demand is an incubating feature.
> Task :runners:core-construction-java:processResources NO-SOURCE
> Task :sdks:java:core:generateAvroProtocol NO-SOURCE
> Task :vendor:sdks-java-extensions-protobuf:processResources NO-SOURCE
> Task :runners:local-java:processResources NO-SOURCE
> Task :runners:java-fn-execution:processResources NO-SOURCE
> Task :sdks:java:harness:processResources NO-SOURCE
> Task :sdks:java:fn-execution:processResources NO-SOURCE
> Task :sdks:java:extensions:google-cloud-platform-core:processResources NO-SOURCE
> Task :runners:core-java:processResources NO-SOURCE
> Task :runners:direct-java:processResources NO-SOURCE
> Task :sdks:java:io:kafka:processResources NO-SOURCE
> Task :sdks:java:io:mongodb:processResources NO-SOURCE
> Task :sdks:java:core:generateAvroJava NO-SOURCE
> Task :sdks:java:io:google-cloud-platform:processResources NO-SOURCE
> Task :sdks:java:io:parquet:processResources NO-SOURCE
> Task :sdks:java:io:hadoop-common:processResources NO-SOURCE
> Task :sdks:java:extensions:protobuf:extractProto
> Task :sdks:java:io:common:compileJava NO-SOURCE
> Task :sdks:java:extensions:join-library:createCheckerFrameworkManifest
> Task :sdks:java:io:mongodb:processTestResources NO-SOURCE
> Task :sdks:java:io:common:processResources NO-SOURCE
> Task :model:job-management:extractProto
> Task :model:fn-execution:extractProto
> Task :sdks:java:io:common:classes UP-TO-DATE
> Task :sdks:java:expansion-service:createCheckerFrameworkManifest
> Task :sdks:java:extensions:join-library:processResources NO-SOURCE
> Task :sdks:java:extensions:protobuf:processResources NO-SOURCE
> Task :sdks:java:extensions:sql:zetasql:processResources NO-SOURCE
> Task :sdks:java:testing:test-utils:processResources NO-SOURCE
> Task :sdks:java:expansion-service:processResources NO-SOURCE
> Task :sdks:java:extensions:google-cloud-platform-core:processTestResources NO-SOURCE
> Task :sdks:java:testing:test-utils:processTestResources NO-SOURCE
> Task :sdks:java:extensions:sql:datacatalog:createCheckerFrameworkManifest
> Task :sdks:java:extensions:sql:datacatalog:processResources NO-SOURCE
> Task :sdks:java:extensions:sql:datacatalog:processTestResources NO-SOURCE
> Task :model:job-management:processResources
> Task :sdks:java:io:common:jar
> Task :sdks:java:io:common:processTestResources NO-SOURCE
> Task :model:fn-execution:processResources
> Task :sdks:java:extensions:sql:jdbc:processResources
> Task :sdks:java:extensions:sql:jdbc:processTestResources NO-SOURCE
> Task :sdks:java:core:generateGrammarSource FROM-CACHE
> Task :sdks:java:io:google-cloud-platform:processTestResources
> Task :sdks:java:core:processResources
> Task :sdks:java:core:generateTestAvroProtocol NO-SOURCE
> Task :sdks:java:extensions:sql:copyFmppTemplatesFromCalciteCore
> Task :sdks:java:extensions:sql:copyFmppTemplatesFromSrc
> Task :model:pipeline:extractIncludeProto
> Task :model:pipeline:extractProto
> Task :sdks:java:core:generateTestAvroJava
> Task :sdks:java:core:generateTestGrammarSource NO-SOURCE
> Task :sdks:java:core:processTestResources
> Task :model:pipeline:generateProto
> Task :model:pipeline:compileJava FROM-CACHE
> Task :model:pipeline:processResources
> Task :model:pipeline:classes
> Task :model:pipeline:jar
> Task :sdks:java:extensions:sql:generateFmppSources
> Task :model:fn-execution:extractIncludeProto
> Task :model:job-management:extractIncludeProto
> Task :sdks:java:extensions:sql:compileJavacc
Java Compiler Compiler Version 4.0 (Parser Generator)
(type "javacc" with no arguments for help)
Reading from file <https://ci-beam.apache.org/job/beam_PostCommit_SQL/ws/src/sdks/java/extensions/sql/build/generated/fmpp/javacc/Parser.jj> . . .
Note: UNICODE_INPUT option is specified. Please make sure you create the parser/lexer using a Reader with the correct character encoding.
Warning: Lookahead adequacy checking not being performed since option LOOKAHEAD is more than 1. Set option FORCE_LA_CHECK to true to force checking.
> Task :model:job-management:generateProto
> Task :model:fn-execution:generateProto
> Task :model:job-management:compileJava FROM-CACHE
> Task :model:job-management:classes
> Task :model:fn-execution:compileJava FROM-CACHE
> Task :model:fn-execution:classes
> Task :sdks:java:extensions:sql:compileJavacc
File "TokenMgrError.java" does not exist. Will create one.
File "ParseException.java" does not exist. Will create one.
File "Token.java" does not exist. Will create one.
File "SimpleCharStream.java" does not exist. Will create one.
Parser generated with 0 errors and 1 warnings.
> Task :sdks:java:extensions:sql:processResources
> Task :sdks:java:extensions:sql:processTestResources
> Task :model:pipeline:shadowJar
> Task :model:job-management:shadowJar
> Task :model:fn-execution:shadowJar
> Task :sdks:java:core:compileJava FROM-CACHE
> Task :sdks:java:core:classes
> Task :sdks:java:core:shadowJar
> Task :sdks:java:io:common:compileTestJava FROM-CACHE
> Task :sdks:java:io:common:testClasses UP-TO-DATE
> Task :sdks:java:io:common:testJar
> Task :runners:local-java:compileJava FROM-CACHE
> Task :runners:local-java:classes UP-TO-DATE
> Task :runners:local-java:jar
> Task :sdks:java:extensions:google-cloud-platform-core:compileJava FROM-CACHE
> Task :sdks:java:extensions:google-cloud-platform-core:classes UP-TO-DATE
> Task :sdks:java:extensions:google-cloud-platform-core:jar
> Task :sdks:java:extensions:protobuf:extractIncludeProto
> Task :sdks:java:extensions:protobuf:generateProto NO-SOURCE
> Task :sdks:java:extensions:join-library:compileJava FROM-CACHE
> Task :sdks:java:extensions:join-library:classes UP-TO-DATE
> Task :sdks:java:extensions:protobuf:compileJava FROM-CACHE
> Task :sdks:java:extensions:protobuf:classes UP-TO-DATE
> Task :sdks:java:io:hadoop-common:compileJava FROM-CACHE
> Task :sdks:java:testing:test-utils:compileJava FROM-CACHE
> Task :sdks:java:io:mongodb:compileJava FROM-CACHE
> Task :sdks:java:io:hadoop-common:classes UP-TO-DATE
> Task :sdks:java:io:mongodb:classes UP-TO-DATE
> Task :vendor:sdks-java-extensions-protobuf:compileJava FROM-CACHE
> Task :sdks:java:fn-execution:compileJava FROM-CACHE
> Task :sdks:java:testing:test-utils:classes UP-TO-DATE
> Task :sdks:java:fn-execution:classes UP-TO-DATE
> Task :vendor:sdks-java-extensions-protobuf:classes UP-TO-DATE
> Task :sdks:java:io:hadoop-common:jar
> Task :sdks:java:extensions:join-library:jar
> Task :sdks:java:testing:test-utils:jar
> Task :runners:core-construction-java:compileJava FROM-CACHE
> Task :runners:core-construction-java:classes UP-TO-DATE
> Task :sdks:java:io:mongodb:jar
> Task :sdks:java:fn-execution:jar
> Task :sdks:java:extensions:protobuf:jar
> Task :sdks:java:testing:test-utils:compileTestJava FROM-CACHE
> Task :runners:core-construction-java:jar
> Task :sdks:java:testing:test-utils:testClasses UP-TO-DATE
> Task :sdks:java:testing:test-utils:testJar
> Task :sdks:java:io:parquet:compileJava FROM-CACHE
> Task :sdks:java:io:parquet:classes UP-TO-DATE
> Task :sdks:java:io:parquet:jar
> Task :vendor:sdks-java-extensions-protobuf:shadowJar
> Task :sdks:java:io:mongodb:compileTestJava FROM-CACHE
> Task :sdks:java:io:mongodb:testClasses UP-TO-DATE
> Task :sdks:java:io:mongodb:testJar
> Task :sdks:java:core:jar
> Task :runners:core-java:compileJava FROM-CACHE
> Task :runners:core-java:classes UP-TO-DATE
> Task :runners:core-java:jar
> Task :sdks:java:harness:compileJava FROM-CACHE
> Task :sdks:java:harness:classes UP-TO-DATE
> Task :sdks:java:harness:jar
> Task :sdks:java:core:compileTestJava FROM-CACHE
> Task :sdks:java:core:testClasses
> Task :sdks:java:core:shadowTestJar
> Task :sdks:java:extensions:google-cloud-platform-core:compileTestJava FROM-CACHE
> Task :sdks:java:extensions:google-cloud-platform-core:testClasses UP-TO-DATE
> Task :sdks:java:extensions:google-cloud-platform-core:testJar
> Task :sdks:java:harness:shadowJar
> Task :runners:java-fn-execution:compileJava FROM-CACHE
> Task :runners:java-fn-execution:classes UP-TO-DATE
> Task :runners:java-fn-execution:jar
> Task :sdks:java:expansion-service:compileJava FROM-CACHE
> Task :sdks:java:expansion-service:classes UP-TO-DATE
> Task :sdks:java:expansion-service:jar
> Task :runners:direct-java:compileJava FROM-CACHE
> Task :runners:direct-java:classes UP-TO-DATE
> Task :sdks:java:io:kafka:compileJava FROM-CACHE
> Task :sdks:java:io:kafka:classes UP-TO-DATE
> Task :sdks:java:io:kafka:jar
> Task :sdks:java:io:google-cloud-platform:compileJava FROM-CACHE
> Task :sdks:java:io:google-cloud-platform:classes UP-TO-DATE
> Task :sdks:java:io:google-cloud-platform:jar
> Task :runners:direct-java:shadowJar
> Task :sdks:java:io:google-cloud-platform:compileTestJava FROM-CACHE
> Task :sdks:java:io:google-cloud-platform:testClasses
> Task :sdks:java:io:google-cloud-platform:testJar
> Task :sdks:java:extensions:sql:compileJava FROM-CACHE
> Task :sdks:java:extensions:sql:classes
> Task :sdks:java:extensions:sql:compileTestJava FROM-CACHE
> Task :sdks:java:extensions:sql:testClasses
> Task :sdks:java:extensions:sql:integrationTest
org.apache.beam.sdk.extensions.sql.meta.provider.pubsub.PubsubJsonIT > testSQLInsertJsonRowsToPubsubFlat FAILED
io.grpc.StatusRuntimeException
org.apache.beam.sdk.extensions.sql.meta.provider.pubsub.PubsubJsonIT > testSQLSelectsPayloadContentFlat FAILED
io.grpc.StatusRuntimeException
org.apache.beam.sdk.extensions.sql.meta.provider.pubsub.PubsubJsonIT > testSQLSelectsPayloadContent FAILED
io.grpc.StatusRuntimeException
org.apache.beam.sdk.extensions.sql.meta.provider.pubsub.PubsubJsonIT > testSQLReadAndWriteWithSameFlatTableDefinition FAILED
io.grpc.StatusRuntimeException
org.apache.beam.sdk.extensions.sql.meta.provider.pubsub.PubsubJsonIT > testSQLInsertJsonRowsToPubsubWithTimestampAttributeFlat FAILED
io.grpc.StatusRuntimeException
org.apache.beam.sdk.extensions.sql.meta.provider.pubsub.PubsubJsonIT > testWritesJsonRowsToPubsub FAILED
io.grpc.StatusRuntimeException
org.apache.beam.sdk.extensions.sql.PubsubToBigqueryIT > testSimpleInsert FAILED
io.grpc.StatusRuntimeException
org.apache.beam.sdk.extensions.sql.PubsubToBigqueryIT > testSimpleInsertFlat FAILED
io.grpc.StatusRuntimeException
35 tests completed, 8 failed, 4 skipped
> Task :sdks:java:extensions:sql:integrationTest FAILED
> Task :sdks:java:extensions:sql:jar
> Task :sdks:java:extensions:sql:jdbc:compileJava FROM-CACHE
> Task :sdks:java:extensions:sql:jdbc:classes
> Task :sdks:java:extensions:sql:zetasql:compileJava FROM-CACHE
> Task :sdks:java:extensions:sql:zetasql:classes UP-TO-DATE
> Task :sdks:java:extensions:sql:datacatalog:compileJava FROM-CACHE
> Task :sdks:java:extensions:sql:datacatalog:classes UP-TO-DATE
> Task :sdks:java:extensions:sql:zetasql:jar
> Task :sdks:java:extensions:sql:datacatalog:compileTestJava FROM-CACHE
> Task :sdks:java:extensions:sql:datacatalog:testClasses UP-TO-DATE
> Task :sdks:java:extensions:sql:jdbc:compileTestJava FROM-CACHE
> Task :sdks:java:extensions:sql:jdbc:testClasses UP-TO-DATE
> Task :sdks:java:extensions:sql:jdbc:endToEndTest
> Task :sdks:java:extensions:sql:jdbc:postCommit
> Task :sdks:java:extensions:sql:datacatalog:integrationTest
> Task :sdks:java:extensions:sql:datacatalog:postCommit
FAILURE: Build failed with an exception.
* What went wrong:
Execution failed for task ':sdks:java:extensions:sql:integrationTest'.
> There were failing tests. See the report at: file://<https://ci-beam.apache.org/job/beam_PostCommit_SQL/ws/src/sdks/java/extensions/sql/build/reports/tests/integrationTest/index.html>
* Try:
Run with --stacktrace option to get the stack trace. Run with --info or --debug option to get more log output. Run with --scan to get full insights.
* Get more help at https://help.gradle.org
Deprecated Gradle features were used in this build, making it incompatible with Gradle 6.0.
Use '--warning-mode all' to show the individual deprecation warnings.
See https://docs.gradle.org/5.2.1/userguide/command_line_interface.html#sec:command_line_warnings
BUILD FAILED in 3m 39s
101 actionable tasks: 65 executed, 36 from cache
Publishing build scan...
https://gradle.com/s/g6zjt6irhizpi
Build step 'Invoke Gradle script' changed build result to FAILURE
Build step 'Invoke Gradle script' marked build as failure
---------------------------------------------------------------------
To unsubscribe, e-mail: builds-unsubscribe@beam.apache.org
For additional commands, e-mail: builds-help@beam.apache.org
Build failed in Jenkins: beam_PostCommit_SQL #5201
Posted by Apache Jenkins Server <je...@builds.apache.org>.
See <https://ci-beam.apache.org/job/beam_PostCommit_SQL/5201/display/redirect?page=changes>
Changes:
[Boyuan Zhang] Remove redundant setMaxNumRecords and consumerFactoryFn.
[noreply] Merge pull request #12575: [BEAM-10707] Adding Python docs precommit as
------------------------------------------
[...truncated 4.85 KB...]
> Task :buildSrc:pluginUnderTestMetadata
> Task :buildSrc:compileTestJava NO-SOURCE
> Task :buildSrc:compileTestGroovy NO-SOURCE
> Task :buildSrc:processTestResources NO-SOURCE
> Task :buildSrc:testClasses UP-TO-DATE
> Task :buildSrc:test NO-SOURCE
> Task :buildSrc:validateTaskProperties FROM-CACHE
> Task :buildSrc:check
> Task :buildSrc:build
Configuration on demand is an incubating feature.
> Task :sdks:java:core:generateAvroProtocol NO-SOURCE
> Task :runners:core-construction-java:processResources NO-SOURCE
> Task :runners:local-java:processResources NO-SOURCE
> Task :vendor:sdks-java-extensions-protobuf:processResources NO-SOURCE
> Task :runners:core-java:processResources NO-SOURCE
> Task :sdks:java:harness:processResources NO-SOURCE
> Task :sdks:java:fn-execution:processResources NO-SOURCE
> Task :runners:java-fn-execution:processResources NO-SOURCE
> Task :sdks:java:extensions:google-cloud-platform-core:processResources NO-SOURCE
> Task :sdks:java:core:generateAvroJava NO-SOURCE
> Task :runners:direct-java:processResources NO-SOURCE
> Task :sdks:java:io:google-cloud-platform:processResources NO-SOURCE
> Task :sdks:java:io:hadoop-common:processResources NO-SOURCE
> Task :sdks:java:io:mongodb:processResources NO-SOURCE
> Task :model:job-management:extractProto
> Task :sdks:java:io:kafka:processResources NO-SOURCE
> Task :model:fn-execution:extractProto
> Task :sdks:java:io:parquet:processResources NO-SOURCE
> Task :sdks:java:extensions:protobuf:extractProto
> Task :sdks:java:expansion-service:createCheckerFrameworkManifest
> Task :sdks:java:extensions:join-library:createCheckerFrameworkManifest
> Task :sdks:java:extensions:join-library:processResources NO-SOURCE
> Task :sdks:java:testing:test-utils:processResources NO-SOURCE
> Task :sdks:java:io:common:compileJava NO-SOURCE
> Task :sdks:java:expansion-service:processResources NO-SOURCE
> Task :sdks:java:io:common:processResources NO-SOURCE
> Task :model:job-management:processResources
> Task :model:fn-execution:processResources
> Task :sdks:java:extensions:sql:zetasql:processResources NO-SOURCE
> Task :sdks:java:extensions:sql:datacatalog:createCheckerFrameworkManifest
> Task :sdks:java:io:mongodb:processTestResources NO-SOURCE
> Task :sdks:java:io:common:classes UP-TO-DATE
> Task :sdks:java:extensions:protobuf:processResources NO-SOURCE
> Task :sdks:java:extensions:google-cloud-platform-core:processTestResources NO-SOURCE
> Task :sdks:java:testing:test-utils:processTestResources NO-SOURCE
> Task :sdks:java:extensions:sql:datacatalog:processResources NO-SOURCE
> Task :sdks:java:extensions:sql:datacatalog:processTestResources NO-SOURCE
> Task :sdks:java:io:common:jar
> Task :sdks:java:io:common:processTestResources NO-SOURCE
> Task :sdks:java:extensions:sql:jdbc:processResources
> Task :sdks:java:extensions:sql:jdbc:processTestResources NO-SOURCE
> Task :sdks:java:core:generateGrammarSource FROM-CACHE
> Task :sdks:java:core:processResources
> Task :sdks:java:core:generateTestAvroProtocol NO-SOURCE
> Task :sdks:java:io:google-cloud-platform:processTestResources
> Task :sdks:java:core:generateTestAvroJava
> Task :sdks:java:core:generateTestGrammarSource NO-SOURCE
> Task :sdks:java:extensions:sql:copyFmppTemplatesFromCalciteCore
> Task :sdks:java:core:processTestResources
> Task :sdks:java:extensions:sql:copyFmppTemplatesFromSrc
> Task :model:pipeline:extractIncludeProto
> Task :model:pipeline:extractProto
> Task :model:pipeline:generateProto
> Task :model:pipeline:compileJava FROM-CACHE
> Task :model:pipeline:processResources
> Task :model:pipeline:classes
> Task :sdks:java:extensions:sql:generateFmppSources
> Task :model:pipeline:jar
> Task :sdks:java:extensions:sql:compileJavacc
Java Compiler Compiler Version 4.0 (Parser Generator)
(type "javacc" with no arguments for help)
Reading from file <https://ci-beam.apache.org/job/beam_PostCommit_SQL/ws/src/sdks/java/extensions/sql/build/generated/fmpp/javacc/Parser.jj> . . .
Note: UNICODE_INPUT option is specified. Please make sure you create the parser/lexer using a Reader with the correct character encoding.
Warning: Lookahead adequacy checking not being performed since option LOOKAHEAD is more than 1. Set option FORCE_LA_CHECK to true to force checking.
> Task :model:fn-execution:extractIncludeProto
> Task :model:job-management:extractIncludeProto
> Task :model:job-management:generateProto
> Task :model:fn-execution:generateProto
> Task :sdks:java:extensions:sql:compileJavacc
File "TokenMgrError.java" does not exist. Will create one.
File "ParseException.java" does not exist. Will create one.
File "Token.java" does not exist. Will create one.
File "SimpleCharStream.java" does not exist. Will create one.
Parser generated with 0 errors and 1 warnings.
> Task :model:job-management:compileJava FROM-CACHE
> Task :model:job-management:classes
> Task :model:fn-execution:compileJava FROM-CACHE
> Task :model:fn-execution:classes
> Task :sdks:java:extensions:sql:processResources
> Task :sdks:java:extensions:sql:processTestResources
> Task :model:pipeline:shadowJar
> Task :model:job-management:shadowJar
> Task :model:fn-execution:shadowJar
> Task :sdks:java:core:compileJava FROM-CACHE
> Task :sdks:java:core:classes
> Task :sdks:java:core:shadowJar
> Task :sdks:java:extensions:protobuf:extractIncludeProto
> Task :sdks:java:extensions:protobuf:generateProto NO-SOURCE
> Task :vendor:sdks-java-extensions-protobuf:compileJava FROM-CACHE
> Task :vendor:sdks-java-extensions-protobuf:classes UP-TO-DATE
> Task :sdks:java:extensions:protobuf:compileJava FROM-CACHE
> Task :sdks:java:extensions:protobuf:classes UP-TO-DATE
> Task :sdks:java:extensions:join-library:compileJava FROM-CACHE
> Task :sdks:java:extensions:join-library:classes UP-TO-DATE
> Task :sdks:java:extensions:join-library:jar
> Task :sdks:java:extensions:protobuf:jar
> Task :sdks:java:io:common:compileTestJava FROM-CACHE
> Task :sdks:java:io:common:testClasses UP-TO-DATE
> Task :sdks:java:io:common:testJar
> Task :runners:local-java:compileJava FROM-CACHE
> Task :runners:local-java:classes UP-TO-DATE
> Task :runners:local-java:jar
> Task :sdks:java:io:mongodb:compileJava FROM-CACHE
> Task :sdks:java:io:mongodb:classes UP-TO-DATE
> Task :vendor:sdks-java-extensions-protobuf:shadowJar
> Task :sdks:java:fn-execution:compileJava FROM-CACHE
> Task :sdks:java:fn-execution:classes UP-TO-DATE
> Task :sdks:java:io:mongodb:jar
> Task :runners:core-construction-java:compileJava FROM-CACHE
> Task :runners:core-construction-java:classes UP-TO-DATE
> Task :sdks:java:fn-execution:jar
> Task :sdks:java:io:hadoop-common:compileJava FROM-CACHE
> Task :sdks:java:io:hadoop-common:classes UP-TO-DATE
> Task :sdks:java:io:hadoop-common:jar
> Task :sdks:java:extensions:google-cloud-platform-core:compileJava FROM-CACHE
> Task :sdks:java:extensions:google-cloud-platform-core:classes UP-TO-DATE
> Task :sdks:java:io:parquet:compileJava FROM-CACHE
> Task :sdks:java:io:parquet:classes UP-TO-DATE
> Task :sdks:java:io:parquet:jar
> Task :sdks:java:extensions:google-cloud-platform-core:jar
> Task :runners:core-construction-java:jar
> Task :sdks:java:testing:test-utils:compileJava FROM-CACHE
> Task :sdks:java:testing:test-utils:classes UP-TO-DATE
> Task :sdks:java:testing:test-utils:jar
> Task :sdks:java:core:jar
> Task :sdks:java:testing:test-utils:compileTestJava FROM-CACHE
> Task :sdks:java:testing:test-utils:testClasses UP-TO-DATE
> Task :sdks:java:testing:test-utils:testJar
> Task :runners:core-java:compileJava FROM-CACHE
> Task :runners:core-java:classes UP-TO-DATE
> Task :sdks:java:io:mongodb:compileTestJava FROM-CACHE
> Task :sdks:java:io:mongodb:testClasses UP-TO-DATE
> Task :sdks:java:io:mongodb:testJar
> Task :runners:core-java:jar
> Task :sdks:java:harness:compileJava FROM-CACHE
> Task :sdks:java:harness:classes UP-TO-DATE
> Task :sdks:java:harness:jar
> Task :sdks:java:core:compileTestJava FROM-CACHE
> Task :sdks:java:core:testClasses
> Task :sdks:java:core:shadowTestJar
> Task :sdks:java:extensions:google-cloud-platform-core:compileTestJava FROM-CACHE
> Task :sdks:java:extensions:google-cloud-platform-core:testClasses UP-TO-DATE
> Task :sdks:java:extensions:google-cloud-platform-core:testJar
> Task :sdks:java:harness:shadowJar
> Task :runners:java-fn-execution:compileJava FROM-CACHE
> Task :runners:java-fn-execution:classes UP-TO-DATE
> Task :runners:java-fn-execution:jar
> Task :sdks:java:expansion-service:compileJava FROM-CACHE
> Task :sdks:java:expansion-service:classes UP-TO-DATE
> Task :sdks:java:expansion-service:jar
> Task :runners:direct-java:compileJava FROM-CACHE
> Task :runners:direct-java:classes UP-TO-DATE
> Task :sdks:java:io:kafka:compileJava FROM-CACHE
> Task :sdks:java:io:kafka:classes UP-TO-DATE
> Task :sdks:java:io:kafka:jar
> Task :sdks:java:io:google-cloud-platform:compileJava FROM-CACHE
> Task :sdks:java:io:google-cloud-platform:classes UP-TO-DATE
> Task :sdks:java:io:google-cloud-platform:jar
> Task :runners:direct-java:shadowJar
> Task :sdks:java:io:google-cloud-platform:compileTestJava FROM-CACHE
> Task :sdks:java:io:google-cloud-platform:testClasses
> Task :sdks:java:io:google-cloud-platform:testJar
> Task :sdks:java:extensions:sql:compileJava FROM-CACHE
> Task :sdks:java:extensions:sql:classes
> Task :sdks:java:extensions:sql:compileTestJava FROM-CACHE
> Task :sdks:java:extensions:sql:testClasses
> Task :sdks:java:extensions:sql:integrationTest
org.apache.beam.sdk.extensions.sql.meta.provider.pubsub.PubsubJsonIT > testSQLInsertJsonRowsToPubsubFlat FAILED
io.grpc.StatusRuntimeException
org.apache.beam.sdk.extensions.sql.meta.provider.pubsub.PubsubJsonIT > testSQLSelectsPayloadContentFlat FAILED
io.grpc.StatusRuntimeException
org.apache.beam.sdk.extensions.sql.meta.provider.pubsub.PubsubJsonIT > testSQLSelectsPayloadContent FAILED
io.grpc.StatusRuntimeException
org.apache.beam.sdk.extensions.sql.meta.provider.pubsub.PubsubJsonIT > testSQLReadAndWriteWithSameFlatTableDefinition FAILED
io.grpc.StatusRuntimeException
org.apache.beam.sdk.extensions.sql.meta.provider.pubsub.PubsubJsonIT > testSQLInsertJsonRowsToPubsubWithTimestampAttributeFlat FAILED
io.grpc.StatusRuntimeException
org.apache.beam.sdk.extensions.sql.meta.provider.pubsub.PubsubJsonIT > testWritesJsonRowsToPubsub FAILED
io.grpc.StatusRuntimeException
org.apache.beam.sdk.extensions.sql.PubsubToBigqueryIT > testSimpleInsert FAILED
io.grpc.StatusRuntimeException
org.apache.beam.sdk.extensions.sql.PubsubToBigqueryIT > testSimpleInsertFlat FAILED
io.grpc.StatusRuntimeException
35 tests completed, 8 failed, 4 skipped
> Task :sdks:java:extensions:sql:integrationTest FAILED
> Task :sdks:java:extensions:sql:jar
> Task :sdks:java:extensions:sql:jdbc:compileJava FROM-CACHE
> Task :sdks:java:extensions:sql:jdbc:classes
> Task :sdks:java:extensions:sql:zetasql:compileJava FROM-CACHE
> Task :sdks:java:extensions:sql:zetasql:classes UP-TO-DATE
> Task :sdks:java:extensions:sql:datacatalog:compileJava FROM-CACHE
> Task :sdks:java:extensions:sql:datacatalog:classes UP-TO-DATE
> Task :sdks:java:extensions:sql:zetasql:jar
> Task :sdks:java:extensions:sql:datacatalog:compileTestJava FROM-CACHE
> Task :sdks:java:extensions:sql:datacatalog:testClasses UP-TO-DATE
> Task :sdks:java:extensions:sql:jdbc:compileTestJava FROM-CACHE
> Task :sdks:java:extensions:sql:jdbc:testClasses UP-TO-DATE
> Task :sdks:java:extensions:sql:jdbc:endToEndTest
> Task :sdks:java:extensions:sql:jdbc:postCommit
> Task :sdks:java:extensions:sql:datacatalog:integrationTest
> Task :sdks:java:extensions:sql:datacatalog:postCommit
FAILURE: Build failed with an exception.
* What went wrong:
Execution failed for task ':sdks:java:extensions:sql:integrationTest'.
> There were failing tests. See the report at: file://<https://ci-beam.apache.org/job/beam_PostCommit_SQL/ws/src/sdks/java/extensions/sql/build/reports/tests/integrationTest/index.html>
* Try:
Run with --stacktrace option to get the stack trace. Run with --info or --debug option to get more log output. Run with --scan to get full insights.
* Get more help at https://help.gradle.org
Deprecated Gradle features were used in this build, making it incompatible with Gradle 6.0.
Use '--warning-mode all' to show the individual deprecation warnings.
See https://docs.gradle.org/5.2.1/userguide/command_line_interface.html#sec:command_line_warnings
BUILD FAILED in 3m 24s
101 actionable tasks: 65 executed, 36 from cache
Publishing build scan...
https://gradle.com/s/zi5pdecsi4j6o
Build step 'Invoke Gradle script' changed build result to FAILURE
Build step 'Invoke Gradle script' marked build as failure
---------------------------------------------------------------------
To unsubscribe, e-mail: builds-unsubscribe@beam.apache.org
For additional commands, e-mail: builds-help@beam.apache.org
Build failed in Jenkins: beam_PostCommit_SQL #5200
Posted by Apache Jenkins Server <je...@builds.apache.org>.
See <https://ci-beam.apache.org/job/beam_PostCommit_SQL/5200/display/redirect?page=changes>
Changes:
[Luke Cwik] [BEAM-10670] Make Read execute as a splittable DoFn by default for the
------------------------------------------
[...truncated 31.61 KB...]
> Task :sdks:java:extensions:google-cloud-platform-core:compileJava
Note: Some input files use or override a deprecated API.
Note: Recompile with -Xlint:deprecation for details.
> Task :sdks:java:fn-execution:jar
> Task :sdks:java:io:mongodb:compileJava
Note: Some input files use or override a deprecated API.
Note: Recompile with -Xlint:deprecation for details.
Note: Some input files use unchecked or unsafe operations.
Note: Recompile with -Xlint:unchecked for details.
> Task :sdks:java:io:mongodb:classes
> Task :sdks:java:io:mongodb:jar
> Task :sdks:java:extensions:google-cloud-platform-core:classes
> Task :sdks:java:extensions:google-cloud-platform-core:jar
> Task :sdks:java:extensions:protobuf:compileJava
> Task :sdks:java:core:compileTestJava
> Task :vendor:sdks-java-extensions-protobuf:compileJava
Note: Some input files use or override a deprecated API.
Note: Recompile with -Xlint:deprecation for details.
Note: Some input files use unchecked or unsafe operations.
Note: Recompile with -Xlint:unchecked for details.
> Task :vendor:sdks-java-extensions-protobuf:classes
> Task :sdks:java:extensions:protobuf:compileJava
Note: Some input files use or override a deprecated API.
Note: Recompile with -Xlint:deprecation for details.
Note: Some input files use unchecked or unsafe operations.
Note: Recompile with -Xlint:unchecked for details.
> Task :sdks:java:extensions:protobuf:classes
> Task :sdks:java:io:parquet:compileJava
Note: <https://ci-beam.apache.org/job/beam_PostCommit_SQL/ws/src/sdks/java/io/parquet/src/main/java/org/apache/beam/sdk/io/parquet/ParquetIO.java> uses unchecked or unsafe operations.
Note: Recompile with -Xlint:unchecked for details.
> Task :sdks:java:extensions:protobuf:jar
> Task :vendor:sdks-java-extensions-protobuf:shadowJar
> Task :sdks:java:io:parquet:classes
> Task :sdks:java:io:parquet:jar
> Task :sdks:java:testing:test-utils:compileJava
> Task :sdks:java:testing:test-utils:classes
> Task :sdks:java:testing:test-utils:jar
> Task :sdks:java:extensions:join-library:compileJava
Note: <https://ci-beam.apache.org/job/beam_PostCommit_SQL/ws/src/sdks/java/extensions/join-library/src/main/java/org/apache/beam/sdk/extensions/joinlibrary/Join.java> uses unchecked or unsafe operations.
Note: Recompile with -Xlint:unchecked for details.
> Task :sdks:java:extensions:join-library:classes
> Task :sdks:java:extensions:join-library:jar
> Task :runners:core-construction-java:compileJava
Note: Some input files use or override a deprecated API.
Note: Recompile with -Xlint:deprecation for details.
Note: Some input files use unchecked or unsafe operations.
Note: Recompile with -Xlint:unchecked for details.
> Task :sdks:java:testing:test-utils:compileTestJava
> Task :sdks:java:testing:test-utils:testClasses
> Task :runners:core-construction-java:classes
> Task :sdks:java:testing:test-utils:testJar
> Task :runners:core-construction-java:jar
> Task :sdks:java:io:mongodb:compileTestJava
Note: <https://ci-beam.apache.org/job/beam_PostCommit_SQL/ws/src/sdks/java/io/mongodb/src/test/java/org/apache/beam/sdk/io/mongodb/MongoDBGridFSIOTest.java> uses or overrides a deprecated API.
Note: Recompile with -Xlint:deprecation for details.
> Task :sdks:java:io:mongodb:testClasses
> Task :sdks:java:io:mongodb:testJar
> Task :runners:core-java:compileJava
Note: Some input files use or override a deprecated API.
Note: Recompile with -Xlint:deprecation for details.
Note: Some input files use unchecked or unsafe operations.
Note: Recompile with -Xlint:unchecked for details.
> Task :runners:core-java:classes
> Task :runners:core-java:jar
> Task :sdks:java:harness:compileJava
Note: Some input files use or override a deprecated API.
Note: Recompile with -Xlint:deprecation for details.
Note: Some input files use unchecked or unsafe operations.
Note: Recompile with -Xlint:unchecked for details.
> Task :sdks:java:harness:classes
> Task :sdks:java:harness:jar
> Task :sdks:java:core:compileTestJava
Note: Some input files use or override a deprecated API.
Note: Recompile with -Xlint:deprecation for details.
Note: Some input files use unchecked or unsafe operations.
Note: Recompile with -Xlint:unchecked for details.
> Task :sdks:java:core:testClasses
> Task :sdks:java:core:shadowTestJar
> Task :sdks:java:extensions:google-cloud-platform-core:compileTestJava
Note: Some input files use or override a deprecated API.
Note: Recompile with -Xlint:deprecation for details.
> Task :sdks:java:extensions:google-cloud-platform-core:testClasses
> Task :sdks:java:extensions:google-cloud-platform-core:testJar
> Task :sdks:java:harness:shadowJar
> Task :runners:java-fn-execution:compileJava
Note: Some input files use or override a deprecated API.
Note: Recompile with -Xlint:deprecation for details.
Note: Some input files use unchecked or unsafe operations.
Note: Recompile with -Xlint:unchecked for details.
> Task :runners:java-fn-execution:classes
> Task :runners:java-fn-execution:jar
> Task :runners:direct-java:compileJava
Note: Some input files use or override a deprecated API.
Note: Recompile with -Xlint:deprecation for details.
Note: Some input files use unchecked or unsafe operations.
Note: Recompile with -Xlint:unchecked for details.
> Task :runners:direct-java:classes
> Task :runners:direct-java:shadowJar
> Task :sdks:java:expansion-service:compileJava
Note: <https://ci-beam.apache.org/job/beam_PostCommit_SQL/ws/src/sdks/java/expansion-service/src/main/java/org/apache/beam/sdk/expansion/service/ExpansionService.java> uses unchecked or unsafe operations.
Note: Recompile with -Xlint:unchecked for details.
> Task :sdks:java:expansion-service:classes
> Task :sdks:java:expansion-service:jar
> Task :sdks:java:io:kafka:compileJava
Note: <https://ci-beam.apache.org/job/beam_PostCommit_SQL/ws/src/sdks/java/io/kafka/src/main/java/org/apache/beam/sdk/io/kafka/KafkaIO.java> uses or overrides a deprecated API.
Note: Recompile with -Xlint:deprecation for details.
Note: Some input files use unchecked or unsafe operations.
Note: Recompile with -Xlint:unchecked for details.
> Task :sdks:java:io:kafka:classes
> Task :sdks:java:io:kafka:jar
> Task :sdks:java:io:google-cloud-platform:compileJava
Note: Some input files use or override a deprecated API.
Note: Recompile with -Xlint:deprecation for details.
Note: Some input files use unchecked or unsafe operations.
Note: Recompile with -Xlint:unchecked for details.
> Task :sdks:java:io:google-cloud-platform:classes
> Task :sdks:java:io:google-cloud-platform:jar
> Task :sdks:java:extensions:sql:compileJava
> Task :sdks:java:io:google-cloud-platform:compileTestJava
Note: Some input files use or override a deprecated API.
Note: Recompile with -Xlint:deprecation for details.
Note: Some input files use unchecked or unsafe operations.
Note: Recompile with -Xlint:unchecked for details.
> Task :sdks:java:io:google-cloud-platform:testClasses
> Task :sdks:java:extensions:sql:compileJava
Note: Some input files use or override a deprecated API.
Note: Recompile with -Xlint:deprecation for details.
Note: Some input files use unchecked or unsafe operations.
Note: Recompile with -Xlint:unchecked for details.
> Task :sdks:java:extensions:sql:classes
> Task :sdks:java:io:google-cloud-platform:testJar
> Task :sdks:java:extensions:sql:compileTestJava
Note: Some input files use or override a deprecated API.
Note: Recompile with -Xlint:deprecation for details.
Note: Some input files use unchecked or unsafe operations.
Note: Recompile with -Xlint:unchecked for details.
> Task :sdks:java:extensions:sql:testClasses
> Task :sdks:java:extensions:sql:integrationTest
org.apache.beam.sdk.extensions.sql.meta.provider.pubsub.PubsubJsonIT > testSQLInsertJsonRowsToPubsubFlat FAILED
io.grpc.StatusRuntimeException
org.apache.beam.sdk.extensions.sql.meta.provider.pubsub.PubsubJsonIT > testSQLSelectsPayloadContentFlat FAILED
io.grpc.StatusRuntimeException
org.apache.beam.sdk.extensions.sql.meta.provider.pubsub.PubsubJsonIT > testSQLSelectsPayloadContent FAILED
io.grpc.StatusRuntimeException
org.apache.beam.sdk.extensions.sql.meta.provider.pubsub.PubsubJsonIT > testSQLReadAndWriteWithSameFlatTableDefinition FAILED
io.grpc.StatusRuntimeException
org.apache.beam.sdk.extensions.sql.meta.provider.pubsub.PubsubJsonIT > testSQLInsertJsonRowsToPubsubWithTimestampAttributeFlat FAILED
io.grpc.StatusRuntimeException
org.apache.beam.sdk.extensions.sql.meta.provider.pubsub.PubsubJsonIT > testWritesJsonRowsToPubsub FAILED
io.grpc.StatusRuntimeException
org.apache.beam.sdk.extensions.sql.PubsubToBigqueryIT > testSimpleInsert FAILED
io.grpc.StatusRuntimeException
org.apache.beam.sdk.extensions.sql.PubsubToBigqueryIT > testSimpleInsertFlat FAILED
io.grpc.StatusRuntimeException
35 tests completed, 8 failed, 4 skipped
> Task :sdks:java:extensions:sql:integrationTest FAILED
> Task :sdks:java:extensions:sql:jar
> Task :sdks:java:extensions:sql:zetasql:compileJava FROM-CACHE
> Task :sdks:java:extensions:sql:zetasql:classes UP-TO-DATE
> Task :sdks:java:extensions:sql:zetasql:jar
> Task :sdks:java:extensions:sql:jdbc:compileJava
> Task :sdks:java:extensions:sql:jdbc:classes
> Task :sdks:java:extensions:sql:jdbc:compileTestJava
Note: Some input files use or override a deprecated API.
Note: Recompile with -Xlint:deprecation for details.
Note: Some input files use unchecked or unsafe operations.
Note: Recompile with -Xlint:unchecked for details.
> Task :sdks:java:extensions:sql:jdbc:testClasses
> Task :sdks:java:extensions:sql:jdbc:endToEndTest
> Task :sdks:java:extensions:sql:jdbc:postCommit
> Task :sdks:java:extensions:sql:datacatalog:compileJava
> Task :sdks:java:extensions:sql:datacatalog:classes
> Task :sdks:java:extensions:sql:datacatalog:compileTestJava
> Task :sdks:java:extensions:sql:datacatalog:testClasses
> Task :sdks:java:extensions:sql:datacatalog:integrationTest
> Task :sdks:java:extensions:sql:datacatalog:postCommit
FAILURE: Build failed with an exception.
* What went wrong:
Execution failed for task ':sdks:java:extensions:sql:integrationTest'.
> There were failing tests. See the report at: file://<https://ci-beam.apache.org/job/beam_PostCommit_SQL/ws/src/sdks/java/extensions/sql/build/reports/tests/integrationTest/index.html>
* Try:
Run with --stacktrace option to get the stack trace. Run with --info or --debug option to get more log output. Run with --scan to get full insights.
* Get more help at https://help.gradle.org
Deprecated Gradle features were used in this build, making it incompatible with Gradle 6.0.
Use '--warning-mode all' to show the individual deprecation warnings.
See https://docs.gradle.org/5.2.1/userguide/command_line_interface.html#sec:command_line_warnings
BUILD FAILED in 11m 12s
101 actionable tasks: 96 executed, 5 from cache
Publishing build scan...
https://gradle.com/s/2xrrw2jbb4ung
Build step 'Invoke Gradle script' changed build result to FAILURE
Build step 'Invoke Gradle script' marked build as failure
---------------------------------------------------------------------
To unsubscribe, e-mail: builds-unsubscribe@beam.apache.org
For additional commands, e-mail: builds-help@beam.apache.org
Build failed in Jenkins: beam_PostCommit_SQL #5199
Posted by Apache Jenkins Server <je...@builds.apache.org>.
See <https://ci-beam.apache.org/job/beam_PostCommit_SQL/5199/display/redirect>
Changes:
------------------------------------------
[...truncated 3.49 KB...]
> Task :buildSrc:assemble
> Task :buildSrc:spotlessGroovy
> Task :buildSrc:spotlessGroovyCheck
> Task :buildSrc:spotlessGroovyGradle
> Task :buildSrc:spotlessGroovyGradleCheck
> Task :buildSrc:spotlessCheck
> Task :buildSrc:pluginUnderTestMetadata
> Task :buildSrc:compileTestJava NO-SOURCE
> Task :buildSrc:compileTestGroovy NO-SOURCE
> Task :buildSrc:processTestResources NO-SOURCE
> Task :buildSrc:testClasses UP-TO-DATE
> Task :buildSrc:test NO-SOURCE
> Task :buildSrc:validateTaskProperties FROM-CACHE
> Task :buildSrc:check
> Task :buildSrc:build
Configuration on demand is an incubating feature.
> Task :sdks:java:harness:processResources NO-SOURCE
> Task :runners:core-construction-java:processResources NO-SOURCE
> Task :runners:local-java:processResources NO-SOURCE
> Task :sdks:java:extensions:google-cloud-platform-core:processResources NO-SOURCE
> Task :sdks:java:fn-execution:processResources NO-SOURCE
> Task :runners:java-fn-execution:processResources NO-SOURCE
> Task :sdks:java:core:generateAvroProtocol NO-SOURCE
> Task :runners:core-java:processResources NO-SOURCE
> Task :vendor:sdks-java-extensions-protobuf:processResources NO-SOURCE
> Task :runners:direct-java:processResources NO-SOURCE
> Task :sdks:java:core:generateAvroJava NO-SOURCE
> Task :sdks:java:io:hadoop-common:processResources NO-SOURCE
> Task :sdks:java:io:google-cloud-platform:processResources NO-SOURCE
> Task :sdks:java:io:mongodb:processResources NO-SOURCE
> Task :sdks:java:io:kafka:processResources NO-SOURCE
> Task :model:job-management:extractProto
> Task :model:fn-execution:extractProto
> Task :sdks:java:extensions:protobuf:extractProto
> Task :sdks:java:extensions:join-library:createCheckerFrameworkManifest
> Task :sdks:java:expansion-service:createCheckerFrameworkManifest
> Task :sdks:java:io:mongodb:processTestResources NO-SOURCE
> Task :sdks:java:testing:test-utils:processResources NO-SOURCE
> Task :sdks:java:extensions:protobuf:processResources NO-SOURCE
> Task :sdks:java:io:common:compileJava NO-SOURCE
> Task :sdks:java:expansion-service:processResources NO-SOURCE
> Task :sdks:java:extensions:join-library:processResources NO-SOURCE
> Task :sdks:java:io:parquet:processResources NO-SOURCE
> Task :sdks:java:extensions:sql:datacatalog:createCheckerFrameworkManifest
> Task :sdks:java:extensions:google-cloud-platform-core:processTestResources NO-SOURCE
> Task :sdks:java:extensions:sql:datacatalog:processResources NO-SOURCE
> Task :sdks:java:testing:test-utils:processTestResources NO-SOURCE
> Task :sdks:java:io:common:processResources NO-SOURCE
> Task :sdks:java:io:common:classes UP-TO-DATE
> Task :sdks:java:extensions:sql:datacatalog:processTestResources NO-SOURCE
> Task :model:job-management:processResources
> Task :sdks:java:extensions:sql:zetasql:processResources NO-SOURCE
> Task :model:fn-execution:processResources
> Task :sdks:java:core:generateGrammarSource FROM-CACHE
> Task :sdks:java:io:common:jar
> Task :sdks:java:io:common:processTestResources NO-SOURCE
> Task :sdks:java:core:processResources
> Task :sdks:java:core:generateTestAvroProtocol NO-SOURCE
> Task :sdks:java:extensions:sql:jdbc:processResources
> Task :sdks:java:extensions:sql:jdbc:processTestResources NO-SOURCE
> Task :sdks:java:io:google-cloud-platform:processTestResources
> Task :sdks:java:core:generateTestAvroJava
> Task :sdks:java:core:generateTestGrammarSource NO-SOURCE
> Task :sdks:java:core:processTestResources
> Task :sdks:java:extensions:sql:copyFmppTemplatesFromCalciteCore
> Task :sdks:java:extensions:sql:copyFmppTemplatesFromSrc
> Task :model:pipeline:extractIncludeProto
> Task :model:pipeline:extractProto
> Task :model:pipeline:generateProto
> Task :sdks:java:extensions:sql:generateFmppSources
> Task :model:pipeline:compileJava FROM-CACHE
> Task :model:pipeline:processResources
> Task :model:pipeline:classes
> Task :model:pipeline:jar
> Task :model:job-management:extractIncludeProto
> Task :model:fn-execution:extractIncludeProto
> Task :sdks:java:extensions:sql:compileJavacc
Java Compiler Compiler Version 4.0 (Parser Generator)
(type "javacc" with no arguments for help)
Reading from file <https://ci-beam.apache.org/job/beam_PostCommit_SQL/ws/src/sdks/java/extensions/sql/build/generated/fmpp/javacc/Parser.jj> . . .
Note: UNICODE_INPUT option is specified. Please make sure you create the parser/lexer using a Reader with the correct character encoding.
Warning: Lookahead adequacy checking not being performed since option LOOKAHEAD is more than 1. Set option FORCE_LA_CHECK to true to force checking.
File "TokenMgrError.java" does not exist. Will create one.
File "ParseException.java" does not exist. Will create one.
File "Token.java" does not exist. Will create one.
File "SimpleCharStream.java" does not exist. Will create one.
Parser generated with 0 errors and 1 warnings.
> Task :model:job-management:generateProto
> Task :model:fn-execution:generateProto
> Task :model:job-management:compileJava FROM-CACHE
> Task :model:job-management:classes
> Task :model:fn-execution:compileJava FROM-CACHE
> Task :model:fn-execution:classes
> Task :sdks:java:extensions:sql:processResources
> Task :sdks:java:extensions:sql:processTestResources
> Task :model:pipeline:shadowJar
> Task :model:job-management:shadowJar
> Task :model:fn-execution:shadowJar
> Task :sdks:java:core:compileJava FROM-CACHE
> Task :sdks:java:core:classes
> Task :sdks:java:core:shadowJar
> Task :sdks:java:extensions:join-library:compileJava FROM-CACHE
> Task :sdks:java:extensions:join-library:classes UP-TO-DATE
> Task :sdks:java:extensions:join-library:jar
> Task :runners:local-java:compileJava FROM-CACHE
> Task :runners:local-java:classes UP-TO-DATE
> Task :runners:local-java:jar
> Task :sdks:java:extensions:google-cloud-platform-core:compileJava FROM-CACHE
> Task :sdks:java:extensions:google-cloud-platform-core:classes UP-TO-DATE
> Task :sdks:java:io:mongodb:compileJava FROM-CACHE
> Task :sdks:java:io:mongodb:classes UP-TO-DATE
> Task :sdks:java:extensions:google-cloud-platform-core:jar
> Task :vendor:sdks-java-extensions-protobuf:compileJava FROM-CACHE
> Task :vendor:sdks-java-extensions-protobuf:classes UP-TO-DATE
> Task :sdks:java:io:mongodb:jar
> Task :sdks:java:fn-execution:compileJava FROM-CACHE
> Task :sdks:java:fn-execution:classes UP-TO-DATE
> Task :sdks:java:io:hadoop-common:compileJava FROM-CACHE
> Task :sdks:java:io:hadoop-common:classes UP-TO-DATE
> Task :sdks:java:fn-execution:jar
> Task :sdks:java:io:common:compileTestJava FROM-CACHE
> Task :runners:core-construction-java:compileJava FROM-CACHE
> Task :sdks:java:io:common:testClasses UP-TO-DATE
> Task :runners:core-construction-java:classes UP-TO-DATE
> Task :sdks:java:testing:test-utils:compileJava FROM-CACHE
> Task :sdks:java:testing:test-utils:classes UP-TO-DATE
> Task :sdks:java:io:hadoop-common:jar
> Task :sdks:java:io:common:testJar
> Task :sdks:java:testing:test-utils:jar
> Task :sdks:java:extensions:protobuf:extractIncludeProto
> Task :sdks:java:extensions:protobuf:generateProto NO-SOURCE
> Task :vendor:sdks-java-extensions-protobuf:shadowJar
> Task :sdks:java:testing:test-utils:compileTestJava FROM-CACHE
> Task :sdks:java:testing:test-utils:testClasses UP-TO-DATE
> Task :sdks:java:extensions:protobuf:compileJava FROM-CACHE
> Task :sdks:java:extensions:protobuf:classes UP-TO-DATE
> Task :sdks:java:testing:test-utils:testJar
> Task :sdks:java:io:parquet:compileJava FROM-CACHE
> Task :sdks:java:io:parquet:classes UP-TO-DATE
> Task :sdks:java:io:parquet:jar
> Task :sdks:java:extensions:protobuf:jar
> Task :sdks:java:io:mongodb:compileTestJava FROM-CACHE
> Task :sdks:java:io:mongodb:testClasses UP-TO-DATE
> Task :sdks:java:io:mongodb:testJar
> Task :runners:core-construction-java:jar
> Task :runners:core-java:compileJava FROM-CACHE
> Task :runners:core-java:classes UP-TO-DATE
> Task :sdks:java:core:jar
> Task :runners:core-java:jar
> Task :sdks:java:harness:compileJava FROM-CACHE
> Task :sdks:java:harness:classes UP-TO-DATE
> Task :sdks:java:harness:jar
> Task :sdks:java:core:compileTestJava FROM-CACHE
> Task :sdks:java:core:testClasses
> Task :sdks:java:core:shadowTestJar
> Task :sdks:java:extensions:google-cloud-platform-core:compileTestJava FROM-CACHE
> Task :sdks:java:extensions:google-cloud-platform-core:testClasses UP-TO-DATE
> Task :sdks:java:extensions:google-cloud-platform-core:testJar
> Task :sdks:java:harness:shadowJar
> Task :runners:java-fn-execution:compileJava FROM-CACHE
> Task :runners:java-fn-execution:classes UP-TO-DATE
> Task :runners:java-fn-execution:jar
> Task :sdks:java:expansion-service:compileJava FROM-CACHE
> Task :sdks:java:expansion-service:classes UP-TO-DATE
> Task :sdks:java:expansion-service:jar
> Task :runners:direct-java:compileJava FROM-CACHE
> Task :runners:direct-java:classes UP-TO-DATE
> Task :sdks:java:io:kafka:compileJava FROM-CACHE
> Task :sdks:java:io:kafka:classes UP-TO-DATE
> Task :sdks:java:io:kafka:jar
> Task :sdks:java:io:google-cloud-platform:compileJava FROM-CACHE
> Task :sdks:java:io:google-cloud-platform:classes UP-TO-DATE
> Task :sdks:java:io:google-cloud-platform:jar
> Task :runners:direct-java:shadowJar
> Task :sdks:java:io:google-cloud-platform:compileTestJava FROM-CACHE
> Task :sdks:java:io:google-cloud-platform:testClasses
> Task :sdks:java:io:google-cloud-platform:testJar
> Task :sdks:java:extensions:sql:compileJava FROM-CACHE
> Task :sdks:java:extensions:sql:classes
> Task :sdks:java:extensions:sql:compileTestJava FROM-CACHE
> Task :sdks:java:extensions:sql:testClasses
> Task :sdks:java:extensions:sql:integrationTest
org.apache.beam.sdk.extensions.sql.meta.provider.pubsub.PubsubJsonIT > testSQLSelectsPayloadContentFlat FAILED
io.grpc.StatusRuntimeException at PubsubJsonIT.java:403
org.apache.beam.sdk.extensions.sql.meta.provider.pubsub.PubsubJsonIT > testSQLSelectsPayloadContent FAILED
io.grpc.StatusRuntimeException
org.apache.beam.sdk.extensions.sql.meta.provider.pubsub.PubsubJsonIT > testSQLReadAndWriteWithSameFlatTableDefinition FAILED
io.grpc.StatusRuntimeException
org.apache.beam.sdk.extensions.sql.meta.provider.pubsub.PubsubJsonIT > testSQLInsertJsonRowsToPubsubWithTimestampAttributeFlat FAILED
io.grpc.StatusRuntimeException
org.apache.beam.sdk.extensions.sql.meta.provider.pubsub.PubsubJsonIT > testWritesJsonRowsToPubsub FAILED
io.grpc.StatusRuntimeException
org.apache.beam.sdk.extensions.sql.PubsubToBigqueryIT > testSimpleInsert FAILED
io.grpc.StatusRuntimeException
org.apache.beam.sdk.extensions.sql.PubsubToBigqueryIT > testSimpleInsertFlat FAILED
io.grpc.StatusRuntimeException
35 tests completed, 7 failed, 4 skipped
> Task :sdks:java:extensions:sql:integrationTest FAILED
> Task :sdks:java:extensions:sql:jar
> Task :sdks:java:extensions:sql:jdbc:compileJava FROM-CACHE
> Task :sdks:java:extensions:sql:jdbc:classes
> Task :sdks:java:extensions:sql:datacatalog:compileJava FROM-CACHE
> Task :sdks:java:extensions:sql:datacatalog:classes UP-TO-DATE
> Task :sdks:java:extensions:sql:zetasql:compileJava FROM-CACHE
> Task :sdks:java:extensions:sql:zetasql:classes UP-TO-DATE
> Task :sdks:java:extensions:sql:zetasql:jar
> Task :sdks:java:extensions:sql:datacatalog:compileTestJava FROM-CACHE
> Task :sdks:java:extensions:sql:datacatalog:testClasses UP-TO-DATE
> Task :sdks:java:extensions:sql:jdbc:compileTestJava FROM-CACHE
> Task :sdks:java:extensions:sql:jdbc:testClasses UP-TO-DATE
> Task :sdks:java:extensions:sql:jdbc:endToEndTest
> Task :sdks:java:extensions:sql:jdbc:postCommit
> Task :sdks:java:extensions:sql:datacatalog:integrationTest
> Task :sdks:java:extensions:sql:datacatalog:postCommit
FAILURE: Build failed with an exception.
* What went wrong:
Execution failed for task ':sdks:java:extensions:sql:integrationTest'.
> There were failing tests. See the report at: file://<https://ci-beam.apache.org/job/beam_PostCommit_SQL/ws/src/sdks/java/extensions/sql/build/reports/tests/integrationTest/index.html>
* Try:
Run with --stacktrace option to get the stack trace. Run with --info or --debug option to get more log output. Run with --scan to get full insights.
* Get more help at https://help.gradle.org
Deprecated Gradle features were used in this build, making it incompatible with Gradle 6.0.
Use '--warning-mode all' to show the individual deprecation warnings.
See https://docs.gradle.org/5.2.1/userguide/command_line_interface.html#sec:command_line_warnings
BUILD FAILED in 3m 34s
101 actionable tasks: 65 executed, 36 from cache
Publishing build scan...
https://gradle.com/s/7bog5wied4zsm
Build step 'Invoke Gradle script' changed build result to FAILURE
Build step 'Invoke Gradle script' marked build as failure
---------------------------------------------------------------------
To unsubscribe, e-mail: builds-unsubscribe@beam.apache.org
For additional commands, e-mail: builds-help@beam.apache.org
Build failed in Jenkins: beam_PostCommit_SQL #5198
Posted by Apache Jenkins Server <je...@builds.apache.org>.
See <https://ci-beam.apache.org/job/beam_PostCommit_SQL/5198/display/redirect?page=changes>
Changes:
[neville.lyh] [BEAM-10612] Add flink 1.11 runner
[Luke Cwik] [BEAM-8025] Update tests to use TemporaryFolder instead of rolling their
------------------------------------------
[...truncated 4.82 KB...]
> Task :buildSrc:pluginUnderTestMetadata
> Task :buildSrc:compileTestJava NO-SOURCE
> Task :buildSrc:compileTestGroovy NO-SOURCE
> Task :buildSrc:processTestResources NO-SOURCE
> Task :buildSrc:testClasses UP-TO-DATE
> Task :buildSrc:test NO-SOURCE
> Task :buildSrc:validateTaskProperties FROM-CACHE
> Task :buildSrc:check
> Task :buildSrc:build
Configuration on demand is an incubating feature.
> Task :sdks:java:core:generateAvroProtocol NO-SOURCE
> Task :runners:core-java:processResources NO-SOURCE
> Task :vendor:sdks-java-extensions-protobuf:processResources NO-SOURCE
> Task :runners:local-java:processResources NO-SOURCE
> Task :sdks:java:extensions:google-cloud-platform-core:processResources NO-SOURCE
> Task :sdks:java:harness:processResources NO-SOURCE
> Task :runners:core-construction-java:processResources NO-SOURCE
> Task :runners:java-fn-execution:processResources NO-SOURCE
> Task :sdks:java:fn-execution:processResources NO-SOURCE
> Task :sdks:java:core:generateAvroJava NO-SOURCE
> Task :runners:direct-java:processResources NO-SOURCE
> Task :model:fn-execution:extractProto
> Task :sdks:java:io:google-cloud-platform:processResources NO-SOURCE
> Task :model:job-management:extractProto
> Task :sdks:java:io:hadoop-common:processResources NO-SOURCE
> Task :sdks:java:io:parquet:processResources NO-SOURCE
> Task :sdks:java:extensions:join-library:createCheckerFrameworkManifest
> Task :sdks:java:io:kafka:processResources NO-SOURCE
> Task :sdks:java:extensions:protobuf:extractProto
> Task :sdks:java:io:mongodb:processResources NO-SOURCE
> Task :sdks:java:io:common:compileJava NO-SOURCE
> Task :sdks:java:testing:test-utils:processResources NO-SOURCE
> Task :sdks:java:expansion-service:createCheckerFrameworkManifest
> Task :sdks:java:io:common:processResources NO-SOURCE
> Task :sdks:java:io:common:classes UP-TO-DATE
> Task :sdks:java:testing:test-utils:processTestResources NO-SOURCE
> Task :sdks:java:expansion-service:processResources NO-SOURCE
> Task :sdks:java:extensions:join-library:processResources NO-SOURCE
> Task :model:job-management:processResources
> Task :sdks:java:io:mongodb:processTestResources NO-SOURCE
> Task :sdks:java:extensions:google-cloud-platform-core:processTestResources NO-SOURCE
> Task :sdks:java:extensions:sql:zetasql:processResources NO-SOURCE
> Task :model:fn-execution:processResources
> Task :sdks:java:extensions:sql:datacatalog:createCheckerFrameworkManifest
> Task :sdks:java:extensions:protobuf:processResources NO-SOURCE
> Task :sdks:java:extensions:sql:datacatalog:processResources NO-SOURCE
> Task :sdks:java:extensions:sql:datacatalog:processTestResources NO-SOURCE
> Task :sdks:java:io:common:jar
> Task :sdks:java:io:common:processTestResources NO-SOURCE
> Task :sdks:java:extensions:sql:jdbc:processResources
> Task :sdks:java:extensions:sql:jdbc:processTestResources NO-SOURCE
> Task :sdks:java:core:generateGrammarSource FROM-CACHE
> Task :sdks:java:core:processResources
> Task :sdks:java:core:generateTestAvroProtocol NO-SOURCE
> Task :sdks:java:io:google-cloud-platform:processTestResources
> Task :sdks:java:extensions:sql:copyFmppTemplatesFromCalciteCore
> Task :sdks:java:extensions:sql:copyFmppTemplatesFromSrc
> Task :model:pipeline:extractIncludeProto
> Task :model:pipeline:extractProto
> Task :sdks:java:core:generateTestAvroJava
> Task :sdks:java:core:generateTestGrammarSource NO-SOURCE
> Task :sdks:java:core:processTestResources
> Task :model:pipeline:generateProto
> Task :model:pipeline:compileJava FROM-CACHE
> Task :model:pipeline:processResources
> Task :model:pipeline:classes
> Task :model:pipeline:jar
> Task :sdks:java:extensions:sql:generateFmppSources
> Task :model:fn-execution:extractIncludeProto
> Task :model:job-management:extractIncludeProto
> Task :model:job-management:generateProto
> Task :model:fn-execution:generateProto
> Task :sdks:java:extensions:sql:compileJavacc
Java Compiler Compiler Version 4.0 (Parser Generator)
(type "javacc" with no arguments for help)
Reading from file <https://ci-beam.apache.org/job/beam_PostCommit_SQL/ws/src/sdks/java/extensions/sql/build/generated/fmpp/javacc/Parser.jj> . . .
Note: UNICODE_INPUT option is specified. Please make sure you create the parser/lexer using a Reader with the correct character encoding.
Warning: Lookahead adequacy checking not being performed since option LOOKAHEAD is more than 1. Set option FORCE_LA_CHECK to true to force checking.
> Task :model:job-management:compileJava FROM-CACHE
> Task :model:job-management:classes
> Task :model:fn-execution:compileJava FROM-CACHE
> Task :model:fn-execution:classes
> Task :sdks:java:extensions:sql:compileJavacc
File "TokenMgrError.java" does not exist. Will create one.
File "ParseException.java" does not exist. Will create one.
File "Token.java" does not exist. Will create one.
File "SimpleCharStream.java" does not exist. Will create one.
Parser generated with 0 errors and 1 warnings.
> Task :sdks:java:extensions:sql:processResources
> Task :sdks:java:extensions:sql:processTestResources
> Task :model:pipeline:shadowJar
> Task :model:job-management:shadowJar
> Task :model:fn-execution:shadowJar
> Task :sdks:java:core:compileJava FROM-CACHE
> Task :sdks:java:core:classes
> Task :sdks:java:core:shadowJar
> Task :sdks:java:io:mongodb:compileJava FROM-CACHE
> Task :sdks:java:io:mongodb:classes UP-TO-DATE
> Task :sdks:java:io:common:compileTestJava FROM-CACHE
> Task :sdks:java:io:common:testClasses UP-TO-DATE
> Task :sdks:java:extensions:join-library:compileJava FROM-CACHE
> Task :sdks:java:extensions:join-library:classes UP-TO-DATE
> Task :runners:local-java:compileJava FROM-CACHE
> Task :runners:local-java:classes UP-TO-DATE
> Task :sdks:java:io:mongodb:jar
> Task :sdks:java:io:common:testJar
> Task :sdks:java:extensions:join-library:jar
> Task :runners:local-java:jar
> Task :sdks:java:io:hadoop-common:compileJava FROM-CACHE
> Task :sdks:java:io:hadoop-common:classes UP-TO-DATE
> Task :sdks:java:io:hadoop-common:jar
> Task :sdks:java:extensions:protobuf:extractIncludeProto
> Task :sdks:java:extensions:protobuf:generateProto NO-SOURCE
> Task :sdks:java:extensions:protobuf:compileJava FROM-CACHE
> Task :sdks:java:extensions:protobuf:classes UP-TO-DATE
> Task :vendor:sdks-java-extensions-protobuf:compileJava FROM-CACHE
> Task :vendor:sdks-java-extensions-protobuf:classes UP-TO-DATE
> Task :runners:core-construction-java:compileJava FROM-CACHE
> Task :runners:core-construction-java:classes UP-TO-DATE
> Task :sdks:java:fn-execution:compileJava FROM-CACHE
> Task :sdks:java:io:parquet:compileJava FROM-CACHE
> Task :sdks:java:fn-execution:classes UP-TO-DATE
> Task :sdks:java:io:parquet:classes UP-TO-DATE
> Task :sdks:java:extensions:protobuf:jar
> Task :sdks:java:io:parquet:jar
> Task :sdks:java:fn-execution:jar
> Task :sdks:java:extensions:google-cloud-platform-core:compileJava FROM-CACHE
> Task :sdks:java:extensions:google-cloud-platform-core:classes UP-TO-DATE
> Task :sdks:java:extensions:google-cloud-platform-core:jar
> Task :vendor:sdks-java-extensions-protobuf:shadowJar
> Task :runners:core-construction-java:jar
> Task :sdks:java:testing:test-utils:compileJava FROM-CACHE
> Task :sdks:java:testing:test-utils:classes UP-TO-DATE
> Task :sdks:java:testing:test-utils:jar
> Task :sdks:java:testing:test-utils:compileTestJava FROM-CACHE
> Task :sdks:java:testing:test-utils:testClasses UP-TO-DATE
> Task :sdks:java:testing:test-utils:testJar
> Task :runners:core-java:compileJava FROM-CACHE
> Task :runners:core-java:classes UP-TO-DATE
> Task :sdks:java:io:mongodb:compileTestJava FROM-CACHE
> Task :sdks:java:io:mongodb:testClasses UP-TO-DATE
> Task :sdks:java:io:mongodb:testJar
> Task :sdks:java:core:jar
> Task :runners:core-java:jar
> Task :sdks:java:harness:compileJava FROM-CACHE
> Task :sdks:java:harness:classes UP-TO-DATE
> Task :sdks:java:harness:jar
> Task :sdks:java:core:compileTestJava FROM-CACHE
> Task :sdks:java:core:testClasses
> Task :sdks:java:core:shadowTestJar
> Task :sdks:java:extensions:google-cloud-platform-core:compileTestJava FROM-CACHE
> Task :sdks:java:extensions:google-cloud-platform-core:testClasses UP-TO-DATE
> Task :sdks:java:extensions:google-cloud-platform-core:testJar
> Task :sdks:java:harness:shadowJar
> Task :runners:java-fn-execution:compileJava FROM-CACHE
> Task :runners:java-fn-execution:classes UP-TO-DATE
> Task :runners:java-fn-execution:jar
> Task :sdks:java:expansion-service:compileJava FROM-CACHE
> Task :sdks:java:expansion-service:classes UP-TO-DATE
> Task :sdks:java:expansion-service:jar
> Task :runners:direct-java:compileJava FROM-CACHE
> Task :runners:direct-java:classes UP-TO-DATE
> Task :sdks:java:io:kafka:compileJava FROM-CACHE
> Task :sdks:java:io:kafka:classes UP-TO-DATE
> Task :sdks:java:io:kafka:jar
> Task :sdks:java:io:google-cloud-platform:compileJava FROM-CACHE
> Task :sdks:java:io:google-cloud-platform:classes UP-TO-DATE
> Task :sdks:java:io:google-cloud-platform:jar
> Task :runners:direct-java:shadowJar
> Task :sdks:java:io:google-cloud-platform:compileTestJava FROM-CACHE
> Task :sdks:java:io:google-cloud-platform:testClasses
> Task :sdks:java:io:google-cloud-platform:testJar
> Task :sdks:java:extensions:sql:compileJava FROM-CACHE
> Task :sdks:java:extensions:sql:classes
> Task :sdks:java:extensions:sql:compileTestJava FROM-CACHE
> Task :sdks:java:extensions:sql:testClasses
> Task :sdks:java:extensions:sql:integrationTest
org.apache.beam.sdk.extensions.sql.meta.provider.pubsub.PubsubJsonIT > testSQLInsertJsonRowsToPubsubFlat FAILED
io.grpc.StatusRuntimeException
org.apache.beam.sdk.extensions.sql.meta.provider.pubsub.PubsubJsonIT > testSQLSelectsPayloadContentFlat FAILED
io.grpc.StatusRuntimeException
org.apache.beam.sdk.extensions.sql.meta.provider.pubsub.PubsubJsonIT > testSQLSelectsPayloadContent FAILED
io.grpc.StatusRuntimeException
org.apache.beam.sdk.extensions.sql.meta.provider.pubsub.PubsubJsonIT > testSQLReadAndWriteWithSameFlatTableDefinition FAILED
io.grpc.StatusRuntimeException
org.apache.beam.sdk.extensions.sql.meta.provider.pubsub.PubsubJsonIT > testSQLInsertJsonRowsToPubsubWithTimestampAttributeFlat FAILED
io.grpc.StatusRuntimeException
org.apache.beam.sdk.extensions.sql.meta.provider.pubsub.PubsubJsonIT > testWritesJsonRowsToPubsub FAILED
io.grpc.StatusRuntimeException
org.apache.beam.sdk.extensions.sql.PubsubToBigqueryIT > testSimpleInsert FAILED
io.grpc.StatusRuntimeException
org.apache.beam.sdk.extensions.sql.PubsubToBigqueryIT > testSimpleInsertFlat FAILED
io.grpc.StatusRuntimeException
35 tests completed, 8 failed, 4 skipped
> Task :sdks:java:extensions:sql:integrationTest FAILED
> Task :sdks:java:extensions:sql:jar
> Task :sdks:java:extensions:sql:jdbc:compileJava FROM-CACHE
> Task :sdks:java:extensions:sql:jdbc:classes
> Task :sdks:java:extensions:sql:zetasql:compileJava FROM-CACHE
> Task :sdks:java:extensions:sql:zetasql:classes UP-TO-DATE
> Task :sdks:java:extensions:sql:datacatalog:compileJava FROM-CACHE
> Task :sdks:java:extensions:sql:datacatalog:classes UP-TO-DATE
> Task :sdks:java:extensions:sql:zetasql:jar
> Task :sdks:java:extensions:sql:datacatalog:compileTestJava FROM-CACHE
> Task :sdks:java:extensions:sql:datacatalog:testClasses UP-TO-DATE
> Task :sdks:java:extensions:sql:jdbc:compileTestJava FROM-CACHE
> Task :sdks:java:extensions:sql:jdbc:testClasses UP-TO-DATE
> Task :sdks:java:extensions:sql:jdbc:endToEndTest
> Task :sdks:java:extensions:sql:jdbc:postCommit
> Task :sdks:java:extensions:sql:datacatalog:integrationTest
> Task :sdks:java:extensions:sql:datacatalog:postCommit
FAILURE: Build failed with an exception.
* What went wrong:
Execution failed for task ':sdks:java:extensions:sql:integrationTest'.
> There were failing tests. See the report at: file://<https://ci-beam.apache.org/job/beam_PostCommit_SQL/ws/src/sdks/java/extensions/sql/build/reports/tests/integrationTest/index.html>
* Try:
Run with --stacktrace option to get the stack trace. Run with --info or --debug option to get more log output. Run with --scan to get full insights.
* Get more help at https://help.gradle.org
Deprecated Gradle features were used in this build, making it incompatible with Gradle 6.0.
Use '--warning-mode all' to show the individual deprecation warnings.
See https://docs.gradle.org/5.2.1/userguide/command_line_interface.html#sec:command_line_warnings
BUILD FAILED in 3m 20s
101 actionable tasks: 65 executed, 36 from cache
Publishing build scan...
https://gradle.com/s/jvmejjmw2aq6q
Build step 'Invoke Gradle script' changed build result to FAILURE
Build step 'Invoke Gradle script' marked build as failure
---------------------------------------------------------------------
To unsubscribe, e-mail: builds-unsubscribe@beam.apache.org
For additional commands, e-mail: builds-help@beam.apache.org