You are viewing a plain text version of this content. The canonical link for it is here.
Posted to commits@phoenix.apache.org by Apache Jenkins Server <je...@builds.apache.org> on 2018/02/01 19:28:45 UTC
Build failed in Jenkins: Phoenix | 4.x-HBase-0.98 #1805
See <https://builds.apache.org/job/Phoenix-4.x-HBase-0.98/1805/display/redirect?page=changes>
Changes:
[vincentpoon] PHOENIX-4130 Avoid server retries for mutable indexes
[vincentpoon] PHOENIX-4130 Avoid server retries for mutable indexes (Addendum)
------------------------------------------
[...truncated 109.74 KB...]
org.apache.phoenix.execute.CommitException:
org.apache.hadoop.hbase.client.RetriesExhaustedWithDetailsException: Failed 1 action: org.apache.hadoop.hbase.DoNotRetryIOException: Failed 1 action: RegionOpeningException: 1 time, servers with issues: penates.apache.org,42435,1517511046469,
at org.apache.phoenix.util.ServerUtil.createIOException(ServerUtil.java:80)
at org.apache.phoenix.util.ServerUtil.throwIOException(ServerUtil.java:62)
at org.apache.phoenix.index.PhoenixTransactionalIndexer.postBatchMutateIndispensably(PhoenixTransactionalIndexer.java:240)
at org.apache.hadoop.hbase.regionserver.RegionCoprocessorHost$37.call(RegionCoprocessorHost.java:1040)
at org.apache.hadoop.hbase.regionserver.RegionCoprocessorHost$RegionOperation.call(RegionCoprocessorHost.java:1656)
at org.apache.hadoop.hbase.regionserver.RegionCoprocessorHost.execOperation(RegionCoprocessorHost.java:1733)
at org.apache.hadoop.hbase.regionserver.RegionCoprocessorHost.execOperation(RegionCoprocessorHost.java:1688)
at org.apache.hadoop.hbase.regionserver.RegionCoprocessorHost.postBatchMutateIndispensably(RegionCoprocessorHost.java:1036)
at org.apache.hadoop.hbase.regionserver.HRegion.doMiniBatchMutation(HRegion.java:2767)
at org.apache.hadoop.hbase.regionserver.HRegion.batchMutate(HRegion.java:2359)
at org.apache.hadoop.hbase.regionserver.HRegion.batchMutate(HRegion.java:2314)
at org.apache.hadoop.hbase.regionserver.HRegion.batchMutate(HRegion.java:2318)
at org.apache.hadoop.hbase.regionserver.HRegionServer.doBatchOp(HRegionServer.java:4678)
at org.apache.hadoop.hbase.regionserver.HRegionServer.doNonAtomicRegionMutation(HRegionServer.java:3835)
at org.apache.hadoop.hbase.regionserver.HRegionServer.multi(HRegionServer.java:3680)
at org.apache.hadoop.hbase.protobuf.generated.ClientProtos$ClientService$2.callBlockingMethod(ClientProtos.java:32500)
at org.apache.hadoop.hbase.ipc.RpcServer.call(RpcServer.java:2195)
at org.apache.hadoop.hbase.ipc.CallRunner.run(CallRunner.java:104)
at org.apache.hadoop.hbase.ipc.RpcExecutor.consumerLoop(RpcExecutor.java:133)
at org.apache.hadoop.hbase.ipc.RpcExecutor$1.run(RpcExecutor.java:108)
at java.lang.Thread.run(Thread.java:745)
Caused by: org.apache.hadoop.hbase.client.RetriesExhaustedWithDetailsException: Failed 1 action: RegionOpeningException: 1 time, servers with issues: penates.apache.org,42435,1517511046469,
at org.apache.hadoop.hbase.client.AsyncProcess$BatchErrors.makeException(AsyncProcess.java:211)
at org.apache.hadoop.hbase.client.AsyncProcess$BatchErrors.access$500(AsyncProcess.java:195)
at org.apache.hadoop.hbase.client.AsyncProcess.getErrors(AsyncProcess.java:1082)
at org.apache.hadoop.hbase.client.HConnectionManager$HConnectionImplementation.processBatchCallback(HConnectionManager.java:2479)
at org.apache.hadoop.hbase.client.HTable.batchCallback(HTable.java:898)
at org.apache.hadoop.hbase.client.HTable.batchCallback(HTable.java:913)
at org.apache.hadoop.hbase.client.HTable.batch(HTable.java:888)
at org.apache.phoenix.hbase.index.write.ParallelWriterIndexCommitter$1.call(ParallelWriterIndexCommitter.java:170)
at org.apache.phoenix.hbase.index.write.ParallelWriterIndexCommitter$1.call(ParallelWriterIndexCommitter.java:133)
at java.util.concurrent.FutureTask.run(FutureTask.java:262)
at java.util.concurrent.ThreadPoolExecutor.runWorker(ThreadPoolExecutor.java:1145)
at java.util.concurrent.ThreadPoolExecutor$Worker.run(ThreadPoolExecutor.java:615)
... 1 more
: 1 time, servers with issues: penates.apache.org,42435,1517511046469,
at org.apache.phoenix.tx.ParameterizedTransactionIT.testNonTxToTxTable(ParameterizedTransactionIT.java:288)
Caused by: org.apache.hadoop.hbase.client.RetriesExhaustedWithDetailsException:
Failed 1 action: org.apache.hadoop.hbase.DoNotRetryIOException: Failed 1 action: RegionOpeningException: 1 time, servers with issues: penates.apache.org,42435,1517511046469,
at org.apache.phoenix.util.ServerUtil.createIOException(ServerUtil.java:80)
at org.apache.phoenix.util.ServerUtil.throwIOException(ServerUtil.java:62)
at org.apache.phoenix.index.PhoenixTransactionalIndexer.postBatchMutateIndispensably(PhoenixTransactionalIndexer.java:240)
at org.apache.hadoop.hbase.regionserver.RegionCoprocessorHost$37.call(RegionCoprocessorHost.java:1040)
at org.apache.hadoop.hbase.regionserver.RegionCoprocessorHost$RegionOperation.call(RegionCoprocessorHost.java:1656)
at org.apache.hadoop.hbase.regionserver.RegionCoprocessorHost.execOperation(RegionCoprocessorHost.java:1733)
at org.apache.hadoop.hbase.regionserver.RegionCoprocessorHost.execOperation(RegionCoprocessorHost.java:1688)
at org.apache.hadoop.hbase.regionserver.RegionCoprocessorHost.postBatchMutateIndispensably(RegionCoprocessorHost.java:1036)
at org.apache.hadoop.hbase.regionserver.HRegion.doMiniBatchMutation(HRegion.java:2767)
at org.apache.hadoop.hbase.regionserver.HRegion.batchMutate(HRegion.java:2359)
at org.apache.hadoop.hbase.regionserver.HRegion.batchMutate(HRegion.java:2314)
at org.apache.hadoop.hbase.regionserver.HRegion.batchMutate(HRegion.java:2318)
at org.apache.hadoop.hbase.regionserver.HRegionServer.doBatchOp(HRegionServer.java:4678)
at org.apache.hadoop.hbase.regionserver.HRegionServer.doNonAtomicRegionMutation(HRegionServer.java:3835)
at org.apache.hadoop.hbase.regionserver.HRegionServer.multi(HRegionServer.java:3680)
at org.apache.hadoop.hbase.protobuf.generated.ClientProtos$ClientService$2.callBlockingMethod(ClientProtos.java:32500)
at org.apache.hadoop.hbase.ipc.RpcServer.call(RpcServer.java:2195)
at org.apache.hadoop.hbase.ipc.CallRunner.run(CallRunner.java:104)
at org.apache.hadoop.hbase.ipc.RpcExecutor.consumerLoop(RpcExecutor.java:133)
at org.apache.hadoop.hbase.ipc.RpcExecutor$1.run(RpcExecutor.java:108)
at java.lang.Thread.run(Thread.java:745)
Caused by: org.apache.hadoop.hbase.client.RetriesExhaustedWithDetailsException: Failed 1 action: RegionOpeningException: 1 time, servers with issues: penates.apache.org,42435,1517511046469,
at org.apache.hadoop.hbase.client.AsyncProcess$BatchErrors.makeException(AsyncProcess.java:211)
at org.apache.hadoop.hbase.client.AsyncProcess$BatchErrors.access$500(AsyncProcess.java:195)
at org.apache.hadoop.hbase.client.AsyncProcess.getErrors(AsyncProcess.java:1082)
at org.apache.hadoop.hbase.client.HConnectionManager$HConnectionImplementation.processBatchCallback(HConnectionManager.java:2479)
at org.apache.hadoop.hbase.client.HTable.batchCallback(HTable.java:898)
at org.apache.hadoop.hbase.client.HTable.batchCallback(HTable.java:913)
at org.apache.hadoop.hbase.client.HTable.batch(HTable.java:888)
at org.apache.phoenix.hbase.index.write.ParallelWriterIndexCommitter$1.call(ParallelWriterIndexCommitter.java:170)
at org.apache.phoenix.hbase.index.write.ParallelWriterIndexCommitter$1.call(ParallelWriterIndexCommitter.java:133)
at java.util.concurrent.FutureTask.run(FutureTask.java:262)
at java.util.concurrent.ThreadPoolExecutor.runWorker(ThreadPoolExecutor.java:1145)
at java.util.concurrent.ThreadPoolExecutor$Worker.run(ThreadPoolExecutor.java:615)
... 1 more
: 1 time, servers with issues: penates.apache.org,42435,1517511046469,
at org.apache.phoenix.tx.ParameterizedTransactionIT.testNonTxToTxTable(ParameterizedTransactionIT.java:288)
[INFO] Tests run: 34, Failures: 0, Errors: 0, Skipped: 0, Time elapsed: 461.783 s - in org.apache.phoenix.end2end.join.SortMergeJoinLocalIndexIT
[INFO] Tests run: 40, Failures: 0, Errors: 0, Skipped: 0, Time elapsed: 210.297 s - in org.apache.phoenix.tx.TxCheckpointIT
[INFO]
[INFO] Results:
[INFO]
[ERROR] Errors:
[ERROR] ParameterizedTransactionIT.testNonTxToTxTable:288 » Commit org.apache.hadoop.h...
[INFO]
[ERROR] Tests run: 3372, Failures: 0, Errors: 1, Skipped: 7
[INFO]
[INFO]
[INFO] --- maven-failsafe-plugin:2.20:integration-test (HBaseManagedTimeTests) @ phoenix-core ---
[INFO]
[INFO] -------------------------------------------------------
[INFO] T E S T S
[INFO] -------------------------------------------------------
[INFO]
[INFO] Results:
[INFO]
[INFO] Tests run: 0, Failures: 0, Errors: 0, Skipped: 0
[INFO]
[INFO]
[INFO] --- maven-failsafe-plugin:2.20:integration-test (NeedTheirOwnClusterTests) @ phoenix-core ---
[INFO]
[INFO] -------------------------------------------------------
[INFO] T E S T S
[INFO] -------------------------------------------------------
[INFO] Running org.apache.hadoop.hbase.regionserver.wal.WALReplayWithIndexWritesAndCompressedWALIT
[INFO] Tests run: 1, Failures: 0, Errors: 0, Skipped: 0, Time elapsed: 19.712 s - in org.apache.hadoop.hbase.regionserver.wal.WALReplayWithIndexWritesAndCompressedWALIT
[INFO] Running org.apache.hadoop.hbase.regionserver.wal.WALRecoveryRegionPostOpenIT
[INFO] Tests run: 1, Failures: 0, Errors: 0, Skipped: 0, Time elapsed: 4.356 s - in org.apache.hadoop.hbase.regionserver.wal.WALRecoveryRegionPostOpenIT
[INFO] Running org.apache.phoenix.end2end.ColumnEncodedMutableNonTxStatsCollectorIT
[INFO] Running org.apache.phoenix.end2end.ColumnEncodedImmutableNonTxStatsCollectorIT
[INFO] Running org.apache.phoenix.end2end.ColumnEncodedImmutableTxStatsCollectorIT
[INFO] Running org.apache.phoenix.end2end.ColumnEncodedMutableTxStatsCollectorIT
[INFO] Running org.apache.phoenix.end2end.ConnectionUtilIT
[INFO] Tests run: 1, Failures: 0, Errors: 0, Skipped: 0, Time elapsed: 17.196 s - in org.apache.phoenix.end2end.ConnectionUtilIT
[WARNING] Tests run: 26, Failures: 0, Errors: 0, Skipped: 4, Time elapsed: 73.481 s - in org.apache.phoenix.end2end.ColumnEncodedMutableNonTxStatsCollectorIT
[INFO] Running org.apache.phoenix.end2end.ContextClassloaderIT
[WARNING] Tests run: 26, Failures: 0, Errors: 0, Skipped: 4, Time elapsed: 77.386 s - in org.apache.phoenix.end2end.ColumnEncodedImmutableNonTxStatsCollectorIT
[INFO] Tests run: 3, Failures: 0, Errors: 0, Skipped: 0, Time elapsed: 1.63 s - in org.apache.phoenix.end2end.ContextClassloaderIT
[WARNING] Tests run: 26, Failures: 0, Errors: 0, Skipped: 4, Time elapsed: 78.52 s - in org.apache.phoenix.end2end.ColumnEncodedImmutableTxStatsCollectorIT
[WARNING] Tests run: 26, Failures: 0, Errors: 0, Skipped: 4, Time elapsed: 76.224 s - in org.apache.phoenix.end2end.ColumnEncodedMutableTxStatsCollectorIT
[INFO] Running org.apache.phoenix.end2end.CsvBulkLoadToolIT
[INFO] Running org.apache.phoenix.end2end.CountDistinctCompressionIT
[INFO] Tests run: 1, Failures: 0, Errors: 0, Skipped: 0, Time elapsed: 2.68 s - in org.apache.phoenix.end2end.CountDistinctCompressionIT
[INFO] Running org.apache.phoenix.end2end.DropSchemaIT
[INFO] Tests run: 2, Failures: 0, Errors: 0, Skipped: 0, Time elapsed: 5.661 s - in org.apache.phoenix.end2end.DropSchemaIT
[INFO] Running org.apache.phoenix.end2end.FlappingLocalIndexIT
[INFO] Running org.apache.phoenix.end2end.IndexExtendedIT
[INFO] Running org.apache.phoenix.end2end.IndexScrutinyToolIT
[INFO] Running org.apache.phoenix.end2end.IndexToolForPartialBuildIT
[INFO] Tests run: 12, Failures: 0, Errors: 0, Skipped: 0, Time elapsed: 67.328 s - in org.apache.phoenix.end2end.CsvBulkLoadToolIT
[INFO] Tests run: 32, Failures: 0, Errors: 0, Skipped: 0, Time elapsed: 71.378 s - in org.apache.phoenix.end2end.IndexExtendedIT
[INFO] Running org.apache.phoenix.end2end.IndexToolForPartialBuildWithNamespaceEnabledIT
[INFO] Tests run: 12, Failures: 0, Errors: 0, Skipped: 0, Time elapsed: 112.915 s - in org.apache.phoenix.end2end.FlappingLocalIndexIT
[INFO] Running org.apache.phoenix.end2end.IndexToolIT
[INFO] Running org.apache.phoenix.end2end.LocalIndexSplitMergeIT
[WARNING] Tests run: 2, Failures: 0, Errors: 0, Skipped: 2, Time elapsed: 0.001 s - in org.apache.phoenix.end2end.LocalIndexSplitMergeIT
[INFO] Running org.apache.phoenix.end2end.MigrateSystemTablesToSystemNamespaceIT
[INFO] Tests run: 4, Failures: 0, Errors: 0, Skipped: 0, Time elapsed: 174.776 s - in org.apache.phoenix.end2end.MigrateSystemTablesToSystemNamespaceIT
[INFO] Tests run: 33, Failures: 0, Errors: 0, Skipped: 0, Time elapsed: 286.352 s - in org.apache.phoenix.end2end.IndexScrutinyToolIT
[INFO] Running org.apache.phoenix.end2end.NonColumnEncodedImmutableNonTxStatsCollectorIT
[INFO] Running org.apache.phoenix.end2end.NonColumnEncodedImmutableTxStatsCollectorIT
[WARNING] Tests run: 26, Failures: 0, Errors: 0, Skipped: 4, Time elapsed: 72.562 s - in org.apache.phoenix.end2end.NonColumnEncodedImmutableNonTxStatsCollectorIT
[WARNING] Tests run: 26, Failures: 0, Errors: 0, Skipped: 4, Time elapsed: 72.447 s - in org.apache.phoenix.end2end.NonColumnEncodedImmutableTxStatsCollectorIT
[INFO] Running org.apache.phoenix.end2end.PhoenixDriverIT
[INFO] Tests run: 32, Failures: 0, Errors: 0, Skipped: 0, Time elapsed: 333.751 s - in org.apache.phoenix.end2end.IndexToolIT
[INFO] Running org.apache.phoenix.end2end.QueryTimeoutIT
[INFO] Tests run: 2, Failures: 0, Errors: 0, Skipped: 0, Time elapsed: 8.754 s - in org.apache.phoenix.end2end.QueryTimeoutIT
[INFO] Tests run: 4, Failures: 0, Errors: 0, Skipped: 0, Time elapsed: 37.489 s - in org.apache.phoenix.end2end.PhoenixDriverIT
[INFO] Running org.apache.phoenix.end2end.QueryWithLimitIT
[INFO] Tests run: 2, Failures: 0, Errors: 0, Skipped: 0, Time elapsed: 2.152 s - in org.apache.phoenix.end2end.QueryWithLimitIT
[INFO] Running org.apache.phoenix.end2end.RebuildIndexConnectionPropsIT
[INFO] Tests run: 1, Failures: 0, Errors: 0, Skipped: 0, Time elapsed: 0.77 s - in org.apache.phoenix.end2end.RebuildIndexConnectionPropsIT
[INFO] Running org.apache.phoenix.end2end.RegexBulkLoadToolIT
[INFO] Running org.apache.phoenix.end2end.RenewLeaseIT
[INFO] Tests run: 1, Failures: 0, Errors: 0, Skipped: 0, Time elapsed: 25.538 s - in org.apache.phoenix.end2end.RenewLeaseIT
[INFO] Running org.apache.phoenix.end2end.SpillableGroupByIT
[INFO] Tests run: 2, Failures: 0, Errors: 0, Skipped: 0, Time elapsed: 6.77 s - in org.apache.phoenix.end2end.SpillableGroupByIT
[INFO] Tests run: 10, Failures: 0, Errors: 0, Skipped: 0, Time elapsed: 57.453 s - in org.apache.phoenix.end2end.RegexBulkLoadToolIT
[INFO] Running org.apache.phoenix.end2end.SystemTablePermissionsIT
[INFO] Running org.apache.phoenix.end2end.SysTableNamespaceMappedStatsCollectorIT
[INFO] Tests run: 2, Failures: 0, Errors: 0, Skipped: 0, Time elapsed: 571.779 s - in org.apache.phoenix.end2end.IndexToolForPartialBuildIT
[INFO] Running org.apache.phoenix.end2end.TableSnapshotReadsMapReduceIT
[INFO] Tests run: 3, Failures: 0, Errors: 0, Skipped: 0, Time elapsed: 16.174 s - in org.apache.phoenix.end2end.TableSnapshotReadsMapReduceIT
[INFO] Running org.apache.phoenix.end2end.UpdateCacheAcrossDifferentClientsIT
[INFO] Tests run: 2, Failures: 0, Errors: 0, Skipped: 0, Time elapsed: 574.452 s - in org.apache.phoenix.end2end.IndexToolForPartialBuildWithNamespaceEnabledIT
[INFO] Tests run: 2, Failures: 0, Errors: 0, Skipped: 0, Time elapsed: 80.983 s - in org.apache.phoenix.end2end.SystemTablePermissionsIT
[WARNING] Tests run: 26, Failures: 0, Errors: 0, Skipped: 4, Time elapsed: 71.141 s - in org.apache.phoenix.end2end.SysTableNamespaceMappedStatsCollectorIT
[INFO] Running org.apache.phoenix.end2end.UserDefinedFunctionsIT
[INFO] Tests run: 6, Failures: 0, Errors: 0, Skipped: 0, Time elapsed: 22.264 s - in org.apache.phoenix.end2end.UpdateCacheAcrossDifferentClientsIT
[INFO] Running org.apache.phoenix.end2end.index.ImmutableIndexIT
[INFO] Tests run: 14, Failures: 0, Errors: 0, Skipped: 0, Time elapsed: 32.514 s - in org.apache.phoenix.end2end.UserDefinedFunctionsIT
[INFO] Running org.apache.phoenix.end2end.index.LocalIndexIT
[INFO] Running org.apache.phoenix.end2end.index.MutableIndexFailureIT
[INFO] Running org.apache.phoenix.end2end.index.MutableIndexReplicationIT
[INFO] Running org.apache.phoenix.end2end.index.PartialIndexRebuilderIT
[INFO] Tests run: 1, Failures: 0, Errors: 0, Skipped: 0, Time elapsed: 15.604 s - in org.apache.phoenix.end2end.index.MutableIndexReplicationIT
[INFO] Running org.apache.phoenix.end2end.index.txn.TxWriteFailureIT
[INFO] Tests run: 8, Failures: 0, Errors: 0, Skipped: 0, Time elapsed: 41.525 s - in org.apache.phoenix.end2end.index.txn.TxWriteFailureIT
[INFO] Running org.apache.phoenix.execute.PartialCommitIT
[INFO] Tests run: 12, Failures: 0, Errors: 0, Skipped: 0, Time elapsed: 1.086 s - in org.apache.phoenix.execute.PartialCommitIT
[INFO] Running org.apache.phoenix.execute.UpsertSelectOverlappingBatchesIT
[INFO] Tests run: 26, Failures: 0, Errors: 0, Skipped: 0, Time elapsed: 230.985 s - in org.apache.phoenix.end2end.index.PartialIndexRebuilderIT
[INFO] Running org.apache.phoenix.hbase.index.FailForUnsupportedHBaseVersionsIT
[INFO] Tests run: 2, Failures: 0, Errors: 0, Skipped: 0, Time elapsed: 23.176 s - in org.apache.phoenix.hbase.index.FailForUnsupportedHBaseVersionsIT
[INFO] Tests run: 36, Failures: 0, Errors: 0, Skipped: 0, Time elapsed: 290.683 s - in org.apache.phoenix.end2end.index.LocalIndexIT
[WARNING] Tests run: 40, Failures: 0, Errors: 0, Skipped: 16, Time elapsed: 303.091 s - in org.apache.phoenix.end2end.index.ImmutableIndexIT
[INFO] Running org.apache.phoenix.iterate.RoundRobinResultIteratorWithStatsIT
[INFO] Tests run: 1, Failures: 0, Errors: 0, Skipped: 0, Time elapsed: 5.346 s - in org.apache.phoenix.iterate.RoundRobinResultIteratorWithStatsIT
[INFO] Running org.apache.phoenix.iterate.ScannerLeaseRenewalIT
[INFO] Running org.apache.phoenix.monitoring.PhoenixMetricsIT
[INFO] Running org.apache.phoenix.rpc.PhoenixClientRpcIT
[INFO] Tests run: 2, Failures: 0, Errors: 0, Skipped: 0, Time elapsed: 2.416 s - in org.apache.phoenix.rpc.PhoenixClientRpcIT
[INFO] Tests run: 3, Failures: 0, Errors: 0, Skipped: 0, Time elapsed: 150.936 s - in org.apache.phoenix.execute.UpsertSelectOverlappingBatchesIT
[INFO] Tests run: 22, Failures: 0, Errors: 0, Skipped: 0, Time elapsed: 50.298 s - in org.apache.phoenix.monitoring.PhoenixMetricsIT
[INFO] Running org.apache.phoenix.rpc.PhoenixServerRpcIT
[INFO] Tests run: 2, Failures: 0, Errors: 0, Skipped: 0, Time elapsed: 12.715 s - in org.apache.phoenix.rpc.PhoenixServerRpcIT
[INFO] Tests run: 2, Failures: 0, Errors: 0, Skipped: 0, Time elapsed: 159.336 s - in org.apache.phoenix.iterate.ScannerLeaseRenewalIT
[INFO] Tests run: 21, Failures: 0, Errors: 0, Skipped: 0, Time elapsed: 542.311 s - in org.apache.phoenix.end2end.index.MutableIndexFailureIT
[INFO]
[INFO] Results:
[INFO]
[WARNING] Tests run: 547, Failures: 0, Errors: 0, Skipped: 46
[INFO]
[INFO]
[INFO] --- maven-failsafe-plugin:2.20:verify (ParallelStatsEnabledTest) @ phoenix-core ---
[INFO] ------------------------------------------------------------------------
[INFO] Reactor Summary:
[INFO]
[INFO] Apache Phoenix ..................................... SUCCESS [ 2.669 s]
[INFO] Phoenix Core ....................................... FAILURE [ 01:28 h]
[INFO] Phoenix - Flume .................................... SKIPPED
[INFO] Phoenix - Kafka .................................... SKIPPED
[INFO] Phoenix - Pig ...................................... SKIPPED
[INFO] Phoenix Query Server Client ........................ SKIPPED
[INFO] Phoenix Query Server ............................... SKIPPED
[INFO] Phoenix - Pherf .................................... SKIPPED
[INFO] Phoenix - Spark .................................... SKIPPED
[INFO] Phoenix - Hive ..................................... SKIPPED
[INFO] Phoenix Client ..................................... SKIPPED
[INFO] Phoenix Server ..................................... SKIPPED
[INFO] Phoenix Assembly ................................... SKIPPED
[INFO] Phoenix - Tracing Web Application .................. SKIPPED
[INFO] Phoenix Load Balancer .............................. SKIPPED
[INFO] ------------------------------------------------------------------------
[INFO] BUILD FAILURE
[INFO] ------------------------------------------------------------------------
[INFO] Total time: 01:28 h
[INFO] Finished at: 2018-02-01T19:19:30Z
[INFO] Final Memory: 62M/1055M
[INFO] ------------------------------------------------------------------------
[ERROR] Failed to execute goal org.apache.maven.plugins:maven-failsafe-plugin:2.20:verify (ParallelStatsEnabledTest) on project phoenix-core: There are test failures.
[ERROR]
[ERROR] Please refer to <https://builds.apache.org/job/Phoenix-4.x-HBase-0.98/ws/phoenix-core/target/failsafe-reports> for the individual test results.
[ERROR] Please refer to dump files (if any exist) [date]-jvmRun[N].dump, [date].dumpstream and [date]-jvmRun[N].dumpstream.
[ERROR] -> [Help 1]
[ERROR]
[ERROR] To see the full stack trace of the errors, re-run Maven with the -e switch.
[ERROR] Re-run Maven using the -X switch to enable full debug logging.
[ERROR]
[ERROR] For more information about the errors and possible solutions, please read the following articles:
[ERROR] [Help 1] http://cwiki.apache.org/confluence/display/MAVEN/MojoFailureException
[ERROR]
[ERROR] After correcting the problems, you can resume the build with the command
[ERROR] mvn <goals> -rf :phoenix-core
Build step 'Invoke top-level Maven targets' marked build as failure
Archiving artifacts
Recording test results
Jenkins build is back to normal : Phoenix | 4.x-HBase-0.98 #1808
Posted by Apache Jenkins Server <je...@builds.apache.org>.
See <https://builds.apache.org/job/Phoenix-4.x-HBase-0.98/1808/display/redirect?page=changes>
Build failed in Jenkins: Phoenix | 4.x-HBase-0.98 #1807
Posted by Apache Jenkins Server <je...@builds.apache.org>.
See <https://builds.apache.org/job/Phoenix-4.x-HBase-0.98/1807/display/redirect?page=changes>
Changes:
[elserj] PHOENIX-4571 Adds dependency on servlet-api for PQS
------------------------------------------
[...truncated 132.72 KB...]
[ERROR] ExecutionException Error creating properties files for forking
[ERROR] ExecutionException Error creating properties files for forking
[ERROR] ExecutionException Error creating properties files for forking
[ERROR] ExecutionException Error creating properties files for forking
[ERROR] ExecutionException Error creating properties files for forking
[ERROR] ExecutionException Error creating properties files for forking
[ERROR] ExecutionException Error creating properties files for forking
[ERROR] ExecutionException Error creating properties files for forking
[ERROR] ExecutionException Error creating properties files for forking
[ERROR] ExecutionException Error creating properties files for forking
[ERROR] ExecutionException Error creating properties files for forking
[ERROR] ExecutionException Error creating properties files for forking
[ERROR] ExecutionException Error creating properties files for forking
[ERROR] ExecutionException Error creating properties files for forking
[ERROR] ExecutionException Error creating properties files for forking
[ERROR] ExecutionException Error creating properties files for forking
[ERROR] ExecutionException Error creating properties files for forking
[ERROR] ExecutionException Error creating properties files for forking
[ERROR] ExecutionException Error creating properties files for forking
[ERROR] ExecutionException Error creating properties files for forking
[ERROR] ExecutionException Error creating properties files for forking
[ERROR] ExecutionException Error creating properties files for forking
[ERROR] ExecutionException Error creating properties files for forking
[ERROR] ExecutionException Error creating properties files for forking
[ERROR] ExecutionException Error creating properties files for forking
[ERROR] ExecutionException Error creating properties files for forking
[ERROR] ExecutionException Error creating properties files for forking
[ERROR] ExecutionException Error creating properties files for forking
[ERROR] ExecutionException Error creating properties files for forking
[ERROR] ExecutionException Error creating properties files for forking
[ERROR] ExecutionException Error creating properties files for forking
[ERROR] ExecutionException Error creating properties files for forking
[ERROR] ExecutionException Error creating properties files for forking
[ERROR] ExecutionException Error creating properties files for forking
[ERROR] ExecutionException Error creating properties files for forking
[ERROR] ExecutionException Error creating properties files for forking
[ERROR] ExecutionException Error creating properties files for forking
[ERROR] ExecutionException Error creating properties files for forking
[ERROR] ExecutionException Error creating properties files for forking
[ERROR] ExecutionException Error creating properties files for forking
[ERROR] ExecutionException Error creating properties files for forking
[ERROR] ExecutionException Error creating properties files for forking
[ERROR] ExecutionException Error creating properties files for forking
[ERROR] ExecutionException Error creating properties files for forking
[ERROR] ExecutionException Error creating properties files for forking
[ERROR] ExecutionException Error creating properties files for forking
[ERROR] ExecutionException Error creating properties files for forking
[ERROR] ExecutionException Error creating properties files for forking
[ERROR] ExecutionException Error creating properties files for forking
[ERROR] ExecutionException Error creating properties files for forking
[ERROR] ExecutionException Error creating properties files for forking
[ERROR] ExecutionException Error creating properties files for forking
[ERROR] ExecutionException Error creating properties files for forking
[ERROR] ExecutionException Error creating properties files for forking
[ERROR] ExecutionException Error creating properties files for forking
[ERROR] ExecutionException Error creating properties files for forking
[ERROR] ExecutionException Error creating properties files for forking
[ERROR] ExecutionException Error creating properties files for forking
[ERROR] ExecutionException Error creating properties files for forking
[ERROR] ExecutionException Error creating properties files for forking
[ERROR] ExecutionException Error creating properties files for forking
[ERROR] ExecutionException Error creating properties files for forking
[ERROR] ExecutionException Error creating properties files for forking
[ERROR] ExecutionException Error creating properties files for forking
[ERROR] ExecutionException Error creating properties files for forking
[ERROR] ExecutionException Error creating properties files for forking
[ERROR] ExecutionException Error creating properties files for forking
[ERROR] ExecutionException Error creating properties files for forking
[ERROR] ExecutionException Error creating properties files for forking
[ERROR] ExecutionException Error creating properties files for forking
[ERROR] ExecutionException Error creating properties files for forking
[ERROR] ExecutionException Error creating properties files for forking
[ERROR] ExecutionException Error creating properties files for forking
[ERROR] ExecutionException Error creating properties files for forking
[ERROR] ExecutionException Error creating properties files for forking
[ERROR] ExecutionException Error creating properties files for forking
[ERROR] ExecutionException Error creating properties files for forking
[ERROR] ExecutionException Error creating properties files for forking
[ERROR] ExecutionException Error creating properties files for forking
[ERROR] ExecutionException Error creating properties files for forking
[ERROR] ExecutionException Error creating properties files for forking
[ERROR] ExecutionException Error creating properties files for forking
[ERROR] ExecutionException Error creating properties files for forking
[ERROR] ExecutionException Error creating properties files for forking
[ERROR] ExecutionException Error creating properties files for forking
[ERROR] ExecutionException Error creating properties files for forking
[ERROR] ExecutionException Error creating properties files for forking
[ERROR] ExecutionException Error creating properties files for forking
[ERROR] ExecutionException Error creating properties files for forking
[ERROR] ExecutionException Error creating properties files for forking
[ERROR] ExecutionException Error creating properties files for forking
[ERROR] ExecutionException Error creating properties files for forking
[ERROR] ExecutionException Error creating properties files for forking
[ERROR] ExecutionException Error creating properties files for forking
[ERROR] ExecutionException Error creating properties files for forking
[ERROR] ExecutionException Error creating properties files for forking
[ERROR] ExecutionException Error creating properties files for forking
[ERROR] ExecutionException Error creating properties files for forking
[ERROR] ExecutionException Error creating properties files for forking
[ERROR] ExecutionException Error creating properties files for forking
[ERROR] ExecutionException Error creating properties files for forking
[ERROR] ExecutionException Error creating properties files for forking
[ERROR] ExecutionException Error creating properties files for forking
[ERROR] ExecutionException Error creating properties files for forking
[ERROR] ExecutionException Error creating properties files for forking
[ERROR] ExecutionException Error creating properties files for forking
[ERROR] ExecutionException Error creating properties files for forking
[ERROR] ExecutionException Error creating properties files for forking
[ERROR] ExecutionException Error creating properties files for forking
[ERROR] ExecutionException Error creating properties files for forking
[ERROR] ExecutionException Error creating properties files for forking
[ERROR] ExecutionException Error creating properties files for forking
[ERROR] ExecutionException Error creating properties files for forking
[ERROR] ExecutionException Error creating properties files for forking
[ERROR] ExecutionException Error creating properties files for forking
[ERROR] ExecutionException Error creating properties files for forking
[ERROR] ExecutionException Error creating properties files for forking
[ERROR] ExecutionException Error creating properties files for forking
[ERROR] ExecutionException Error creating properties files for forking
[ERROR] ExecutionException Error creating properties files for forking
[ERROR] ExecutionException Error creating properties files for forking
[ERROR] ExecutionException Error creating properties files for forking
[ERROR] ExecutionException Error creating properties files for forking
[ERROR] ExecutionException Error creating properties files for forking
[ERROR] ExecutionException Error creating properties files for forking
[ERROR] ExecutionException Error creating properties files for forking
[ERROR] ExecutionException Error creating properties files for forking
[ERROR] ExecutionException Error creating properties files for forking
[ERROR] ExecutionException Error creating properties files for forking
[ERROR] ExecutionException Error creating properties files for forking
[ERROR] ExecutionException Error creating properties files for forking
[ERROR] ExecutionException Error creating properties files for forking
[ERROR] ExecutionException Error creating properties files for forking
[ERROR] ExecutionException Error creating properties files for forking
[ERROR] ExecutionException Error creating properties files for forking
[ERROR] ExecutionException Error creating properties files for forking
[ERROR] ExecutionException Error creating properties files for forking
[ERROR] ExecutionException Error creating properties files for forking
[ERROR] ExecutionException Error creating properties files for forking
[ERROR] ExecutionException Error creating properties files for forking
[ERROR] ExecutionException Error creating properties files for forking
[ERROR] ExecutionException Error creating properties files for forking
[ERROR] ExecutionException Error creating properties files for forking
[ERROR] ExecutionException Error creating properties files for forking
[ERROR] ExecutionException Error creating properties files for forking
[ERROR] ExecutionException Error creating properties files for forking
[ERROR] ExecutionException Error creating properties files for forking
[ERROR] ExecutionException Error creating properties files for forking
[ERROR] ExecutionException Error creating properties files for forking
[ERROR] ExecutionException Error creating properties files for forking
[ERROR] ExecutionException Error creating properties files for forking
[ERROR] ExecutionException Error creating properties files for forking
[ERROR] ExecutionException Error creating properties files for forking
[ERROR] ExecutionException Error creating properties files for forking
[ERROR] ExecutionException Error creating properties files for forking
[ERROR] ExecutionException Error creating properties files for forking
[ERROR] ExecutionException Error creating properties files for forking
[ERROR] ExecutionException Error creating properties files for forking
[ERROR] ExecutionException Error creating properties files for forking
[ERROR] ExecutionException Error creating properties files for forking
[ERROR] ExecutionException Error creating properties files for forking
[ERROR] ExecutionException Error creating properties files for forking
[ERROR] ExecutionException Error creating properties files for forking
[ERROR] ExecutionException Error creating properties files for forking
[ERROR] ExecutionException Error creating properties files for forking
[ERROR] ExecutionException Error creating properties files for forking
[ERROR] ExecutionException Error creating properties files for forking
[ERROR] ExecutionException Error creating properties files for forking
[ERROR] ExecutionException Error creating properties files for forking
[ERROR] ExecutionException Error creating properties files for forking
[ERROR] ExecutionException Error creating properties files for forking
[ERROR] ExecutionException Error creating properties files for forking
[ERROR] ExecutionException Error creating properties files for forking
[ERROR] ExecutionException Error creating properties files for forking
[ERROR] ExecutionException Error creating properties files for forking
[ERROR] ExecutionException Error creating properties files for forking
[ERROR] ExecutionException Error creating properties files for forking
[ERROR] ExecutionException Error creating properties files for forking
[ERROR] ExecutionException Error creating properties files for forking
[ERROR] ExecutionException Error creating properties files for forking
[ERROR] ExecutionException Error creating properties files for forking
[ERROR] ExecutionException Error creating properties files for forking
[ERROR] ExecutionException Error creating properties files for forking
[ERROR] ExecutionException Error creating properties files for forking
[ERROR] ExecutionException Error creating properties files for forking
[ERROR] ExecutionException Error creating properties files for forking
[ERROR] ExecutionException Error creating properties files for forking
[ERROR] ExecutionException Error creating properties files for forking
[ERROR] at org.apache.maven.plugin.surefire.booterclient.ForkStarter.awaitResultsDone(ForkStarter.java:494)
[ERROR] at org.apache.maven.plugin.surefire.booterclient.ForkStarter.runSuitesForkPerTestSet(ForkStarter.java:441)
[ERROR] at org.apache.maven.plugin.surefire.booterclient.ForkStarter.run(ForkStarter.java:292)
[ERROR] at org.apache.maven.plugin.surefire.booterclient.ForkStarter.run(ForkStarter.java:243)
[ERROR] at org.apache.maven.plugin.surefire.AbstractSurefireMojo.executeProvider(AbstractSurefireMojo.java:1077)
[ERROR] at org.apache.maven.plugin.surefire.AbstractSurefireMojo.executeAfterPreconditionsChecked(AbstractSurefireMojo.java:907)
[ERROR] at org.apache.maven.plugin.surefire.AbstractSurefireMojo.execute(AbstractSurefireMojo.java:785)
[ERROR] at org.apache.maven.plugin.DefaultBuildPluginManager.executeMojo(DefaultBuildPluginManager.java:134)
[ERROR] at org.apache.maven.lifecycle.internal.MojoExecutor.execute(MojoExecutor.java:208)
[ERROR] at org.apache.maven.lifecycle.internal.MojoExecutor.execute(MojoExecutor.java:154)
[ERROR] at org.apache.maven.lifecycle.internal.MojoExecutor.execute(MojoExecutor.java:146)
[ERROR] at org.apache.maven.lifecycle.internal.LifecycleModuleBuilder.buildProject(LifecycleModuleBuilder.java:117)
[ERROR] at org.apache.maven.lifecycle.internal.LifecycleModuleBuilder.buildProject(LifecycleModuleBuilder.java:81)
[ERROR] at org.apache.maven.lifecycle.internal.builder.singlethreaded.SingleThreadedBuilder.build(SingleThreadedBuilder.java:51)
[ERROR] at org.apache.maven.lifecycle.internal.LifecycleStarter.execute(LifecycleStarter.java:128)
[ERROR] at org.apache.maven.DefaultMaven.doExecute(DefaultMaven.java:309)
[ERROR] at org.apache.maven.DefaultMaven.doExecute(DefaultMaven.java:194)
[ERROR] at org.apache.maven.DefaultMaven.execute(DefaultMaven.java:107)
[ERROR] at org.apache.maven.cli.MavenCli.execute(MavenCli.java:955)
[ERROR] at org.apache.maven.cli.MavenCli.doMain(MavenCli.java:290)
[ERROR] at org.apache.maven.cli.MavenCli.main(MavenCli.java:194)
[ERROR] at sun.reflect.NativeMethodAccessorImpl.invoke0(Native Method)
[ERROR] at sun.reflect.NativeMethodAccessorImpl.invoke(NativeMethodAccessorImpl.java:57)
[ERROR] at sun.reflect.DelegatingMethodAccessorImpl.invoke(DelegatingMethodAccessorImpl.java:43)
[ERROR] at java.lang.reflect.Method.invoke(Method.java:606)
[ERROR] at org.codehaus.plexus.classworlds.launcher.Launcher.launchEnhanced(Launcher.java:289)
[ERROR] at org.codehaus.plexus.classworlds.launcher.Launcher.launch(Launcher.java:229)
[ERROR] at org.codehaus.plexus.classworlds.launcher.Launcher.mainWithExitCode(Launcher.java:415)
[ERROR] at org.codehaus.plexus.classworlds.launcher.Launcher.main(Launcher.java:356)
[ERROR] Caused by: org.apache.maven.surefire.booter.SurefireBooterForkException: Error creating properties files for forking
[ERROR] at org.apache.maven.plugin.surefire.booterclient.ForkStarter.fork(ForkStarter.java:574)
[ERROR] at org.apache.maven.plugin.surefire.booterclient.ForkStarter.fork(ForkStarter.java:533)
[ERROR] at org.apache.maven.plugin.surefire.booterclient.ForkStarter.access$600(ForkStarter.java:117)
[ERROR] at org.apache.maven.plugin.surefire.booterclient.ForkStarter$2.call(ForkStarter.java:429)
[ERROR] at org.apache.maven.plugin.surefire.booterclient.ForkStarter$2.call(ForkStarter.java:406)
[ERROR] at java.util.concurrent.FutureTask.run(FutureTask.java:262)
[ERROR] at java.util.concurrent.ThreadPoolExecutor.runWorker(ThreadPoolExecutor.java:1145)
[ERROR] at java.util.concurrent.ThreadPoolExecutor$Worker.run(ThreadPoolExecutor.java:615)
[ERROR] at java.lang.Thread.run(Thread.java:745)
[ERROR] Caused by: java.io.IOException: No space left on device
[ERROR] at java.io.UnixFileSystem.createFileExclusively(Native Method)
[ERROR] at java.io.File.createTempFile(File.java:2001)
[ERROR] at org.apache.maven.surefire.booter.SystemPropertyManager.writePropertiesFile(SystemPropertyManager.java:82)
[ERROR] at org.apache.maven.plugin.surefire.booterclient.BooterSerializer.serialize(BooterSerializer.java:145)
[ERROR] at org.apache.maven.plugin.surefire.booterclient.ForkStarter.fork(ForkStarter.java:555)
[ERROR] ... 8 more
[ERROR]
[ERROR] -> [Help 1]
[ERROR]
[ERROR] To see the full stack trace of the errors, re-run Maven with the -e switch.
[ERROR] Re-run Maven using the -X switch to enable full debug logging.
[ERROR]
[ERROR] For more information about the errors and possible solutions, please read the following articles:
[ERROR] [Help 1] http://cwiki.apache.org/confluence/display/MAVEN/MojoExecutionException
[ERROR]
[ERROR] After correcting the problems, you can resume the build with the command
[ERROR] mvn <goals> -rf :phoenix-core
Build step 'Invoke top-level Maven targets' marked build as failure
Archiving artifacts
[Fast Archiver] Compressed 712.79 MB of artifacts by 11.4% relative to #1804
Recording test results
Build failed in Jenkins: Phoenix | 4.x-HBase-0.98 #1806
Posted by Apache Jenkins Server <je...@builds.apache.org>.
See <https://builds.apache.org/job/Phoenix-4.x-HBase-0.98/1806/display/redirect?page=changes>
Changes:
[elserj] PHOENIX-4577 Use cp -r for the argparse directory in bin/
------------------------------------------
[...truncated 126.85 KB...]
[INFO]
[INFO] --- maven-failsafe-plugin:2.20:integration-test (NeedTheirOwnClusterTests) @ phoenix-core ---
[INFO]
[INFO] -------------------------------------------------------
[INFO] T E S T S
[INFO] -------------------------------------------------------
[INFO] Running org.apache.hadoop.hbase.regionserver.wal.WALReplayWithIndexWritesAndCompressedWALIT
[INFO] Tests run: 1, Failures: 0, Errors: 0, Skipped: 0, Time elapsed: 34.678 s - in org.apache.hadoop.hbase.regionserver.wal.WALReplayWithIndexWritesAndCompressedWALIT
[INFO] Running org.apache.hadoop.hbase.regionserver.wal.WALRecoveryRegionPostOpenIT
[INFO] Tests run: 1, Failures: 0, Errors: 0, Skipped: 0, Time elapsed: 8.204 s - in org.apache.hadoop.hbase.regionserver.wal.WALRecoveryRegionPostOpenIT
[INFO] Running org.apache.phoenix.end2end.ColumnEncodedImmutableTxStatsCollectorIT
[INFO] Running org.apache.phoenix.end2end.ColumnEncodedMutableNonTxStatsCollectorIT
[INFO] Running org.apache.phoenix.end2end.ColumnEncodedImmutableNonTxStatsCollectorIT
[INFO] Running org.apache.phoenix.end2end.ConnectionUtilIT
[INFO] Running org.apache.phoenix.end2end.ColumnEncodedMutableTxStatsCollectorIT
[INFO] Tests run: 1, Failures: 0, Errors: 0, Skipped: 0, Time elapsed: 26.048 s - in org.apache.phoenix.end2end.ConnectionUtilIT
[INFO] Running org.apache.phoenix.end2end.ContextClassloaderIT
[INFO] Tests run: 3, Failures: 0, Errors: 0, Skipped: 0, Time elapsed: 2.507 s - in org.apache.phoenix.end2end.ContextClassloaderIT
[WARNING] Tests run: 26, Failures: 0, Errors: 0, Skipped: 4, Time elapsed: 117.09 s - in org.apache.phoenix.end2end.ColumnEncodedImmutableTxStatsCollectorIT
[WARNING] Tests run: 26, Failures: 0, Errors: 0, Skipped: 4, Time elapsed: 116.822 s - in org.apache.phoenix.end2end.ColumnEncodedMutableNonTxStatsCollectorIT
[WARNING] Tests run: 26, Failures: 0, Errors: 0, Skipped: 4, Time elapsed: 117.806 s - in org.apache.phoenix.end2end.ColumnEncodedImmutableNonTxStatsCollectorIT
[WARNING] Tests run: 26, Failures: 0, Errors: 0, Skipped: 4, Time elapsed: 119.899 s - in org.apache.phoenix.end2end.ColumnEncodedMutableTxStatsCollectorIT
[INFO] Running org.apache.phoenix.end2end.CountDistinctCompressionIT
[INFO] Tests run: 1, Failures: 0, Errors: 0, Skipped: 0, Time elapsed: 3.148 s - in org.apache.phoenix.end2end.CountDistinctCompressionIT
[INFO] Running org.apache.phoenix.end2end.CsvBulkLoadToolIT
[INFO] Running org.apache.phoenix.end2end.DropSchemaIT
[INFO] Tests run: 2, Failures: 0, Errors: 0, Skipped: 0, Time elapsed: 8.529 s - in org.apache.phoenix.end2end.DropSchemaIT
[INFO] Running org.apache.phoenix.end2end.FlappingLocalIndexIT
[INFO] Running org.apache.phoenix.end2end.IndexExtendedIT
[INFO] Running org.apache.phoenix.end2end.IndexScrutinyToolIT
[INFO] Running org.apache.phoenix.end2end.IndexToolForPartialBuildIT
[INFO] Tests run: 12, Failures: 0, Errors: 0, Skipped: 0, Time elapsed: 84.453 s - in org.apache.phoenix.end2end.CsvBulkLoadToolIT
[INFO] Tests run: 32, Failures: 0, Errors: 0, Skipped: 0, Time elapsed: 92.953 s - in org.apache.phoenix.end2end.IndexExtendedIT
[INFO] Running org.apache.phoenix.end2end.IndexToolForPartialBuildWithNamespaceEnabledIT
[INFO] Tests run: 12, Failures: 0, Errors: 0, Skipped: 0, Time elapsed: 136.215 s - in org.apache.phoenix.end2end.FlappingLocalIndexIT
[INFO] Running org.apache.phoenix.end2end.LocalIndexSplitMergeIT
[WARNING] Tests run: 2, Failures: 0, Errors: 0, Skipped: 2, Time elapsed: 0.001 s - in org.apache.phoenix.end2end.LocalIndexSplitMergeIT
[INFO] Running org.apache.phoenix.end2end.MigrateSystemTablesToSystemNamespaceIT
[INFO] Running org.apache.phoenix.end2end.IndexToolIT
[INFO] Tests run: 33, Failures: 0, Errors: 0, Skipped: 0, Time elapsed: 344.768 s - in org.apache.phoenix.end2end.IndexScrutinyToolIT
[INFO] Tests run: 4, Failures: 0, Errors: 0, Skipped: 0, Time elapsed: 239.148 s - in org.apache.phoenix.end2end.MigrateSystemTablesToSystemNamespaceIT
[INFO] Running org.apache.phoenix.end2end.NonColumnEncodedImmutableNonTxStatsCollectorIT
[INFO] Running org.apache.phoenix.end2end.NonColumnEncodedImmutableTxStatsCollectorIT
[WARNING] Tests run: 26, Failures: 0, Errors: 0, Skipped: 4, Time elapsed: 83.346 s - in org.apache.phoenix.end2end.NonColumnEncodedImmutableNonTxStatsCollectorIT
[WARNING] Tests run: 26, Failures: 0, Errors: 0, Skipped: 4, Time elapsed: 80.494 s - in org.apache.phoenix.end2end.NonColumnEncodedImmutableTxStatsCollectorIT
[INFO] Running org.apache.phoenix.end2end.PhoenixDriverIT
[INFO] Tests run: 32, Failures: 0, Errors: 0, Skipped: 0, Time elapsed: 385.204 s - in org.apache.phoenix.end2end.IndexToolIT
[INFO] Running org.apache.phoenix.end2end.QueryTimeoutIT
[INFO] Tests run: 2, Failures: 0, Errors: 0, Skipped: 0, Time elapsed: 10.28 s - in org.apache.phoenix.end2end.QueryTimeoutIT
[INFO] Tests run: 4, Failures: 0, Errors: 0, Skipped: 0, Time elapsed: 48.748 s - in org.apache.phoenix.end2end.PhoenixDriverIT
[INFO] Running org.apache.phoenix.end2end.QueryWithLimitIT
[INFO] Tests run: 2, Failures: 0, Errors: 0, Skipped: 0, Time elapsed: 5.382 s - in org.apache.phoenix.end2end.QueryWithLimitIT
[INFO] Tests run: 2, Failures: 0, Errors: 0, Skipped: 0, Time elapsed: 584.794 s - in org.apache.phoenix.end2end.IndexToolForPartialBuildIT
[INFO] Running org.apache.phoenix.end2end.RebuildIndexConnectionPropsIT
[INFO] Tests run: 1, Failures: 0, Errors: 0, Skipped: 0, Time elapsed: 1.234 s - in org.apache.phoenix.end2end.RebuildIndexConnectionPropsIT
[INFO] Running org.apache.phoenix.end2end.RegexBulkLoadToolIT
[INFO] Running org.apache.phoenix.end2end.RenewLeaseIT
[INFO] Running org.apache.phoenix.end2end.SpillableGroupByIT
[INFO] Tests run: 1, Failures: 0, Errors: 0, Skipped: 0, Time elapsed: 25.983 s - in org.apache.phoenix.end2end.RenewLeaseIT
[INFO] Tests run: 2, Failures: 0, Errors: 0, Skipped: 0, Time elapsed: 6.256 s - in org.apache.phoenix.end2end.SpillableGroupByIT
[INFO] Running org.apache.phoenix.end2end.SystemTablePermissionsIT
[INFO] Running org.apache.phoenix.end2end.SysTableNamespaceMappedStatsCollectorIT
[INFO] Tests run: 10, Failures: 0, Errors: 0, Skipped: 0, Time elapsed: 65.654 s - in org.apache.phoenix.end2end.RegexBulkLoadToolIT
[INFO] Tests run: 2, Failures: 0, Errors: 0, Skipped: 0, Time elapsed: 585.337 s - in org.apache.phoenix.end2end.IndexToolForPartialBuildWithNamespaceEnabledIT
[INFO] Running org.apache.phoenix.end2end.TableSnapshotReadsMapReduceIT
[INFO] Running org.apache.phoenix.end2end.UpdateCacheAcrossDifferentClientsIT
[INFO] Tests run: 3, Failures: 0, Errors: 0, Skipped: 0, Time elapsed: 24.471 s - in org.apache.phoenix.end2end.TableSnapshotReadsMapReduceIT
[ERROR] Tests run: 2, Failures: 0, Errors: 2, Skipped: 0, Time elapsed: 73.619 s <<< FAILURE! - in org.apache.phoenix.end2end.SystemTablePermissionsIT
[ERROR] testNamespaceMappedSystemTables(org.apache.phoenix.end2end.SystemTablePermissionsIT) Time elapsed: 39.174 s <<< ERROR!
java.io.IOException: Shutting down
at org.apache.phoenix.end2end.SystemTablePermissionsIT.testNamespaceMappedSystemTables(SystemTablePermissionsIT.java:162)
Caused by: java.lang.RuntimeException: Master not active after 30000 seconds
at org.apache.phoenix.end2end.SystemTablePermissionsIT.testNamespaceMappedSystemTables(SystemTablePermissionsIT.java:162)
[ERROR] testSystemTablePermissions(org.apache.phoenix.end2end.SystemTablePermissionsIT) Time elapsed: 34.444 s <<< ERROR!
java.io.IOException: Shutting down
at org.apache.phoenix.end2end.SystemTablePermissionsIT.testSystemTablePermissions(SystemTablePermissionsIT.java:104)
Caused by: java.lang.RuntimeException: Master not active after 30000 seconds
at org.apache.phoenix.end2end.SystemTablePermissionsIT.testSystemTablePermissions(SystemTablePermissionsIT.java:104)
[INFO] Running org.apache.phoenix.end2end.UserDefinedFunctionsIT
[INFO] Tests run: 6, Failures: 0, Errors: 0, Skipped: 0, Time elapsed: 24.134 s - in org.apache.phoenix.end2end.UpdateCacheAcrossDifferentClientsIT
[WARNING] Tests run: 26, Failures: 0, Errors: 0, Skipped: 4, Time elapsed: 94.035 s - in org.apache.phoenix.end2end.SysTableNamespaceMappedStatsCollectorIT
[INFO] Running org.apache.phoenix.end2end.index.ImmutableIndexIT
[INFO] Tests run: 14, Failures: 0, Errors: 0, Skipped: 0, Time elapsed: 48.791 s - in org.apache.phoenix.end2end.UserDefinedFunctionsIT
[INFO] Running org.apache.phoenix.end2end.index.LocalIndexIT
[INFO] Running org.apache.phoenix.end2end.index.MutableIndexFailureIT
[INFO] Running org.apache.phoenix.end2end.index.MutableIndexReplicationIT
[INFO] Running org.apache.phoenix.end2end.index.PartialIndexRebuilderIT
[INFO] Tests run: 1, Failures: 0, Errors: 0, Skipped: 0, Time elapsed: 22.487 s - in org.apache.phoenix.end2end.index.MutableIndexReplicationIT
[INFO] Running org.apache.phoenix.end2end.index.txn.TxWriteFailureIT
[INFO] Tests run: 8, Failures: 0, Errors: 0, Skipped: 0, Time elapsed: 49.416 s - in org.apache.phoenix.end2end.index.txn.TxWriteFailureIT
[INFO] Running org.apache.phoenix.execute.PartialCommitIT
[INFO] Tests run: 12, Failures: 0, Errors: 0, Skipped: 0, Time elapsed: 0.927 s - in org.apache.phoenix.execute.PartialCommitIT
[INFO] Running org.apache.phoenix.execute.UpsertSelectOverlappingBatchesIT
[INFO] Tests run: 21, Failures: 0, Errors: 0, Skipped: 0, Time elapsed: 267.479 s - in org.apache.phoenix.end2end.index.MutableIndexFailureIT
[INFO] Tests run: 26, Failures: 0, Errors: 0, Skipped: 0, Time elapsed: 250.657 s - in org.apache.phoenix.end2end.index.PartialIndexRebuilderIT
[INFO] Running org.apache.phoenix.hbase.index.FailForUnsupportedHBaseVersionsIT
[INFO] Tests run: 2, Failures: 0, Errors: 0, Skipped: 0, Time elapsed: 37.616 s - in org.apache.phoenix.hbase.index.FailForUnsupportedHBaseVersionsIT
[INFO] Running org.apache.phoenix.iterate.RoundRobinResultIteratorWithStatsIT
[INFO] Tests run: 1, Failures: 0, Errors: 0, Skipped: 0, Time elapsed: 5.841 s - in org.apache.phoenix.iterate.RoundRobinResultIteratorWithStatsIT
[INFO] Tests run: 36, Failures: 0, Errors: 0, Skipped: 0, Time elapsed: 363.707 s - in org.apache.phoenix.end2end.index.LocalIndexIT
[INFO] Running org.apache.phoenix.iterate.ScannerLeaseRenewalIT
[INFO] Running org.apache.phoenix.monitoring.PhoenixMetricsIT
[INFO] Running org.apache.phoenix.rpc.PhoenixClientRpcIT
[INFO] Tests run: 2, Failures: 0, Errors: 0, Skipped: 0, Time elapsed: 4.851 s - in org.apache.phoenix.rpc.PhoenixClientRpcIT
[INFO] Tests run: 3, Failures: 0, Errors: 0, Skipped: 0, Time elapsed: 166.48 s - in org.apache.phoenix.execute.UpsertSelectOverlappingBatchesIT
[INFO] Running org.apache.phoenix.rpc.PhoenixServerRpcIT
[INFO] Tests run: 2, Failures: 0, Errors: 0, Skipped: 0, Time elapsed: 15.672 s - in org.apache.phoenix.rpc.PhoenixServerRpcIT
[INFO] Tests run: 22, Failures: 0, Errors: 0, Skipped: 0, Time elapsed: 83.657 s - in org.apache.phoenix.monitoring.PhoenixMetricsIT
[INFO] Tests run: 2, Failures: 0, Errors: 0, Skipped: 0, Time elapsed: 162.57 s - in org.apache.phoenix.iterate.ScannerLeaseRenewalIT
[ERROR] Tests run: 40, Failures: 0, Errors: 12, Skipped: 16, Time elapsed: 807.052 s <<< FAILURE! - in org.apache.phoenix.end2end.index.ImmutableIndexIT
[ERROR] testDeleteFromPartialPK[ImmutableIndexIT_localIndex=false,transactional=true,columnEncoded=false](org.apache.phoenix.end2end.index.ImmutableIndexIT) Time elapsed: 46.14 s <<< ERROR!
java.lang.RuntimeException: org.apache.thrift.TException: Unable to discover transaction service.
at org.apache.phoenix.end2end.index.ImmutableIndexIT.testDeleteFromPartialPK(ImmutableIndexIT.java:175)
Caused by: org.apache.thrift.TException: Unable to discover transaction service.
at org.apache.phoenix.end2end.index.ImmutableIndexIT.testDeleteFromPartialPK(ImmutableIndexIT.java:175)
[ERROR] testDropIfImmutableKeyValueColumn[ImmutableIndexIT_localIndex=false,transactional=true,columnEncoded=false](org.apache.phoenix.end2end.index.ImmutableIndexIT) Time elapsed: 46.46 s <<< ERROR!
java.lang.RuntimeException: org.apache.thrift.TException: Unable to discover transaction service.
at org.apache.phoenix.end2end.index.ImmutableIndexIT.testDropIfImmutableKeyValueColumn(ImmutableIndexIT.java:132)
Caused by: org.apache.thrift.TException: Unable to discover transaction service.
at org.apache.phoenix.end2end.index.ImmutableIndexIT.testDropIfImmutableKeyValueColumn(ImmutableIndexIT.java:132)
[ERROR] testDeleteFromNonPK[ImmutableIndexIT_localIndex=false,transactional=true,columnEncoded=false](org.apache.phoenix.end2end.index.ImmutableIndexIT) Time elapsed: 45.782 s <<< ERROR!
java.lang.RuntimeException: org.apache.thrift.TException: Unable to discover transaction service.
at org.apache.phoenix.end2end.index.ImmutableIndexIT.testDeleteFromNonPK(ImmutableIndexIT.java:217)
Caused by: org.apache.thrift.TException: Unable to discover transaction service.
at org.apache.phoenix.end2end.index.ImmutableIndexIT.testDeleteFromNonPK(ImmutableIndexIT.java:217)
[ERROR] testDeleteFromPartialPK[ImmutableIndexIT_localIndex=false,transactional=true,columnEncoded=true](org.apache.phoenix.end2end.index.ImmutableIndexIT) Time elapsed: 46.121 s <<< ERROR!
java.lang.RuntimeException: org.apache.thrift.TException: Unable to discover transaction service.
at org.apache.phoenix.end2end.index.ImmutableIndexIT.testDeleteFromPartialPK(ImmutableIndexIT.java:175)
Caused by: org.apache.thrift.TException: Unable to discover transaction service.
at org.apache.phoenix.end2end.index.ImmutableIndexIT.testDeleteFromPartialPK(ImmutableIndexIT.java:175)
[ERROR] testDropIfImmutableKeyValueColumn[ImmutableIndexIT_localIndex=false,transactional=true,columnEncoded=true](org.apache.phoenix.end2end.index.ImmutableIndexIT) Time elapsed: 46.117 s <<< ERROR!
java.lang.RuntimeException: org.apache.thrift.TException: Unable to discover transaction service.
at org.apache.phoenix.end2end.index.ImmutableIndexIT.testDropIfImmutableKeyValueColumn(ImmutableIndexIT.java:132)
Caused by: org.apache.thrift.TException: Unable to discover transaction service.
at org.apache.phoenix.end2end.index.ImmutableIndexIT.testDropIfImmutableKeyValueColumn(ImmutableIndexIT.java:132)
[ERROR] testDeleteFromNonPK[ImmutableIndexIT_localIndex=false,transactional=true,columnEncoded=true](org.apache.phoenix.end2end.index.ImmutableIndexIT) Time elapsed: 46.117 s <<< ERROR!
java.lang.RuntimeException: org.apache.thrift.TException: Unable to discover transaction service.
at org.apache.phoenix.end2end.index.ImmutableIndexIT.testDeleteFromNonPK(ImmutableIndexIT.java:217)
Caused by: org.apache.thrift.TException: Unable to discover transaction service.
at org.apache.phoenix.end2end.index.ImmutableIndexIT.testDeleteFromNonPK(ImmutableIndexIT.java:217)
[ERROR] testDeleteFromPartialPK[ImmutableIndexIT_localIndex=true,transactional=true,columnEncoded=false](org.apache.phoenix.end2end.index.ImmutableIndexIT) Time elapsed: 46.121 s <<< ERROR!
java.lang.RuntimeException: org.apache.thrift.TException: Unable to discover transaction service.
at org.apache.phoenix.end2end.index.ImmutableIndexIT.testDeleteFromPartialPK(ImmutableIndexIT.java:175)
Caused by: org.apache.thrift.TException: Unable to discover transaction service.
at org.apache.phoenix.end2end.index.ImmutableIndexIT.testDeleteFromPartialPK(ImmutableIndexIT.java:175)
[ERROR] testDropIfImmutableKeyValueColumn[ImmutableIndexIT_localIndex=true,transactional=true,columnEncoded=false](org.apache.phoenix.end2end.index.ImmutableIndexIT) Time elapsed: 46.121 s <<< ERROR!
java.lang.RuntimeException: org.apache.thrift.TException: Unable to discover transaction service.
at org.apache.phoenix.end2end.index.ImmutableIndexIT.testDropIfImmutableKeyValueColumn(ImmutableIndexIT.java:132)
Caused by: org.apache.thrift.TException: Unable to discover transaction service.
at org.apache.phoenix.end2end.index.ImmutableIndexIT.testDropIfImmutableKeyValueColumn(ImmutableIndexIT.java:132)
[ERROR] testDeleteFromNonPK[ImmutableIndexIT_localIndex=true,transactional=true,columnEncoded=false](org.apache.phoenix.end2end.index.ImmutableIndexIT) Time elapsed: 46.12 s <<< ERROR!
java.lang.RuntimeException: org.apache.thrift.TException: Unable to discover transaction service.
at org.apache.phoenix.end2end.index.ImmutableIndexIT.testDeleteFromNonPK(ImmutableIndexIT.java:217)
Caused by: org.apache.thrift.TException: Unable to discover transaction service.
at org.apache.phoenix.end2end.index.ImmutableIndexIT.testDeleteFromNonPK(ImmutableIndexIT.java:217)
[ERROR] testDeleteFromPartialPK[ImmutableIndexIT_localIndex=true,transactional=true,columnEncoded=true](org.apache.phoenix.end2end.index.ImmutableIndexIT) Time elapsed: 46.12 s <<< ERROR!
java.lang.RuntimeException: org.apache.thrift.TException: Unable to discover transaction service.
at org.apache.phoenix.end2end.index.ImmutableIndexIT.testDeleteFromPartialPK(ImmutableIndexIT.java:175)
Caused by: org.apache.thrift.TException: Unable to discover transaction service.
at org.apache.phoenix.end2end.index.ImmutableIndexIT.testDeleteFromPartialPK(ImmutableIndexIT.java:175)
[ERROR] testDropIfImmutableKeyValueColumn[ImmutableIndexIT_localIndex=true,transactional=true,columnEncoded=true](org.apache.phoenix.end2end.index.ImmutableIndexIT) Time elapsed: 46.119 s <<< ERROR!
java.lang.RuntimeException: org.apache.thrift.TException: Unable to discover transaction service.
at org.apache.phoenix.end2end.index.ImmutableIndexIT.testDropIfImmutableKeyValueColumn(ImmutableIndexIT.java:132)
Caused by: org.apache.thrift.TException: Unable to discover transaction service.
at org.apache.phoenix.end2end.index.ImmutableIndexIT.testDropIfImmutableKeyValueColumn(ImmutableIndexIT.java:132)
[ERROR] testDeleteFromNonPK[ImmutableIndexIT_localIndex=true,transactional=true,columnEncoded=true](org.apache.phoenix.end2end.index.ImmutableIndexIT) Time elapsed: 46.115 s <<< ERROR!
java.lang.RuntimeException: org.apache.thrift.TException: Unable to discover transaction service.
at org.apache.phoenix.end2end.index.ImmutableIndexIT.testDeleteFromNonPK(ImmutableIndexIT.java:217)
Caused by: org.apache.thrift.TException: Unable to discover transaction service.
at org.apache.phoenix.end2end.index.ImmutableIndexIT.testDeleteFromNonPK(ImmutableIndexIT.java:217)
[INFO]
[INFO] Results:
[INFO]
[ERROR] Errors:
[ERROR] SystemTablePermissionsIT.testNamespaceMappedSystemTables:162 » IO Shutting dow...
[ERROR] SystemTablePermissionsIT.testSystemTablePermissions:104 » IO Shutting down
[ERROR] ImmutableIndexIT.testDeleteFromNonPK:217 » Runtime org.apache.thrift.TExceptio...
[ERROR] ImmutableIndexIT.testDeleteFromNonPK:217 » Runtime org.apache.thrift.TExceptio...
[ERROR] ImmutableIndexIT.testDeleteFromNonPK:217 » Runtime org.apache.thrift.TExceptio...
[ERROR] ImmutableIndexIT.testDeleteFromNonPK:217 » Runtime org.apache.thrift.TExceptio...
[ERROR] ImmutableIndexIT.testDeleteFromPartialPK:175 » Runtime org.apache.thrift.TExce...
[ERROR] ImmutableIndexIT.testDeleteFromPartialPK:175 » Runtime org.apache.thrift.TExce...
[ERROR] ImmutableIndexIT.testDeleteFromPartialPK:175 » Runtime org.apache.thrift.TExce...
[ERROR] ImmutableIndexIT.testDeleteFromPartialPK:175 » Runtime org.apache.thrift.TExce...
[ERROR] ImmutableIndexIT.testDropIfImmutableKeyValueColumn:132 » Runtime org.apache.th...
[ERROR] ImmutableIndexIT.testDropIfImmutableKeyValueColumn:132 » Runtime org.apache.th...
[ERROR] ImmutableIndexIT.testDropIfImmutableKeyValueColumn:132 » Runtime org.apache.th...
[ERROR] ImmutableIndexIT.testDropIfImmutableKeyValueColumn:132 » Runtime org.apache.th...
[INFO]
[ERROR] Tests run: 547, Failures: 0, Errors: 14, Skipped: 46
[INFO]
[INFO]
[INFO] --- maven-failsafe-plugin:2.20:verify (ParallelStatsEnabledTest) @ phoenix-core ---
[INFO] ------------------------------------------------------------------------
[INFO] Reactor Summary:
[INFO]
[INFO] Apache Phoenix ..................................... SUCCESS [ 2.177 s]
[INFO] Phoenix Core ....................................... FAILURE [ 01:56 h]
[INFO] Phoenix - Flume .................................... SKIPPED
[INFO] Phoenix - Kafka .................................... SKIPPED
[INFO] Phoenix - Pig ...................................... SKIPPED
[INFO] Phoenix Query Server Client ........................ SKIPPED
[INFO] Phoenix Query Server ............................... SKIPPED
[INFO] Phoenix - Pherf .................................... SKIPPED
[INFO] Phoenix - Spark .................................... SKIPPED
[INFO] Phoenix - Hive ..................................... SKIPPED
[INFO] Phoenix Client ..................................... SKIPPED
[INFO] Phoenix Server ..................................... SKIPPED
[INFO] Phoenix Assembly ................................... SKIPPED
[INFO] Phoenix - Tracing Web Application .................. SKIPPED
[INFO] Phoenix Load Balancer .............................. SKIPPED
[INFO] ------------------------------------------------------------------------
[INFO] BUILD FAILURE
[INFO] ------------------------------------------------------------------------
[INFO] Total time: 01:56 h
[INFO] Finished at: 2018-02-03T01:50:46Z
[INFO] Final Memory: 61M/844M
[INFO] ------------------------------------------------------------------------
[ERROR] Failed to execute goal org.apache.maven.plugins:maven-failsafe-plugin:2.20:verify (ParallelStatsEnabledTest) on project phoenix-core: There are test failures.
[ERROR]
[ERROR] Please refer to <https://builds.apache.org/job/Phoenix-4.x-HBase-0.98/ws/phoenix-core/target/failsafe-reports> for the individual test results.
[ERROR] Please refer to dump files (if any exist) [date]-jvmRun[N].dump, [date].dumpstream and [date]-jvmRun[N].dumpstream.
[ERROR] -> [Help 1]
[ERROR]
[ERROR] To see the full stack trace of the errors, re-run Maven with the -e switch.
[ERROR] Re-run Maven using the -X switch to enable full debug logging.
[ERROR]
[ERROR] For more information about the errors and possible solutions, please read the following articles:
[ERROR] [Help 1] http://cwiki.apache.org/confluence/display/MAVEN/MojoFailureException
[ERROR]
[ERROR] After correcting the problems, you can resume the build with the command
[ERROR] mvn <goals> -rf :phoenix-core
Build step 'Invoke top-level Maven targets' marked build as failure
Archiving artifacts
Recording test results