You are viewing a plain text version of this content. The canonical link for it is here.
Posted to dev@tika.apache.org by Hong-Thai Nguyen <th...@gmail.com> on 2014/06/24 12:48:07 UTC

Build failed

Hi all,
Sorry about last wrong mail.

I'm unable to build latest snapshot on my Windows. Any idea ?

Thanks


Tests in error:
  initializationError(org.apache.tika.bundle.BundleIT): Problem starting
test co
ntainer.

Tests run: 1, Failures: 0, Errors: 1, Skipped: 0

-------------------------------------------------------------------------------
Test set: org.apache.tika.bundle.BundleIT
-------------------------------------------------------------------------------
Tests run: 1, Failures: 0, Errors: 1, Skipped: 0, Time elapsed: 0.711 sec
<<< FAILURE!
initializationError(org.apache.tika.bundle.BundleIT)  Time elapsed: 0.004
sec  <<< ERROR!
org.ops4j.pax.exam.TestContainerException: Problem starting test container.
at
org.ops4j.pax.exam.nat.internal.NativeTestContainer.start(NativeTestContainer.java:174)
at
org.ops4j.pax.exam.spi.reactors.EagerSingleStagedReactor.<init>(EagerSingleStagedReactor.java:55)
at
org.ops4j.pax.exam.spi.reactors.EagerSingleStagedReactorFactory.create(EagerSingleStagedReactorFactory.java:34)
at
org.ops4j.pax.exam.spi.DefaultExamReactor.stage(DefaultExamReactor.java:83)
at
org.ops4j.pax.exam.junit.JUnit4TestRunner.prepareReactor(JUnit4TestRunner.java:155)
at
org.ops4j.pax.exam.junit.JUnit4TestRunner.<init>(JUnit4TestRunner.java:79)
at sun.reflect.NativeConstructorAccessorImpl.newInstance0(Native Method)
at
sun.reflect.NativeConstructorAccessorImpl.newInstance(NativeConstructorAccessorImpl.java:39)
at
sun.reflect.DelegatingConstructorAccessorImpl.newInstance(DelegatingConstructorAccessorImpl.java:27)
at java.lang.reflect.Constructor.newInstance(Constructor.java:513)
at
org.junit.internal.builders.AnnotatedBuilder.buildRunner(AnnotatedBuilder.java:29)
at
org.junit.internal.builders.AnnotatedBuilder.runnerForClass(AnnotatedBuilder.java:21)
at
org.junit.runners.model.RunnerBuilder.safeRunnerForClass(RunnerBuilder.java:59)
at
org.junit.internal.builders.AllDefaultPossibilitiesBuilder.runnerForClass(AllDefaultPossibilitiesBuilder.java:26)
at
org.junit.runners.model.RunnerBuilder.safeRunnerForClass(RunnerBuilder.java:59)
at org.junit.internal.requests.ClassRequest.getRunner(ClassRequest.java:26)
at
org.apache.maven.surefire.junit4.JUnit4TestSet.execute(JUnit4TestSet.java:51)
at
org.apache.maven.surefire.junit4.JUnit4Provider.executeTestSet(JUnit4Provider.java:123)
at
org.apache.maven.surefire.junit4.JUnit4Provider.invoke(JUnit4Provider.java:104)
at sun.reflect.NativeMethodAccessorImpl.invoke0(Native Method)
at
sun.reflect.NativeMethodAccessorImpl.invoke(NativeMethodAccessorImpl.java:39)
at
sun.reflect.DelegatingMethodAccessorImpl.invoke(DelegatingMethodAccessorImpl.java:25)
at java.lang.reflect.Method.invoke(Method.java:597)
at
org.apache.maven.surefire.util.ReflectionUtils.invokeMethodWithArray(ReflectionUtils.java:164)
at
org.apache.maven.surefire.booter.ProviderFactory$ProviderProxy.invoke(ProviderFactory.java:110)
at
org.apache.maven.surefire.booter.SurefireStarter.invokeProvider(SurefireStarter.java:175)
at
org.apache.maven.surefire.booter.SurefireStarter.runSuitesInProcessWhenForked(SurefireStarter.java:107)
at org.apache.maven.surefire.booter.ForkedBooter.main(ForkedBooter.java:68)
Caused by: org.osgi.framework.BundleException: Unable to cache bundle:
mvn:org.junit/com.springsource.org.junit/4.4.0
at org.apache.felix.framework.Felix.installBundle(Felix.java:2703)
at
org.apache.felix.framework.BundleContextImpl.installBundle(BundleContextImpl.java:165)
at
org.apache.felix.framework.BundleContextImpl.installBundle(BundleContextImpl.java:138)
at
org.ops4j.pax.exam.nat.internal.NativeTestContainer.installAndStartBundles(NativeTestContainer.java:272)
at
org.ops4j.pax.exam.nat.internal.NativeTestContainer.start(NativeTestContainer.java:171)
... 27 more
Caused by: java.lang.IllegalStateException: Stream handler unavailable due
to: null
at
org.apache.felix.framework.URLHandlersStreamHandlerProxy.openConnection(URLHandlersStreamHandlerProxy.java:311)
at java.net.URL.openConnection(URL.java:945)
at
org.apache.felix.framework.cache.JarRevision.initialize(JarRevision.java:150)
at org.apache.felix.framework.cache.JarRevision.<init>(JarRevision.java:77)
at
org.apache.felix.framework.cache.BundleArchive.createRevisionFromLocation(BundleArchive.java:878)
at
org.apache.felix.framework.cache.BundleArchive.reviseInternal(BundleArchive.java:550)
at
org.apache.felix.framework.cache.BundleArchive.<init>(BundleArchive.java:153)
at org.apache.felix.framework.cache.BundleCache.create(BundleCache.java:277)
at org.apache.felix.framework.Felix.installBundle(Felix.java:2699)
... 31 more

--------------
Hong-Thai

Re: Build failed

Posted by Tyler Palsulich <tp...@gmail.com>.
Hi Hong-Thai,

What version of Java do you have? It seems like this isn't a Tika issue,
but one of its dependencies. Can you try deleting your Maven cache and
running `mvn clean install`?

Tyler


On Tue, Jun 24, 2014 at 3:48 AM, Hong-Thai Nguyen <th...@gmail.com>
wrote:

> Hi all,
> Sorry about last wrong mail.
>
> I'm unable to build latest snapshot on my Windows. Any idea ?
>
> Thanks
>
>
> Tests in error:
>   initializationError(org.apache.tika.bundle.BundleIT): Problem starting
> test co
> ntainer.
>
> Tests run: 1, Failures: 0, Errors: 1, Skipped: 0
>
>
> -------------------------------------------------------------------------------
> Test set: org.apache.tika.bundle.BundleIT
>
> -------------------------------------------------------------------------------
> Tests run: 1, Failures: 0, Errors: 1, Skipped: 0, Time elapsed: 0.711 sec
> <<< FAILURE!
> initializationError(org.apache.tika.bundle.BundleIT)  Time elapsed: 0.004
> sec  <<< ERROR!
> org.ops4j.pax.exam.TestContainerException: Problem starting test container.
> at
>
> org.ops4j.pax.exam.nat.internal.NativeTestContainer.start(NativeTestContainer.java:174)
> at
>
> org.ops4j.pax.exam.spi.reactors.EagerSingleStagedReactor.<init>(EagerSingleStagedReactor.java:55)
> at
>
> org.ops4j.pax.exam.spi.reactors.EagerSingleStagedReactorFactory.create(EagerSingleStagedReactorFactory.java:34)
> at
> org.ops4j.pax.exam.spi.DefaultExamReactor.stage(DefaultExamReactor.java:83)
> at
>
> org.ops4j.pax.exam.junit.JUnit4TestRunner.prepareReactor(JUnit4TestRunner.java:155)
> at
> org.ops4j.pax.exam.junit.JUnit4TestRunner.<init>(JUnit4TestRunner.java:79)
> at sun.reflect.NativeConstructorAccessorImpl.newInstance0(Native Method)
> at
>
> sun.reflect.NativeConstructorAccessorImpl.newInstance(NativeConstructorAccessorImpl.java:39)
> at
>
> sun.reflect.DelegatingConstructorAccessorImpl.newInstance(DelegatingConstructorAccessorImpl.java:27)
> at java.lang.reflect.Constructor.newInstance(Constructor.java:513)
> at
>
> org.junit.internal.builders.AnnotatedBuilder.buildRunner(AnnotatedBuilder.java:29)
> at
>
> org.junit.internal.builders.AnnotatedBuilder.runnerForClass(AnnotatedBuilder.java:21)
> at
>
> org.junit.runners.model.RunnerBuilder.safeRunnerForClass(RunnerBuilder.java:59)
> at
>
> org.junit.internal.builders.AllDefaultPossibilitiesBuilder.runnerForClass(AllDefaultPossibilitiesBuilder.java:26)
> at
>
> org.junit.runners.model.RunnerBuilder.safeRunnerForClass(RunnerBuilder.java:59)
> at org.junit.internal.requests.ClassRequest.getRunner(ClassRequest.java:26)
> at
>
> org.apache.maven.surefire.junit4.JUnit4TestSet.execute(JUnit4TestSet.java:51)
> at
>
> org.apache.maven.surefire.junit4.JUnit4Provider.executeTestSet(JUnit4Provider.java:123)
> at
>
> org.apache.maven.surefire.junit4.JUnit4Provider.invoke(JUnit4Provider.java:104)
> at sun.reflect.NativeMethodAccessorImpl.invoke0(Native Method)
> at
>
> sun.reflect.NativeMethodAccessorImpl.invoke(NativeMethodAccessorImpl.java:39)
> at
>
> sun.reflect.DelegatingMethodAccessorImpl.invoke(DelegatingMethodAccessorImpl.java:25)
> at java.lang.reflect.Method.invoke(Method.java:597)
> at
>
> org.apache.maven.surefire.util.ReflectionUtils.invokeMethodWithArray(ReflectionUtils.java:164)
> at
>
> org.apache.maven.surefire.booter.ProviderFactory$ProviderProxy.invoke(ProviderFactory.java:110)
> at
>
> org.apache.maven.surefire.booter.SurefireStarter.invokeProvider(SurefireStarter.java:175)
> at
>
> org.apache.maven.surefire.booter.SurefireStarter.runSuitesInProcessWhenForked(SurefireStarter.java:107)
> at org.apache.maven.surefire.booter.ForkedBooter.main(ForkedBooter.java:68)
> Caused by: org.osgi.framework.BundleException: Unable to cache bundle:
> mvn:org.junit/com.springsource.org.junit/4.4.0
> at org.apache.felix.framework.Felix.installBundle(Felix.java:2703)
> at
>
> org.apache.felix.framework.BundleContextImpl.installBundle(BundleContextImpl.java:165)
> at
>
> org.apache.felix.framework.BundleContextImpl.installBundle(BundleContextImpl.java:138)
> at
>
> org.ops4j.pax.exam.nat.internal.NativeTestContainer.installAndStartBundles(NativeTestContainer.java:272)
> at
>
> org.ops4j.pax.exam.nat.internal.NativeTestContainer.start(NativeTestContainer.java:171)
> ... 27 more
> Caused by: java.lang.IllegalStateException: Stream handler unavailable due
> to: null
> at
>
> org.apache.felix.framework.URLHandlersStreamHandlerProxy.openConnection(URLHandlersStreamHandlerProxy.java:311)
> at java.net.URL.openConnection(URL.java:945)
> at
>
> org.apache.felix.framework.cache.JarRevision.initialize(JarRevision.java:150)
> at org.apache.felix.framework.cache.JarRevision.<init>(JarRevision.java:77)
> at
>
> org.apache.felix.framework.cache.BundleArchive.createRevisionFromLocation(BundleArchive.java:878)
> at
>
> org.apache.felix.framework.cache.BundleArchive.reviseInternal(BundleArchive.java:550)
> at
>
> org.apache.felix.framework.cache.BundleArchive.<init>(BundleArchive.java:153)
> at
> org.apache.felix.framework.cache.BundleCache.create(BundleCache.java:277)
> at org.apache.felix.framework.Felix.installBundle(Felix.java:2699)
> ... 31 more
>
> --------------
> Hong-Thai
>