You are viewing a plain text version of this content. The canonical link for it is here.
Posted to dev@cloudstack.apache.org by Bharat Kumar <bh...@citrix.com> on 2016/02/25 06:27:58 UTC

Re: ACS CI BVT RUN: xenserver: Pr_number: 1417

On 24-Feb-2016, at 10:24 PM, jenkins-ccp@citrix.com<ma...@citrix.com> wrote:

[http://jenkins-ccp.citrix.com/static/e59dfe28/images/32x32/red.gif]    BUILD FAILURE
Build Start Date:       Wed Feb 24 06:29:34 2016
Git Repo Url:   https://github.com/apache/cloudstack.git
Git Commit Id:  9d89229942436d98f4897d8030f95bb8702bf
Git Branch Info:        1417
Hyper Visor Info:       xenserver
Build No:       11
Health Report
W       Description     Score
[http://jenkins-ccp.citrix.com//static/d7293164/images/16x16/health-00to19.png] Build stability: All recent builds failed.      0
[http://jenkins-ccp.citrix.com//static/d7293164/images/16x16/health-80plus.png] Test Result: 22 tests failing out of a total of 142 tests.      84

<http://jenkins-ccp.citrix.com/job/report_generator_11_zone-xen_XenServer.xml/1//changes>
Changes
No Changes

<http://jenkins-ccp.citrix.com/job/report_generator_11_zone-xen_XenServer.xml/1//testReport>
Test Result
Package Failed  Passed  Skipped Total
< tt=""><>      2       0       0       2
:teardown
:setup
integration.smoke.test_affinity_groups  0       1       0       1
integration.smoke.test_affinity_groups_projects 0       1       0       1
integration.smoke.test_deploy_vgpu_enabled_vm   0       0       1       1
integration.smoke.test_deploy_vm_iso    0       1       0       1
integration.smoke.test_deploy_vm_root_resize    0       3       0       3
integration.smoke.test_deploy_vm_with_userdata  0       2       0       2
integration.smoke.test_deploy_vms_with_varied_deploymentplanners        0       3       0       3
integration.smoke.test_disk_offerings   0       5       0       5
integration.smoke.test_global_settings  0       1       0       1
integration.smoke.test_guest_vlan_range 1       0       0       1
integration.smoke.test_guest_vlan_range.TestDedicateGuestVlanRange.test_dedicateGuestVlanRange
integration.smoke.test_internal_lb      0       4       0       4
integration.smoke.test_iso      2       4       1       7
integration.smoke.test_iso.TestISO.test_04_extract_Iso
integration.smoke.test_iso.TestISO.test_07_list_default_iso
integration.smoke.test_loadbalance      0       3       0       3
integration.smoke.test_multipleips_per_nic      0       1       0       1
integration.smoke.test_network  0       10      0       10
integration.smoke.test_network_acl      0       1       0       1
integration.smoke.test_nic      0       1       0       1
integration.smoke.test_nic_adapter_type 0       0       1       1
integration.smoke.test_non_contigiousvlan       0       1       0       1
integration.smoke.test_over_provisioning        0       1       0       1
integration.smoke.test_password_server  1       0       0       1
integration.smoke.test_password_server.TestIsolatedNetworksPasswdServer.test_isolate_network_password_server
integration.smoke.test_portable_publicip        0       2       0       2
integration.smoke.test_primary_storage  1       1       0       2
integration.smoke.test_primary_storage.TestPrimaryStorageServices.test_01_primary_storage_iscsi
integration.smoke.test_privategw_acl    3       1       0       4
integration.smoke.test_privategw_acl.TestPrivateGwACL.test_02_vpc_privategw_static_routes
integration.smoke.test_privategw_acl.TestPrivateGwACL.test_03_vpc_privategw_restart_vpc_cleanup
integration.smoke.test_privategw_acl.TestPrivateGwACL.test_04_rvpc_privategw_static_routes
integration.smoke.test_public_ip_range  0       1       0       1
integration.smoke.test_pvlan    0       1       0       1
integration.smoke.test_regions  0       1       0       1
integration.smoke.test_reset_vm_on_reboot       0       1       0       1
integration.smoke.test_resource_detail  0       1       0       1
integration.smoke.test_router_dhcphosts 1       0       0       1
integration.smoke.test_router_dhcphosts.TestRouterDHCPHosts.test_router_dhcphosts
integration.smoke.test_routers  0       9       0       9
integration.smoke.test_routers_iptables_default_policy  0       2       0       2
integration.smoke.test_routers_network_ops      3       2       0       5
integration.smoke.test_routers_network_ops.TestIsolatedNetworks.test_01_isolate_network_FW_PF_default_routes_egress_true
integration.smoke.test_routers_network_ops.TestRedundantIsolateNetworks.test_01_RVR_Network_FW_PF_SSH_default_routes_egress_true
integration.smoke.test_routers_network_ops.TestRedundantIsolateNetworks.test_02_RVR_Network_FW_PF_SSH_default_routes_egress_false
integration.smoke.test_scale_vm 0       1       0       1
integration.smoke.test_secondary_storage        0       2       0       2
integration.smoke.test_service_offerings        0       4       0       4
integration.smoke.test_snapshots        0       1       0       1
integration.smoke.test_ssvm     0       10      0       10
integration.smoke.test_templates        1       7       1       9
integration.smoke.test_templates.TestTemplates.test_04_extract_template
integration.smoke.test_vm_life_cycle    1       10      0       11
integration.smoke.test_vm_life_cycle.TestVMLifeCycle.test_08_migrate_vm
integration.smoke.test_vm_snapshots     1       3       0       4
integration.smoke.test_vm_snapshots.TestSnapshots.test_01_test_vm_volume_snapshot
integration.smoke.test_volumes  0       9       0       9
integration.smoke.test_vpc_redundant    4       1       0       5
integration.smoke.test_vpc_redundant.TestVPCRedundancy.test_01_create_redundant_VPC_2tiers_4VMs_4IPs_4PF_ACL
integration.smoke.test_vpc_redundant.TestVPCRedundancy.test_02_redundant_VPC_default_routes
integration.smoke.test_vpc_redundant.TestVPCRedundancy.test_04_rvpc_network_garbage_collector_nics
integration.smoke.test_vpc_redundant.TestVPCRedundancy.test_05_rvpc_multi_tiers
integration.smoke.test_vpc_router_nics  1       1       0       2
integration.smoke.test_vpc_router_nics.TestVPCNics.test_02_VPC_default_routes
integration.smoke.test_vpc_vpn  0       2       0       2

<http://jenkins-ccp.citrix.com/job/report_generator_11_zone-xen_XenServer.xml/1//console>
Console Output
[...truncated 1065 lines...]
adding: test_privategw_acl.xml (deflated 95%)
adding: test_guest_vlan_range.xml (deflated 88%)
adding: test_scale_vm.xml (deflated 33%)
adding: test_service_offerings.xml (deflated 73%)
adding: test_hosts.xml (deflated 21%)
adding: test_router_dhcphosts.xml (deflated 95%)
adding: test_routers_iptables_default_policy.xml (deflated 93%)
adding: test_loadbalance.xml (deflated 98%)
adding: test_routers.xml (deflated 80%)
adding: test_reset_vm_on_reboot.xml (deflated 35%)
adding: test_nic_adapter_type.xml (deflated 39%)
adding: test_primary_storage.xml (deflated 87%)
adding: test_snapshots.xml (deflated 50%)
adding: test_deploy_vms_with_varied_deploymentplanners.xml (deflated 64%)
adding: test_network.xml (deflated 97%)
adding: test_non_contigiousvlan.xml (deflated 33%)
adding: test_deploy_vm_iso.xml (deflated 32%)
adding: test_public_ip_range.xml (deflated 35%)
adding: test_multipleips_per_nic.xml (deflated 31%)
adding: test_usage_events.xml (deflated 21%)
adding: test_regions.xml (deflated 34%)
adding: test_affinity_groups.xml (deflated 35%)
adding: test_network_acl.xml (deflated 33%)
adding: test_pvlan.xml (deflated 31%)
adding: test_volumes.xml (deflated 90%)
adding: test_ssvm.xml (deflated 94%)
adding: test_internal_lb.xml (deflated 93%)
adding: test_nic.xml (deflated 31%)
adding: test_deploy_vm_root_resize.xml (deflated 64%)
adding: test_resource_detail.xml (deflated 34%)
adding: test_secondary_storage.xml (deflated 50%)
adding: test_deploy_vgpu_enabled_vm.xml (deflated 47%)
adding: test_password_server.xml (deflated 96%)
adding: test_vm_life_cycle.xml (deflated 92%)
adding: test_routers_network_ops.xml (deflated 95%)
adding: test_templates.xml (deflated 86%)
adding: test_iso.xml (deflated 88%)
adding: test_disk_offerings.xml (deflated 72%)
+ cp -rf /automation/jenkins/workspace/report_generator_11_zone-xen_XenServer.xml/tmp/test_results.zip $'\342\200\234/mnt/test_result_archive/1417/xenserver'
+ ssh -o UserKnownHostsFile=/dev/null -o StrictHostKeyChecking=no root@10.147.28.221<ma...@10.147.28.221> mkdir -p /tmp/management_11/management
Warning: Permanently added '10.147.28.221' (RSA) to the list of known hosts.
Permission denied, please try again.
Permission denied, please try again.
Permission denied (publickey,gssapi-keyex,gssapi-with-mic,password).
Build step 'Execute shell' marked build as failure
Recording test results
Email was triggered for: Regression
Email was triggered for: Failure
Sending email for trigger: Regression


Re: ACS CI BVT RUN: xenserver: Pr_number: 1417

Posted by Bharat Kumar <bh...@citrix.com>.
Hi seboga,

i replied inline.

Thanks,
Bharat.

> On 25-Feb-2016, at 2:09 PM, sebgoa <ru...@gmail.com> wrote:
> 
> Bharat, that’s great, thanks for this
> 
> But…
> 
> Since this is the first results like this sent to the list, can you explain what we are looking at.
> What hardware this is running on, what configuration of cloudstack…

Currently the tests are bing run using xenserver, the test setup consists of 3 xen hosts across 2 clusters and the networking type is advanced.
I will add some of these details to the report as well.

> 
> And I very much would like for these results to be sent as comments to the PR discussion,
> if it cannot be done we need to push ASF infra to make it happen

I totally agree with you, I started on it, but before that I am thinking we need to somehow make the test run logs available. once this is complete 
i will enhance this to post directly on the PR.

> 
> 
> 
>> On Feb 25, 2016, at 6:27 AM, Bharat Kumar <bh...@citrix.com> wrote:
>> 
>> 
>> On 24-Feb-2016, at 10:24 PM, jenkins-ccp@citrix.com<ma...@citrix.com> wrote:
>> 
>> [http://jenkins-ccp.citrix.com/static/e59dfe28/images/32x32/red.gif]    BUILD FAILURE
>> Build Start Date:       Wed Feb 24 06:29:34 2016
>> Git Repo Url:   https://github.com/apache/cloudstack.git
>> Git Commit Id:  9d89229942436d98f4897d8030f95bb8702bf
>> Git Branch Info:        1417
>> Hyper Visor Info:       xenserver
>> Build No:       11
>> Health Report
>> W       Description     Score
>> [http://jenkins-ccp.citrix.com//static/d7293164/images/16x16/health-00to19.png] Build stability: All recent builds failed.      0
>> [http://jenkins-ccp.citrix.com//static/d7293164/images/16x16/health-80plus.png] Test Result: 22 tests failing out of a total of 142 tests.      84
>> 
>> <http://jenkins-ccp.citrix.com/job/report_generator_11_zone-xen_XenServer.xml/1//changes>
>> Changes
>> No Changes
>> 
>> <http://jenkins-ccp.citrix.com/job/report_generator_11_zone-xen_XenServer.xml/1//testReport>
>> Test Result
>> Package Failed  Passed  Skipped Total
>> < tt=""><>      2       0       0       2
>> :teardown
>> :setup
>> integration.smoke.test_affinity_groups  0       1       0       1
>> integration.smoke.test_affinity_groups_projects 0       1       0       1
>> integration.smoke.test_deploy_vgpu_enabled_vm   0       0       1       1
>> integration.smoke.test_deploy_vm_iso    0       1       0       1
>> integration.smoke.test_deploy_vm_root_resize    0       3       0       3
>> integration.smoke.test_deploy_vm_with_userdata  0       2       0       2
>> integration.smoke.test_deploy_vms_with_varied_deploymentplanners        0       3       0       3
>> integration.smoke.test_disk_offerings   0       5       0       5
>> integration.smoke.test_global_settings  0       1       0       1
>> integration.smoke.test_guest_vlan_range 1       0       0       1
>> integration.smoke.test_guest_vlan_range.TestDedicateGuestVlanRange.test_dedicateGuestVlanRange
>> integration.smoke.test_internal_lb      0       4       0       4
>> integration.smoke.test_iso      2       4       1       7
>> integration.smoke.test_iso.TestISO.test_04_extract_Iso
>> integration.smoke.test_iso.TestISO.test_07_list_default_iso
>> integration.smoke.test_loadbalance      0       3       0       3
>> integration.smoke.test_multipleips_per_nic      0       1       0       1
>> integration.smoke.test_network  0       10      0       10
>> integration.smoke.test_network_acl      0       1       0       1
>> integration.smoke.test_nic      0       1       0       1
>> integration.smoke.test_nic_adapter_type 0       0       1       1
>> integration.smoke.test_non_contigiousvlan       0       1       0       1
>> integration.smoke.test_over_provisioning        0       1       0       1
>> integration.smoke.test_password_server  1       0       0       1
>> integration.smoke.test_password_server.TestIsolatedNetworksPasswdServer.test_isolate_network_password_server
>> integration.smoke.test_portable_publicip        0       2       0       2
>> integration.smoke.test_primary_storage  1       1       0       2
>> integration.smoke.test_primary_storage.TestPrimaryStorageServices.test_01_primary_storage_iscsi
>> integration.smoke.test_privategw_acl    3       1       0       4
>> integration.smoke.test_privategw_acl.TestPrivateGwACL.test_02_vpc_privategw_static_routes
>> integration.smoke.test_privategw_acl.TestPrivateGwACL.test_03_vpc_privategw_restart_vpc_cleanup
>> integration.smoke.test_privategw_acl.TestPrivateGwACL.test_04_rvpc_privategw_static_routes
>> integration.smoke.test_public_ip_range  0       1       0       1
>> integration.smoke.test_pvlan    0       1       0       1
>> integration.smoke.test_regions  0       1       0       1
>> integration.smoke.test_reset_vm_on_reboot       0       1       0       1
>> integration.smoke.test_resource_detail  0       1       0       1
>> integration.smoke.test_router_dhcphosts 1       0       0       1
>> integration.smoke.test_router_dhcphosts.TestRouterDHCPHosts.test_router_dhcphosts
>> integration.smoke.test_routers  0       9       0       9
>> integration.smoke.test_routers_iptables_default_policy  0       2       0       2
>> integration.smoke.test_routers_network_ops      3       2       0       5
>> integration.smoke.test_routers_network_ops.TestIsolatedNetworks.test_01_isolate_network_FW_PF_default_routes_egress_true
>> integration.smoke.test_routers_network_ops.TestRedundantIsolateNetworks.test_01_RVR_Network_FW_PF_SSH_default_routes_egress_true
>> integration.smoke.test_routers_network_ops.TestRedundantIsolateNetworks.test_02_RVR_Network_FW_PF_SSH_default_routes_egress_false
>> integration.smoke.test_scale_vm 0       1       0       1
>> integration.smoke.test_secondary_storage        0       2       0       2
>> integration.smoke.test_service_offerings        0       4       0       4
>> integration.smoke.test_snapshots        0       1       0       1
>> integration.smoke.test_ssvm     0       10      0       10
>> integration.smoke.test_templates        1       7       1       9
>> integration.smoke.test_templates.TestTemplates.test_04_extract_template
>> integration.smoke.test_vm_life_cycle    1       10      0       11
>> integration.smoke.test_vm_life_cycle.TestVMLifeCycle.test_08_migrate_vm
>> integration.smoke.test_vm_snapshots     1       3       0       4
>> integration.smoke.test_vm_snapshots.TestSnapshots.test_01_test_vm_volume_snapshot
>> integration.smoke.test_volumes  0       9       0       9
>> integration.smoke.test_vpc_redundant    4       1       0       5
>> integration.smoke.test_vpc_redundant.TestVPCRedundancy.test_01_create_redundant_VPC_2tiers_4VMs_4IPs_4PF_ACL
>> integration.smoke.test_vpc_redundant.TestVPCRedundancy.test_02_redundant_VPC_default_routes
>> integration.smoke.test_vpc_redundant.TestVPCRedundancy.test_04_rvpc_network_garbage_collector_nics
>> integration.smoke.test_vpc_redundant.TestVPCRedundancy.test_05_rvpc_multi_tiers
>> integration.smoke.test_vpc_router_nics  1       1       0       2
>> integration.smoke.test_vpc_router_nics.TestVPCNics.test_02_VPC_default_routes
>> integration.smoke.test_vpc_vpn  0       2       0       2
>> 
>> <http://jenkins-ccp.citrix.com/job/report_generator_11_zone-xen_XenServer.xml/1//console>
>> Console Output
>> [...truncated 1065 lines...]
>> adding: test_privategw_acl.xml (deflated 95%)
>> adding: test_guest_vlan_range.xml (deflated 88%)
>> adding: test_scale_vm.xml (deflated 33%)
>> adding: test_service_offerings.xml (deflated 73%)
>> adding: test_hosts.xml (deflated 21%)
>> adding: test_router_dhcphosts.xml (deflated 95%)
>> adding: test_routers_iptables_default_policy.xml (deflated 93%)
>> adding: test_loadbalance.xml (deflated 98%)
>> adding: test_routers.xml (deflated 80%)
>> adding: test_reset_vm_on_reboot.xml (deflated 35%)
>> adding: test_nic_adapter_type.xml (deflated 39%)
>> adding: test_primary_storage.xml (deflated 87%)
>> adding: test_snapshots.xml (deflated 50%)
>> adding: test_deploy_vms_with_varied_deploymentplanners.xml (deflated 64%)
>> adding: test_network.xml (deflated 97%)
>> adding: test_non_contigiousvlan.xml (deflated 33%)
>> adding: test_deploy_vm_iso.xml (deflated 32%)
>> adding: test_public_ip_range.xml (deflated 35%)
>> adding: test_multipleips_per_nic.xml (deflated 31%)
>> adding: test_usage_events.xml (deflated 21%)
>> adding: test_regions.xml (deflated 34%)
>> adding: test_affinity_groups.xml (deflated 35%)
>> adding: test_network_acl.xml (deflated 33%)
>> adding: test_pvlan.xml (deflated 31%)
>> adding: test_volumes.xml (deflated 90%)
>> adding: test_ssvm.xml (deflated 94%)
>> adding: test_internal_lb.xml (deflated 93%)
>> adding: test_nic.xml (deflated 31%)
>> adding: test_deploy_vm_root_resize.xml (deflated 64%)
>> adding: test_resource_detail.xml (deflated 34%)
>> adding: test_secondary_storage.xml (deflated 50%)
>> adding: test_deploy_vgpu_enabled_vm.xml (deflated 47%)
>> adding: test_password_server.xml (deflated 96%)
>> adding: test_vm_life_cycle.xml (deflated 92%)
>> adding: test_routers_network_ops.xml (deflated 95%)
>> adding: test_templates.xml (deflated 86%)
>> adding: test_iso.xml (deflated 88%)
>> adding: test_disk_offerings.xml (deflated 72%)
>> + cp -rf /automation/jenkins/workspace/report_generator_11_zone-xen_XenServer.xml/tmp/test_results.zip $'\342\200\234/mnt/test_result_archive/1417/xenserver'
>> + ssh -o UserKnownHostsFile=/dev/null -o StrictHostKeyChecking=no root@10.147.28.221<ma...@10.147.28.221> mkdir -p /tmp/management_11/management
>> Warning: Permanently added '10.147.28.221' (RSA) to the list of known hosts.
>> Permission denied, please try again.
>> Permission denied, please try again.
>> Permission denied (publickey,gssapi-keyex,gssapi-with-mic,password).
>> Build step 'Execute shell' marked build as failure
>> Recording test results
>> Email was triggered for: Regression
>> Email was triggered for: Failure
>> Sending email for trigger: Regression
>> 
> 


Re: ACS CI BVT RUN: xenserver: Pr_number: 1417

Posted by sebgoa <ru...@gmail.com>.
Bharat, that’s great, thanks for this

But…

Since this is the first results like this sent to the list, can you explain what we are looking at.
What hardware this is running on, what configuration of cloudstack…

And I very much would like for these results to be sent as comments to the PR discussion,
if it cannot be done we need to push ASF infra to make it happen



> On Feb 25, 2016, at 6:27 AM, Bharat Kumar <bh...@citrix.com> wrote:
> 
> 
> On 24-Feb-2016, at 10:24 PM, jenkins-ccp@citrix.com<ma...@citrix.com> wrote:
> 
> [http://jenkins-ccp.citrix.com/static/e59dfe28/images/32x32/red.gif]    BUILD FAILURE
> Build Start Date:       Wed Feb 24 06:29:34 2016
> Git Repo Url:   https://github.com/apache/cloudstack.git
> Git Commit Id:  9d89229942436d98f4897d8030f95bb8702bf
> Git Branch Info:        1417
> Hyper Visor Info:       xenserver
> Build No:       11
> Health Report
> W       Description     Score
> [http://jenkins-ccp.citrix.com//static/d7293164/images/16x16/health-00to19.png] Build stability: All recent builds failed.      0
> [http://jenkins-ccp.citrix.com//static/d7293164/images/16x16/health-80plus.png] Test Result: 22 tests failing out of a total of 142 tests.      84
> 
> <http://jenkins-ccp.citrix.com/job/report_generator_11_zone-xen_XenServer.xml/1//changes>
> Changes
> No Changes
> 
> <http://jenkins-ccp.citrix.com/job/report_generator_11_zone-xen_XenServer.xml/1//testReport>
> Test Result
> Package Failed  Passed  Skipped Total
> < tt=""><>      2       0       0       2
> :teardown
> :setup
> integration.smoke.test_affinity_groups  0       1       0       1
> integration.smoke.test_affinity_groups_projects 0       1       0       1
> integration.smoke.test_deploy_vgpu_enabled_vm   0       0       1       1
> integration.smoke.test_deploy_vm_iso    0       1       0       1
> integration.smoke.test_deploy_vm_root_resize    0       3       0       3
> integration.smoke.test_deploy_vm_with_userdata  0       2       0       2
> integration.smoke.test_deploy_vms_with_varied_deploymentplanners        0       3       0       3
> integration.smoke.test_disk_offerings   0       5       0       5
> integration.smoke.test_global_settings  0       1       0       1
> integration.smoke.test_guest_vlan_range 1       0       0       1
> integration.smoke.test_guest_vlan_range.TestDedicateGuestVlanRange.test_dedicateGuestVlanRange
> integration.smoke.test_internal_lb      0       4       0       4
> integration.smoke.test_iso      2       4       1       7
> integration.smoke.test_iso.TestISO.test_04_extract_Iso
> integration.smoke.test_iso.TestISO.test_07_list_default_iso
> integration.smoke.test_loadbalance      0       3       0       3
> integration.smoke.test_multipleips_per_nic      0       1       0       1
> integration.smoke.test_network  0       10      0       10
> integration.smoke.test_network_acl      0       1       0       1
> integration.smoke.test_nic      0       1       0       1
> integration.smoke.test_nic_adapter_type 0       0       1       1
> integration.smoke.test_non_contigiousvlan       0       1       0       1
> integration.smoke.test_over_provisioning        0       1       0       1
> integration.smoke.test_password_server  1       0       0       1
> integration.smoke.test_password_server.TestIsolatedNetworksPasswdServer.test_isolate_network_password_server
> integration.smoke.test_portable_publicip        0       2       0       2
> integration.smoke.test_primary_storage  1       1       0       2
> integration.smoke.test_primary_storage.TestPrimaryStorageServices.test_01_primary_storage_iscsi
> integration.smoke.test_privategw_acl    3       1       0       4
> integration.smoke.test_privategw_acl.TestPrivateGwACL.test_02_vpc_privategw_static_routes
> integration.smoke.test_privategw_acl.TestPrivateGwACL.test_03_vpc_privategw_restart_vpc_cleanup
> integration.smoke.test_privategw_acl.TestPrivateGwACL.test_04_rvpc_privategw_static_routes
> integration.smoke.test_public_ip_range  0       1       0       1
> integration.smoke.test_pvlan    0       1       0       1
> integration.smoke.test_regions  0       1       0       1
> integration.smoke.test_reset_vm_on_reboot       0       1       0       1
> integration.smoke.test_resource_detail  0       1       0       1
> integration.smoke.test_router_dhcphosts 1       0       0       1
> integration.smoke.test_router_dhcphosts.TestRouterDHCPHosts.test_router_dhcphosts
> integration.smoke.test_routers  0       9       0       9
> integration.smoke.test_routers_iptables_default_policy  0       2       0       2
> integration.smoke.test_routers_network_ops      3       2       0       5
> integration.smoke.test_routers_network_ops.TestIsolatedNetworks.test_01_isolate_network_FW_PF_default_routes_egress_true
> integration.smoke.test_routers_network_ops.TestRedundantIsolateNetworks.test_01_RVR_Network_FW_PF_SSH_default_routes_egress_true
> integration.smoke.test_routers_network_ops.TestRedundantIsolateNetworks.test_02_RVR_Network_FW_PF_SSH_default_routes_egress_false
> integration.smoke.test_scale_vm 0       1       0       1
> integration.smoke.test_secondary_storage        0       2       0       2
> integration.smoke.test_service_offerings        0       4       0       4
> integration.smoke.test_snapshots        0       1       0       1
> integration.smoke.test_ssvm     0       10      0       10
> integration.smoke.test_templates        1       7       1       9
> integration.smoke.test_templates.TestTemplates.test_04_extract_template
> integration.smoke.test_vm_life_cycle    1       10      0       11
> integration.smoke.test_vm_life_cycle.TestVMLifeCycle.test_08_migrate_vm
> integration.smoke.test_vm_snapshots     1       3       0       4
> integration.smoke.test_vm_snapshots.TestSnapshots.test_01_test_vm_volume_snapshot
> integration.smoke.test_volumes  0       9       0       9
> integration.smoke.test_vpc_redundant    4       1       0       5
> integration.smoke.test_vpc_redundant.TestVPCRedundancy.test_01_create_redundant_VPC_2tiers_4VMs_4IPs_4PF_ACL
> integration.smoke.test_vpc_redundant.TestVPCRedundancy.test_02_redundant_VPC_default_routes
> integration.smoke.test_vpc_redundant.TestVPCRedundancy.test_04_rvpc_network_garbage_collector_nics
> integration.smoke.test_vpc_redundant.TestVPCRedundancy.test_05_rvpc_multi_tiers
> integration.smoke.test_vpc_router_nics  1       1       0       2
> integration.smoke.test_vpc_router_nics.TestVPCNics.test_02_VPC_default_routes
> integration.smoke.test_vpc_vpn  0       2       0       2
> 
> <http://jenkins-ccp.citrix.com/job/report_generator_11_zone-xen_XenServer.xml/1//console>
> Console Output
> [...truncated 1065 lines...]
> adding: test_privategw_acl.xml (deflated 95%)
> adding: test_guest_vlan_range.xml (deflated 88%)
> adding: test_scale_vm.xml (deflated 33%)
> adding: test_service_offerings.xml (deflated 73%)
> adding: test_hosts.xml (deflated 21%)
> adding: test_router_dhcphosts.xml (deflated 95%)
> adding: test_routers_iptables_default_policy.xml (deflated 93%)
> adding: test_loadbalance.xml (deflated 98%)
> adding: test_routers.xml (deflated 80%)
> adding: test_reset_vm_on_reboot.xml (deflated 35%)
> adding: test_nic_adapter_type.xml (deflated 39%)
> adding: test_primary_storage.xml (deflated 87%)
> adding: test_snapshots.xml (deflated 50%)
> adding: test_deploy_vms_with_varied_deploymentplanners.xml (deflated 64%)
> adding: test_network.xml (deflated 97%)
> adding: test_non_contigiousvlan.xml (deflated 33%)
> adding: test_deploy_vm_iso.xml (deflated 32%)
> adding: test_public_ip_range.xml (deflated 35%)
> adding: test_multipleips_per_nic.xml (deflated 31%)
> adding: test_usage_events.xml (deflated 21%)
> adding: test_regions.xml (deflated 34%)
> adding: test_affinity_groups.xml (deflated 35%)
> adding: test_network_acl.xml (deflated 33%)
> adding: test_pvlan.xml (deflated 31%)
> adding: test_volumes.xml (deflated 90%)
> adding: test_ssvm.xml (deflated 94%)
> adding: test_internal_lb.xml (deflated 93%)
> adding: test_nic.xml (deflated 31%)
> adding: test_deploy_vm_root_resize.xml (deflated 64%)
> adding: test_resource_detail.xml (deflated 34%)
> adding: test_secondary_storage.xml (deflated 50%)
> adding: test_deploy_vgpu_enabled_vm.xml (deflated 47%)
> adding: test_password_server.xml (deflated 96%)
> adding: test_vm_life_cycle.xml (deflated 92%)
> adding: test_routers_network_ops.xml (deflated 95%)
> adding: test_templates.xml (deflated 86%)
> adding: test_iso.xml (deflated 88%)
> adding: test_disk_offerings.xml (deflated 72%)
> + cp -rf /automation/jenkins/workspace/report_generator_11_zone-xen_XenServer.xml/tmp/test_results.zip $'\342\200\234/mnt/test_result_archive/1417/xenserver'
> + ssh -o UserKnownHostsFile=/dev/null -o StrictHostKeyChecking=no root@10.147.28.221<ma...@10.147.28.221> mkdir -p /tmp/management_11/management
> Warning: Permanently added '10.147.28.221' (RSA) to the list of known hosts.
> Permission denied, please try again.
> Permission denied, please try again.
> Permission denied (publickey,gssapi-keyex,gssapi-with-mic,password).
> Build step 'Execute shell' marked build as failure
> Recording test results
> Email was triggered for: Regression
> Email was triggered for: Failure
> Sending email for trigger: Regression
>