You are viewing a plain text version of this content. The canonical link for it is here.
Posted to commits@struts.apache.org by Atlassian Open Source Bamboo <ba...@apache.org> on 2009/09/21 16:37:14 UTC

[OSS Bamboo] Struts 2 SVN - Main Build build 1210 has FAILED (2 tests failed, no failures were new). Change made by Wes Wannemacher

-----------------------------------------------------------
STRUTS-MAIN-1210 failed.
-----------------------------------------------------------
Code has been updated by Wes Wannemacher.
2/1108 tests failed.

http://opensource.bamboo.atlassian.com/browse/STRUTS-MAIN-1210/        


--------------
Code Changes
--------------
Wes Wannemacher (817269):

>WW-3253
>updating poms to point to xwork-core 2.1.6 release


--------------
Tests
--------------
Failed Tests (2)
   - EmbeddedJSPResultTest: Embedded (Existing)
   - EmbeddedJSPResultTest: Embedded absolute path (Existing)


--------------
Error Summary
--------------
   [INFO] ------------------------------------------------------------------------
   [ERROR] BUILD FAILURE
   [INFO] ------------------------------------------------------------------------
   [INFO] There are test failures.
   [INFO] ------------------------------------------------------------------------
   [INFO] For more information, run Maven with the -e switch


--
This message is automatically generated by Atlassian Bamboo