You are viewing a plain text version of this content. The canonical link for it is here.
Posted to dev@lucene.apache.org by Policeman Jenkins Server <je...@sd-datasolutions.de> on 2012/09/30 00:26:26 UTC
[JENKINS] Lucene-Solr-4.x-Linux (32bit/jdk1.8.0-ea-b51) - Build #
1446 - Still Failing!
Build: http://jenkins.sd-datasolutions.de/job/Lucene-Solr-4.x-Linux/1446/
Java: 32bit/jdk1.8.0-ea-b51 -client -XX:+UseG1GC
3 tests failed.
FAILED: org.apache.lucene.codecs.memory.TestDirectPostingsFormat.testRandom
Error Message:
Java heap space
Stack Trace:
java.lang.OutOfMemoryError: Java heap space
at __randomizedtesting.SeedInfo.seed([EE5D728BE4E9DBA0:9C11578455896DD3]:0)
at org.apache.lucene.codecs.memory.DirectPostingsFormat$DirectField.<init>(DirectPostingsFormat.java:396)
at org.apache.lucene.codecs.memory.DirectPostingsFormat$DirectFields.<init>(DirectPostingsFormat.java:128)
at org.apache.lucene.codecs.memory.DirectPostingsFormat.fieldsProducer(DirectPostingsFormat.java:112)
at org.apache.lucene.codecs.perfield.PerFieldPostingsFormat$FieldsReader.<init>(PerFieldPostingsFormat.java:194)
at org.apache.lucene.codecs.perfield.PerFieldPostingsFormat.fieldsProducer(PerFieldPostingsFormat.java:233)
at org.apache.lucene.index.BasePostingsFormatTestCase.buildIndex(BasePostingsFormatTestCase.java:486)
at org.apache.lucene.index.BasePostingsFormatTestCase.testRandom(BasePostingsFormatTestCase.java:1001)
at sun.reflect.NativeMethodAccessorImpl.invoke0(Native Method)
at sun.reflect.NativeMethodAccessorImpl.invoke(NativeMethodAccessorImpl.java:57)
at sun.reflect.DelegatingMethodAccessorImpl.invoke(DelegatingMethodAccessorImpl.java:43)
at java.lang.reflect.Method.invoke(Method.java:474)
at com.carrotsearch.randomizedtesting.RandomizedRunner.invoke(RandomizedRunner.java:1559)
at com.carrotsearch.randomizedtesting.RandomizedRunner.access$600(RandomizedRunner.java:79)
at com.carrotsearch.randomizedtesting.RandomizedRunner$6.evaluate(RandomizedRunner.java:737)
at com.carrotsearch.randomizedtesting.RandomizedRunner$7.evaluate(RandomizedRunner.java:773)
at com.carrotsearch.randomizedtesting.RandomizedRunner$8.evaluate(RandomizedRunner.java:787)
at org.apache.lucene.util.TestRuleSetupTeardownChained$1.evaluate(TestRuleSetupTeardownChained.java:50)
at org.apache.lucene.util.TestRuleFieldCacheSanity$1.evaluate(TestRuleFieldCacheSanity.java:51)
at org.apache.lucene.util.AbstractBeforeAfterRule$1.evaluate(AbstractBeforeAfterRule.java:45)
at com.carrotsearch.randomizedtesting.rules.SystemPropertiesInvariantRule$1.evaluate(SystemPropertiesInvariantRule.java:55)
at org.apache.lucene.util.TestRuleThreadAndTestName$1.evaluate(TestRuleThreadAndTestName.java:48)
at org.apache.lucene.util.TestRuleIgnoreAfterMaxFailures$1.evaluate(TestRuleIgnoreAfterMaxFailures.java:70)
at org.apache.lucene.util.TestRuleMarkFailure$1.evaluate(TestRuleMarkFailure.java:48)
at com.carrotsearch.randomizedtesting.rules.StatementAdapter.evaluate(StatementAdapter.java:36)
at com.carrotsearch.randomizedtesting.ThreadLeakControl$StatementRunner.run(ThreadLeakControl.java:358)
at com.carrotsearch.randomizedtesting.ThreadLeakControl.forkTimeoutingTask(ThreadLeakControl.java:782)
at com.carrotsearch.randomizedtesting.ThreadLeakControl$3.evaluate(ThreadLeakControl.java:442)
at com.carrotsearch.randomizedtesting.RandomizedRunner.runSingleTest(RandomizedRunner.java:746)
at com.carrotsearch.randomizedtesting.RandomizedRunner$3.evaluate(RandomizedRunner.java:648)
at com.carrotsearch.randomizedtesting.RandomizedRunner$4.evaluate(RandomizedRunner.java:682)
at com.carrotsearch.randomizedtesting.RandomizedRunner$5.evaluate(RandomizedRunner.java:693)
at org.apache.lucene.util.AbstractBeforeAfterRule$1.evaluate(AbstractBeforeAfterRule.java:45)
FAILED: org.apache.lucene.codecs.memory.TestDirectPostingsFormat.testDocsAndFreqsAndPositionsAndOffsetsAndPayloads
Error Message:
Java heap space
Stack Trace:
java.lang.OutOfMemoryError: Java heap space
at __randomizedtesting.SeedInfo.seed([EE5D728BE4E9DBA0:786B735C1E47AE]:0)
at org.apache.lucene.codecs.memory.DirectPostingsFormat$DirectField.<init>(DirectPostingsFormat.java:396)
at org.apache.lucene.codecs.memory.DirectPostingsFormat$DirectFields.<init>(DirectPostingsFormat.java:128)
at org.apache.lucene.codecs.memory.DirectPostingsFormat.fieldsProducer(DirectPostingsFormat.java:112)
at org.apache.lucene.codecs.perfield.PerFieldPostingsFormat$FieldsReader.<init>(PerFieldPostingsFormat.java:194)
at org.apache.lucene.codecs.perfield.PerFieldPostingsFormat.fieldsProducer(PerFieldPostingsFormat.java:233)
at org.apache.lucene.index.BasePostingsFormatTestCase.buildIndex(BasePostingsFormatTestCase.java:486)
at org.apache.lucene.index.BasePostingsFormatTestCase.testFull(BasePostingsFormatTestCase.java:947)
at org.apache.lucene.index.BasePostingsFormatTestCase.testDocsAndFreqsAndPositionsAndOffsetsAndPayloads(BasePostingsFormatTestCase.java:988)
at sun.reflect.NativeMethodAccessorImpl.invoke0(Native Method)
at sun.reflect.NativeMethodAccessorImpl.invoke(NativeMethodAccessorImpl.java:57)
at sun.reflect.DelegatingMethodAccessorImpl.invoke(DelegatingMethodAccessorImpl.java:43)
at java.lang.reflect.Method.invoke(Method.java:474)
at com.carrotsearch.randomizedtesting.RandomizedRunner.invoke(RandomizedRunner.java:1559)
at com.carrotsearch.randomizedtesting.RandomizedRunner.access$600(RandomizedRunner.java:79)
at com.carrotsearch.randomizedtesting.RandomizedRunner$6.evaluate(RandomizedRunner.java:737)
at com.carrotsearch.randomizedtesting.RandomizedRunner$7.evaluate(RandomizedRunner.java:773)
at com.carrotsearch.randomizedtesting.RandomizedRunner$8.evaluate(RandomizedRunner.java:787)
at org.apache.lucene.util.TestRuleSetupTeardownChained$1.evaluate(TestRuleSetupTeardownChained.java:50)
at org.apache.lucene.util.TestRuleFieldCacheSanity$1.evaluate(TestRuleFieldCacheSanity.java:51)
at org.apache.lucene.util.AbstractBeforeAfterRule$1.evaluate(AbstractBeforeAfterRule.java:45)
at com.carrotsearch.randomizedtesting.rules.SystemPropertiesInvariantRule$1.evaluate(SystemPropertiesInvariantRule.java:55)
at org.apache.lucene.util.TestRuleThreadAndTestName$1.evaluate(TestRuleThreadAndTestName.java:48)
at org.apache.lucene.util.TestRuleIgnoreAfterMaxFailures$1.evaluate(TestRuleIgnoreAfterMaxFailures.java:70)
at org.apache.lucene.util.TestRuleMarkFailure$1.evaluate(TestRuleMarkFailure.java:48)
at com.carrotsearch.randomizedtesting.rules.StatementAdapter.evaluate(StatementAdapter.java:36)
at com.carrotsearch.randomizedtesting.ThreadLeakControl$StatementRunner.run(ThreadLeakControl.java:358)
at com.carrotsearch.randomizedtesting.ThreadLeakControl.forkTimeoutingTask(ThreadLeakControl.java:782)
at com.carrotsearch.randomizedtesting.ThreadLeakControl$3.evaluate(ThreadLeakControl.java:442)
at com.carrotsearch.randomizedtesting.RandomizedRunner.runSingleTest(RandomizedRunner.java:746)
at com.carrotsearch.randomizedtesting.RandomizedRunner$3.evaluate(RandomizedRunner.java:648)
at com.carrotsearch.randomizedtesting.RandomizedRunner$4.evaluate(RandomizedRunner.java:682)
at com.carrotsearch.randomizedtesting.RandomizedRunner$5.evaluate(RandomizedRunner.java:693)
FAILED: org.apache.lucene.codecs.memory.TestDirectPostingsFormat.testDocsAndFreqsAndPositionsAndPayloads
Error Message:
Java heap space
Stack Trace:
java.lang.OutOfMemoryError: Java heap space
at __randomizedtesting.SeedInfo.seed([EE5D728BE4E9DBA0:58FD733DDC0A1C36]:0)
at org.apache.lucene.codecs.memory.DirectPostingsFormat$DirectField.<init>(DirectPostingsFormat.java:396)
at org.apache.lucene.codecs.memory.DirectPostingsFormat$DirectFields.<init>(DirectPostingsFormat.java:128)
at org.apache.lucene.codecs.memory.DirectPostingsFormat.fieldsProducer(DirectPostingsFormat.java:112)
at org.apache.lucene.codecs.perfield.PerFieldPostingsFormat$FieldsReader.<init>(PerFieldPostingsFormat.java:194)
at org.apache.lucene.codecs.perfield.PerFieldPostingsFormat.fieldsProducer(PerFieldPostingsFormat.java:233)
at org.apache.lucene.index.BasePostingsFormatTestCase.buildIndex(BasePostingsFormatTestCase.java:486)
at org.apache.lucene.index.BasePostingsFormatTestCase.testFull(BasePostingsFormatTestCase.java:947)
at org.apache.lucene.index.BasePostingsFormatTestCase.testDocsAndFreqsAndPositionsAndPayloads(BasePostingsFormatTestCase.java:980)
at sun.reflect.NativeMethodAccessorImpl.invoke0(Native Method)
at sun.reflect.NativeMethodAccessorImpl.invoke(NativeMethodAccessorImpl.java:57)
at sun.reflect.DelegatingMethodAccessorImpl.invoke(DelegatingMethodAccessorImpl.java:43)
at java.lang.reflect.Method.invoke(Method.java:474)
at com.carrotsearch.randomizedtesting.RandomizedRunner.invoke(RandomizedRunner.java:1559)
at com.carrotsearch.randomizedtesting.RandomizedRunner.access$600(RandomizedRunner.java:79)
at com.carrotsearch.randomizedtesting.RandomizedRunner$6.evaluate(RandomizedRunner.java:737)
at com.carrotsearch.randomizedtesting.RandomizedRunner$7.evaluate(RandomizedRunner.java:773)
at com.carrotsearch.randomizedtesting.RandomizedRunner$8.evaluate(RandomizedRunner.java:787)
at org.apache.lucene.util.TestRuleSetupTeardownChained$1.evaluate(TestRuleSetupTeardownChained.java:50)
at org.apache.lucene.util.TestRuleFieldCacheSanity$1.evaluate(TestRuleFieldCacheSanity.java:51)
at org.apache.lucene.util.AbstractBeforeAfterRule$1.evaluate(AbstractBeforeAfterRule.java:45)
at com.carrotsearch.randomizedtesting.rules.SystemPropertiesInvariantRule$1.evaluate(SystemPropertiesInvariantRule.java:55)
at org.apache.lucene.util.TestRuleThreadAndTestName$1.evaluate(TestRuleThreadAndTestName.java:48)
at org.apache.lucene.util.TestRuleIgnoreAfterMaxFailures$1.evaluate(TestRuleIgnoreAfterMaxFailures.java:70)
at org.apache.lucene.util.TestRuleMarkFailure$1.evaluate(TestRuleMarkFailure.java:48)
at com.carrotsearch.randomizedtesting.rules.StatementAdapter.evaluate(StatementAdapter.java:36)
at com.carrotsearch.randomizedtesting.ThreadLeakControl$StatementRunner.run(ThreadLeakControl.java:358)
at com.carrotsearch.randomizedtesting.ThreadLeakControl.forkTimeoutingTask(ThreadLeakControl.java:782)
at com.carrotsearch.randomizedtesting.ThreadLeakControl$3.evaluate(ThreadLeakControl.java:442)
at com.carrotsearch.randomizedtesting.RandomizedRunner.runSingleTest(RandomizedRunner.java:746)
at com.carrotsearch.randomizedtesting.RandomizedRunner$3.evaluate(RandomizedRunner.java:648)
at com.carrotsearch.randomizedtesting.RandomizedRunner$4.evaluate(RandomizedRunner.java:682)
at com.carrotsearch.randomizedtesting.RandomizedRunner$5.evaluate(RandomizedRunner.java:693)
Build Log:
[...truncated 5869 lines...]
[junit4:junit4] Suite: org.apache.lucene.codecs.memory.TestDirectPostingsFormat
[junit4:junit4] 2> NOTE: reproduce with: ant test -Dtestcase=TestDirectPostingsFormat -Dtests.method=testRandom -Dtests.seed=EE5D728BE4E9DBA0 -Dtests.multiplier=3 -Dtests.slow=true -Dtests.locale=th_TH_TH_#u-nu-thai -Dtests.timezone=America/Moncton -Dtests.file.encoding=ISO-8859-1
[junit4:junit4] ERROR 14.4s J1 | TestDirectPostingsFormat.testRandom <<<
[junit4:junit4] > Throwable #1: java.lang.OutOfMemoryError: Java heap space
[junit4:junit4] > at __randomizedtesting.SeedInfo.seed([EE5D728BE4E9DBA0:9C11578455896DD3]:0)
[junit4:junit4] > at org.apache.lucene.codecs.memory.DirectPostingsFormat$DirectField.<init>(DirectPostingsFormat.java:396)
[junit4:junit4] > at org.apache.lucene.codecs.memory.DirectPostingsFormat$DirectFields.<init>(DirectPostingsFormat.java:128)
[junit4:junit4] > at org.apache.lucene.codecs.memory.DirectPostingsFormat.fieldsProducer(DirectPostingsFormat.java:112)
[junit4:junit4] > at org.apache.lucene.codecs.perfield.PerFieldPostingsFormat$FieldsReader.<init>(PerFieldPostingsFormat.java:194)
[junit4:junit4] > at org.apache.lucene.codecs.perfield.PerFieldPostingsFormat.fieldsProducer(PerFieldPostingsFormat.java:233)
[junit4:junit4] > at org.apache.lucene.index.BasePostingsFormatTestCase.buildIndex(BasePostingsFormatTestCase.java:486)
[junit4:junit4] > at org.apache.lucene.index.BasePostingsFormatTestCase.testRandom(BasePostingsFormatTestCase.java:1001)
[junit4:junit4] > at sun.reflect.NativeMethodAccessorImpl.invoke0(Native Method)
[junit4:junit4] > at sun.reflect.NativeMethodAccessorImpl.invoke(NativeMethodAccessorImpl.java:57)
[junit4:junit4] > at sun.reflect.DelegatingMethodAccessorImpl.invoke(DelegatingMethodAccessorImpl.java:43)
[junit4:junit4] > at java.lang.reflect.Method.invoke(Method.java:474)
[junit4:junit4] > at com.carrotsearch.randomizedtesting.RandomizedRunner.invoke(RandomizedRunner.java:1559)
[junit4:junit4] > at com.carrotsearch.randomizedtesting.RandomizedRunner.access$600(RandomizedRunner.java:79)
[junit4:junit4] > at com.carrotsearch.randomizedtesting.RandomizedRunner$6.evaluate(RandomizedRunner.java:737)
[junit4:junit4] > at com.carrotsearch.randomizedtesting.RandomizedRunner$7.evaluate(RandomizedRunner.java:773)
[junit4:junit4] > at com.carrotsearch.randomizedtesting.RandomizedRunner$8.evaluate(RandomizedRunner.java:787)
[junit4:junit4] > at org.apache.lucene.util.TestRuleSetupTeardownChained$1.evaluate(TestRuleSetupTeardownChained.java:50)
[junit4:junit4] > at org.apache.lucene.util.TestRuleFieldCacheSanity$1.evaluate(TestRuleFieldCacheSanity.java:51)
[junit4:junit4] > at org.apache.lucene.util.AbstractBeforeAfterRule$1.evaluate(AbstractBeforeAfterRule.java:45)
[junit4:junit4] > at com.carrotsearch.randomizedtesting.rules.SystemPropertiesInvariantRule$1.evaluate(SystemPropertiesInvariantRule.java:55)
[junit4:junit4] > at org.apache.lucene.util.TestRuleThreadAndTestName$1.evaluate(TestRuleThreadAndTestName.java:48)
[junit4:junit4] > at org.apache.lucene.util.TestRuleIgnoreAfterMaxFailures$1.evaluate(TestRuleIgnoreAfterMaxFailures.java:70)
[junit4:junit4] > at org.apache.lucene.util.TestRuleMarkFailure$1.evaluate(TestRuleMarkFailure.java:48)
[junit4:junit4] > at com.carrotsearch.randomizedtesting.rules.StatementAdapter.evaluate(StatementAdapter.java:36)
[junit4:junit4] > at com.carrotsearch.randomizedtesting.ThreadLeakControl$StatementRunner.run(ThreadLeakControl.java:358)
[junit4:junit4] > at com.carrotsearch.randomizedtesting.ThreadLeakControl.forkTimeoutingTask(ThreadLeakControl.java:782)
[junit4:junit4] > at com.carrotsearch.randomizedtesting.ThreadLeakControl$3.evaluate(ThreadLeakControl.java:442)
[junit4:junit4] > at com.carrotsearch.randomizedtesting.RandomizedRunner.runSingleTest(RandomizedRunner.java:746)
[junit4:junit4] > at com.carrotsearch.randomizedtesting.RandomizedRunner$3.evaluate(RandomizedRunner.java:648)
[junit4:junit4] > at com.carrotsearch.randomizedtesting.RandomizedRunner$4.evaluate(RandomizedRunner.java:682)
[junit4:junit4] > at com.carrotsearch.randomizedtesting.RandomizedRunner$5.evaluate(RandomizedRunner.java:693)
[junit4:junit4] > at org.apache.lucene.util.AbstractBeforeAfterRule$1.evaluate(AbstractBeforeAfterRule.java:45)
[junit4:junit4] 2> NOTE: reproduce with: ant test -Dtestcase=TestDirectPostingsFormat -Dtests.method=testDocsAndFreqsAndPositionsAndOffsetsAndPayloads -Dtests.seed=EE5D728BE4E9DBA0 -Dtests.multiplier=3 -Dtests.slow=true -Dtests.locale=th_TH_TH_#u-nu-thai -Dtests.timezone=America/Moncton -Dtests.file.encoding=ISO-8859-1
[junit4:junit4] ERROR 4.92s J1 | TestDirectPostingsFormat.testDocsAndFreqsAndPositionsAndOffsetsAndPayloads <<<
[junit4:junit4] > Throwable #1: java.lang.OutOfMemoryError: Java heap space
[junit4:junit4] > at __randomizedtesting.SeedInfo.seed([EE5D728BE4E9DBA0:786B735C1E47AE]:0)
[junit4:junit4] > at org.apache.lucene.codecs.memory.DirectPostingsFormat$DirectField.<init>(DirectPostingsFormat.java:396)
[junit4:junit4] > at org.apache.lucene.codecs.memory.DirectPostingsFormat$DirectFields.<init>(DirectPostingsFormat.java:128)
[junit4:junit4] > at org.apache.lucene.codecs.memory.DirectPostingsFormat.fieldsProducer(DirectPostingsFormat.java:112)
[junit4:junit4] > at org.apache.lucene.codecs.perfield.PerFieldPostingsFormat$FieldsReader.<init>(PerFieldPostingsFormat.java:194)
[junit4:junit4] > at org.apache.lucene.codecs.perfield.PerFieldPostingsFormat.fieldsProducer(PerFieldPostingsFormat.java:233)
[junit4:junit4] > at org.apache.lucene.index.BasePostingsFormatTestCase.buildIndex(BasePostingsFormatTestCase.java:486)
[junit4:junit4] > at org.apache.lucene.index.BasePostingsFormatTestCase.testFull(BasePostingsFormatTestCase.java:947)
[junit4:junit4] > at org.apache.lucene.index.BasePostingsFormatTestCase.testDocsAndFreqsAndPositionsAndOffsetsAndPayloads(BasePostingsFormatTestCase.java:988)
[junit4:junit4] > at sun.reflect.NativeMethodAccessorImpl.invoke0(Native Method)
[junit4:junit4] > at sun.reflect.NativeMethodAccessorImpl.invoke(NativeMethodAccessorImpl.java:57)
[junit4:junit4] > at sun.reflect.DelegatingMethodAccessorImpl.invoke(DelegatingMethodAccessorImpl.java:43)
[junit4:junit4] > at java.lang.reflect.Method.invoke(Method.java:474)
[junit4:junit4] > at com.carrotsearch.randomizedtesting.RandomizedRunner.invoke(RandomizedRunner.java:1559)
[junit4:junit4] > at com.carrotsearch.randomizedtesting.RandomizedRunner.access$600(RandomizedRunner.java:79)
[junit4:junit4] > at com.carrotsearch.randomizedtesting.RandomizedRunner$6.evaluate(RandomizedRunner.java:737)
[junit4:junit4] > at com.carrotsearch.randomizedtesting.RandomizedRunner$7.evaluate(RandomizedRunner.java:773)
[junit4:junit4] > at com.carrotsearch.randomizedtesting.RandomizedRunner$8.evaluate(RandomizedRunner.java:787)
[junit4:junit4] > at org.apache.lucene.util.TestRuleSetupTeardownChained$1.evaluate(TestRuleSetupTeardownChained.java:50)
[junit4:junit4] > at org.apache.lucene.util.TestRuleFieldCacheSanity$1.evaluate(TestRuleFieldCacheSanity.java:51)
[junit4:junit4] > at org.apache.lucene.util.AbstractBeforeAfterRule$1.evaluate(AbstractBeforeAfterRule.java:45)
[junit4:junit4] > at com.carrotsearch.randomizedtesting.rules.SystemPropertiesInvariantRule$1.evaluate(SystemPropertiesInvariantRule.java:55)
[junit4:junit4] > at org.apache.lucene.util.TestRuleThreadAndTestName$1.evaluate(TestRuleThreadAndTestName.java:48)
[junit4:junit4] > at org.apache.lucene.util.TestRuleIgnoreAfterMaxFailures$1.evaluate(TestRuleIgnoreAfterMaxFailures.java:70)
[junit4:junit4] > at org.apache.lucene.util.TestRuleMarkFailure$1.evaluate(TestRuleMarkFailure.java:48)
[junit4:junit4] > at com.carrotsearch.randomizedtesting.rules.StatementAdapter.evaluate(StatementAdapter.java:36)
[junit4:junit4] > at com.carrotsearch.randomizedtesting.ThreadLeakControl$StatementRunner.run(ThreadLeakControl.java:358)
[junit4:junit4] > at com.carrotsearch.randomizedtesting.ThreadLeakControl.forkTimeoutingTask(ThreadLeakControl.java:782)
[junit4:junit4] > at com.carrotsearch.randomizedtesting.ThreadLeakControl$3.evaluate(ThreadLeakControl.java:442)
[junit4:junit4] > at com.carrotsearch.randomizedtesting.RandomizedRunner.runSingleTest(RandomizedRunner.java:746)
[junit4:junit4] > at com.carrotsearch.randomizedtesting.RandomizedRunner$3.evaluate(RandomizedRunner.java:648)
[junit4:junit4] > at com.carrotsearch.randomizedtesting.RandomizedRunner$4.evaluate(RandomizedRunner.java:682)
[junit4:junit4] > at com.carrotsearch.randomizedtesting.RandomizedRunner$5.evaluate(RandomizedRunner.java:693)
[junit4:junit4] 2> NOTE: reproduce with: ant test -Dtestcase=TestDirectPostingsFormat -Dtests.method=testDocsAndFreqsAndPositionsAndPayloads -Dtests.seed=EE5D728BE4E9DBA0 -Dtests.multiplier=3 -Dtests.slow=true -Dtests.locale=th_TH_TH_#u-nu-thai -Dtests.timezone=America/Moncton -Dtests.file.encoding=ISO-8859-1
[junit4:junit4] ERROR 6.34s J1 | TestDirectPostingsFormat.testDocsAndFreqsAndPositionsAndPayloads <<<
[junit4:junit4] > Throwable #1: java.lang.OutOfMemoryError: Java heap space
[junit4:junit4] > at __randomizedtesting.SeedInfo.seed([EE5D728BE4E9DBA0:58FD733DDC0A1C36]:0)
[junit4:junit4] > at org.apache.lucene.codecs.memory.DirectPostingsFormat$DirectField.<init>(DirectPostingsFormat.java:396)
[junit4:junit4] > at org.apache.lucene.codecs.memory.DirectPostingsFormat$DirectFields.<init>(DirectPostingsFormat.java:128)
[junit4:junit4] > at org.apache.lucene.codecs.memory.DirectPostingsFormat.fieldsProducer(DirectPostingsFormat.java:112)
[junit4:junit4] > at org.apache.lucene.codecs.perfield.PerFieldPostingsFormat$FieldsReader.<init>(PerFieldPostingsFormat.java:194)
[junit4:junit4] > at org.apache.lucene.codecs.perfield.PerFieldPostingsFormat.fieldsProducer(PerFieldPostingsFormat.java:233)
[junit4:junit4] > at org.apache.lucene.index.BasePostingsFormatTestCase.buildIndex(BasePostingsFormatTestCase.java:486)
[junit4:junit4] > at org.apache.lucene.index.BasePostingsFormatTestCase.testFull(BasePostingsFormatTestCase.java:947)
[junit4:junit4] > at org.apache.lucene.index.BasePostingsFormatTestCase.testDocsAndFreqsAndPositionsAndPayloads(BasePostingsFormatTestCase.java:980)
[junit4:junit4] > at sun.reflect.NativeMethodAccessorImpl.invoke0(Native Method)
[junit4:junit4] > at sun.reflect.NativeMethodAccessorImpl.invoke(NativeMethodAccessorImpl.java:57)
[junit4:junit4] > at sun.reflect.DelegatingMethodAccessorImpl.invoke(DelegatingMethodAccessorImpl.java:43)
[junit4:junit4] > at java.lang.reflect.Method.invoke(Method.java:474)
[junit4:junit4] > at com.carrotsearch.randomizedtesting.RandomizedRunner.invoke(RandomizedRunner.java:1559)
[junit4:junit4] > at com.carrotsearch.randomizedtesting.RandomizedRunner.access$600(RandomizedRunner.java:79)
[junit4:junit4] > at com.carrotsearch.randomizedtesting.RandomizedRunner$6.evaluate(RandomizedRunner.java:737)
[junit4:junit4] > at com.carrotsearch.randomizedtesting.RandomizedRunner$7.evaluate(RandomizedRunner.java:773)
[junit4:junit4] > at com.carrotsearch.randomizedtesting.RandomizedRunner$8.evaluate(RandomizedRunner.java:787)
[junit4:junit4] > at org.apache.lucene.util.TestRuleSetupTeardownChained$1.evaluate(TestRuleSetupTeardownChained.java:50)
[junit4:junit4] > at org.apache.lucene.util.TestRuleFieldCacheSanity$1.evaluate(TestRuleFieldCacheSanity.java:51)
[junit4:junit4] > at org.apache.lucene.util.AbstractBeforeAfterRule$1.evaluate(AbstractBeforeAfterRule.java:45)
[junit4:junit4] > at com.carrotsearch.randomizedtesting.rules.SystemPropertiesInvariantRule$1.evaluate(SystemPropertiesInvariantRule.java:55)
[junit4:junit4] > at org.apache.lucene.util.TestRuleThreadAndTestName$1.evaluate(TestRuleThreadAndTestName.java:48)
[junit4:junit4] > at org.apache.lucene.util.TestRuleIgnoreAfterMaxFailures$1.evaluate(TestRuleIgnoreAfterMaxFailures.java:70)
[junit4:junit4] > at org.apache.lucene.util.TestRuleMarkFailure$1.evaluate(TestRuleMarkFailure.java:48)
[junit4:junit4] > at com.carrotsearch.randomizedtesting.rules.StatementAdapter.evaluate(StatementAdapter.java:36)
[junit4:junit4] > at com.carrotsearch.randomizedtesting.ThreadLeakControl$StatementRunner.run(ThreadLeakControl.java:358)
[junit4:junit4] > at com.carrotsearch.randomizedtesting.ThreadLeakControl.forkTimeoutingTask(ThreadLeakControl.java:782)
[junit4:junit4] > at com.carrotsearch.randomizedtesting.ThreadLeakControl$3.evaluate(ThreadLeakControl.java:442)
[junit4:junit4] > at com.carrotsearch.randomizedtesting.RandomizedRunner.runSingleTest(RandomizedRunner.java:746)
[junit4:junit4] > at com.carrotsearch.randomizedtesting.RandomizedRunner$3.evaluate(RandomizedRunner.java:648)
[junit4:junit4] > at com.carrotsearch.randomizedtesting.RandomizedRunner$4.evaluate(RandomizedRunner.java:682)
[junit4:junit4] > at com.carrotsearch.randomizedtesting.RandomizedRunner$5.evaluate(RandomizedRunner.java:693)
[junit4:junit4] 2> NOTE: test params are: codec=SimpleText, sim=RandomSimilarityProvider(queryNorm=false,coord=no): {}, locale=th_TH_TH_#u-nu-thai, timezone=America/Moncton
[junit4:junit4] 2> NOTE: Linux 3.2.0-31-generic i386/Oracle Corporation 1.8.0-ea (32-bit)/cpus=8,threads=1,free=46955752,total=536870912
[junit4:junit4] 2> NOTE: All tests run in this JVM: [TestDirectPostingsFormat]
[junit4:junit4] Completed on J1 in 36.32s, 7 tests, 3 errors <<< FAILURES!
[...truncated 72 lines...]
BUILD FAILED
/mnt/ssd/jenkins/workspace/Lucene-Solr-4.x-Linux/build.xml:38: The following error occurred while executing this line:
/mnt/ssd/jenkins/workspace/Lucene-Solr-4.x-Linux/lucene/build.xml:507: The following error occurred while executing this line:
/mnt/ssd/jenkins/workspace/Lucene-Solr-4.x-Linux/lucene/common-build.xml:1641: The following error occurred while executing this line:
/mnt/ssd/jenkins/workspace/Lucene-Solr-4.x-Linux/lucene/module-build.xml:61: The following error occurred while executing this line:
/mnt/ssd/jenkins/workspace/Lucene-Solr-4.x-Linux/lucene/common-build.xml:1143: The following error occurred while executing this line:
/mnt/ssd/jenkins/workspace/Lucene-Solr-4.x-Linux/lucene/common-build.xml:816: There were test failures: 16 suites, 86 tests, 3 errors, 9 ignored (9 assumptions)
Total time: 14 minutes 43 seconds
Build step 'Invoke Ant' marked build as failure
Recording test results
Description set: Java: 32bit/jdk1.8.0-ea-b51 -client -XX:+UseG1GC
Email was triggered for: Failure
Sending email for trigger: Failure
[JENKINS] Lucene-Solr-4.x-Linux (32bit/jdk1.8.0-ea-b51) - Build #
1447 - Still Failing!
Posted by Policeman Jenkins Server <je...@sd-datasolutions.de>.
Build: http://jenkins.sd-datasolutions.de/job/Lucene-Solr-4.x-Linux/1447/
Java: 32bit/jdk1.8.0-ea-b51 -client -XX:+UseConcMarkSweepGC
All tests passed
Build Log:
[...truncated 985 lines...]
[junit4:junit4] ERROR: JVM J0 ended with an exception, command line: /mnt/ssd/jenkins/tools/java/32bit/jdk1.8.0-ea-b51/jre/bin/java -client -XX:+UseConcMarkSweepGC -Dtests.prefix=tests -Dtests.seed=512270084037FEE6 -Xmx512M -Dtests.iters= -Dtests.verbose=false -Dtests.infostream=false -Dtests.lockdir=/mnt/ssd/jenkins/workspace/Lucene-Solr-4.x-Linux/lucene/build -Dtests.codec=random -Dtests.postingsformat=random -Dtests.locale=random -Dtests.timezone=random -Dtests.directory=random -Dtests.linedocsfile=europarl.lines.txt.gz -Dtests.luceneMatchVersion=4.1 -Dtests.cleanthreads=perMethod -Djava.util.logging.config.file=/mnt/ssd/jenkins/workspace/Lucene-Solr-4.x-Linux/lucene/tools/junit4/logging.properties -Dtests.nightly=false -Dtests.weekly=false -Dtests.slow=true -Dtests.asserts.gracious=false -Dtests.multiplier=3 -DtempDir=. -Djava.io.tmpdir=. -Dtests.sandbox.dir=/mnt/ssd/jenkins/workspace/Lucene-Solr-4.x-Linux/lucene/build/core -Dclover.db.dir=/mnt/ssd/jenkins/workspace/Lucene-Solr-4.x-Linux/lucene/build/clover/db -Djava.security.manager=org.apache.lucene.util.TestSecurityManager -Djava.security.policy=/mnt/ssd/jenkins/workspace/Lucene-Solr-4.x-Linux/lucene/tools/junit4/tests.policy -Dlucene.version=4.1-SNAPSHOT -Djetty.testMode=1 -Djetty.insecurerandom=1 -Dsolr.directoryFactory=org.apache.solr.core.MockDirectoryFactory -Djava.awt.headless=true -classpath /mnt/ssd/jenkins/workspace/Lucene-Solr-4.x-Linux/lucene/build/test-framework/classes/java:/mnt/ssd/jenkins/workspace/Lucene-Solr-4.x-Linux/lucene/build/codecs/classes/java:/mnt/ssd/jenkins/workspace/Lucene-Solr-4.x-Linux/lucene/test-framework/lib/junit-4.10.jar:/mnt/ssd/jenkins/workspace/Lucene-Solr-4.x-Linux/lucene/test-framework/lib/randomizedtesting-runner-2.0.1.jar:/mnt/ssd/jenkins/workspace/Lucene-Solr-4.x-Linux/lucene/build/core/classes/java:/mnt/ssd/jenkins/workspace/Lucene-Solr-4.x-Linux/lucene/build/core/classes/test:/var/lib/jenkins/tools/Ant/ANT_1.8.2/lib/ant-launcher.jar:/var/lib/jenkins/.ant/lib/ivy-2.2.0.jar:/var/lib/jenkins/tools/Ant/ANT_1.8.2/lib/ant-jdepend.jar:/var/lib/jenkins/tools/Ant/ANT_1.8.2/lib/ant-netrexx.jar:/var/lib/jenkins/tools/Ant/ANT_1.8.2/lib/ant-antlr.jar:/var/lib/jenkins/tools/Ant/ANT_1.8.2/lib/ant-commons-net.jar:/var/lib/jenkins/tools/Ant/ANT_1.8.2/lib/ant-javamail.jar:/var/lib/jenkins/tools/Ant/ANT_1.8.2/lib/ant-apache-regexp.jar:/var/lib/jenkins/tools/Ant/ANT_1.8.2/lib/ant-jsch.jar:/var/lib/jenkins/tools/Ant/ANT_1.8.2/lib/ant-apache-xalan2.jar:/var/lib/jenkins/tools/Ant/ANT_1.8.2/lib/ant-junit4.jar:/var/lib/jenkins/tools/Ant/ANT_1.8.2/lib/ant-jmf.jar:/var/lib/jenkins/tools/Ant/ANT_1.8.2/lib/ant.jar:/var/lib/jenkins/tools/Ant/ANT_1.8.2/lib/ant-junit.jar:/var/lib/jenkins/tools/Ant/ANT_1.8.2/lib/ant-apache-bcel.jar:/var/lib/jenkins/tools/Ant/ANT_1.8.2/lib/ant-jai.jar:/var/lib/jenkins/tools/Ant/ANT_1.8.2/lib/ant-commons-logging.jar:/var/lib/jenkins/tools/Ant/ANT_1.8.2/lib/ant-apache-resolver.jar:/var/lib/jenkins/tools/Ant/ANT_1.8.2/lib/ant-apache-oro.jar:/var/lib/jenkins/tools/Ant/ANT_1.8.2/lib/ant-swing.jar:/var/lib/jenkins/tools/Ant/ANT_1.8.2/lib/ant-apache-bsf.jar:/var/lib/jenkins/tools/Ant/ANT_1.8.2/lib/ant-apache-log4j.jar:/var/lib/jenkins/tools/Ant/ANT_1.8.2/lib/ant-testutil.jar:/mnt/ssd/jenkins/tools/java/32bit/jdk1.8.0-ea-b51/lib/tools.jar:/var/lib/jenkins/.ivy2/cache/com.carrotsearch.randomizedtesting/junit4-ant/jars/junit4-ant-2.0.1.jar -ea:org.apache.lucene... -ea:org.apache.solr... com.carrotsearch.ant.tasks.junit4.slave.SlaveMainSafe -eventsfile /mnt/ssd/jenkins/workspace/Lucene-Solr-4.x-Linux/lucene/build/core/test/junit4-J0-20120930_091328_540.events @/mnt/ssd/jenkins/workspace/Lucene-Solr-4.x-Linux/lucene/build/core/test/junit4-J0-20120930_091328_540.suites
[junit4:junit4] ERROR: JVM J0 ended with an exception: Forked process exited with an error code: 134
[junit4:junit4] at com.carrotsearch.ant.tasks.junit4.JUnit4.forkProcess(JUnit4.java:1312)
[junit4:junit4] at com.carrotsearch.ant.tasks.junit4.JUnit4.executeSlave(JUnit4.java:1178)
[junit4:junit4] at com.carrotsearch.ant.tasks.junit4.JUnit4.access$000(JUnit4.java:65)
[junit4:junit4] at com.carrotsearch.ant.tasks.junit4.JUnit4$2.call(JUnit4.java:813)
[junit4:junit4] at com.carrotsearch.ant.tasks.junit4.JUnit4$2.call(JUnit4.java:810)
[junit4:junit4] at java.util.concurrent.FutureTask.run(FutureTask.java:262)
[junit4:junit4] at java.util.concurrent.ThreadPoolExecutor.runWorker(ThreadPoolExecutor.java:1110)
[junit4:junit4] at java.util.concurrent.ThreadPoolExecutor$Worker.run(ThreadPoolExecutor.java:603)
[junit4:junit4] at java.lang.Thread.run(Thread.java:722)
BUILD FAILED
/mnt/ssd/jenkins/workspace/Lucene-Solr-4.x-Linux/build.xml:38: The following error occurred while executing this line:
/mnt/ssd/jenkins/workspace/Lucene-Solr-4.x-Linux/lucene/build.xml:49: The following error occurred while executing this line:
/mnt/ssd/jenkins/workspace/Lucene-Solr-4.x-Linux/lucene/common-build.xml:1143: The following error occurred while executing this line:
/mnt/ssd/jenkins/workspace/Lucene-Solr-4.x-Linux/lucene/common-build.xml:816: At least one slave process threw an exception, first: Forked process exited with an error code: 134
Total time: 9 minutes 6 seconds
Build step 'Invoke Ant' marked build as failure
Recording test results
Description set: Java: 32bit/jdk1.8.0-ea-b51 -client -XX:+UseConcMarkSweepGC
Email was triggered for: Failure
Sending email for trigger: Failure