You are viewing a plain text version of this content. The canonical link for it is here.
Posted to dev@river.apache.org by Apache Jenkins Server <je...@builds.apache.org> on 2013/02/10 13:00:12 UTC
Build failed in Jenkins: river-qa-refactoring-solaris #19
See <https://builds.apache.org/job/river-qa-refactoring-solaris/19/changes>
Changes:
[peter_firmstone] JTREG test updates::
UriString fix for directory URL paths intended for URLClassLoader
Replace reference-collections with custard-apple (same library, later version) to fix ThreadFactory permission issue.
Replace Cliff Click's NonBlockingHashMap with ConcurrenHashMap in PreferredClassProvider to avoid some minor permission issues with unprivileged code.
Added additional logging to PreferredClassProvider.
Added permissions to some jtreg test policy files for new code where applicable.
JIni Standards Documentation updates:
Added JavaSpace05 to specification.
[peter_firmstone] JTREG test updates::
UriString fix for directory URL paths intended for URLClassLoader
Replace reference-collections with custard-apple (same library, later version) to fix ThreadFactory permission issue.
Replace Cliff Click's NonBlockingHashMap with ConcurrenHashMap in PreferredClassProvider to avoid some minor permission issues with unprivileged code.
Added additional logging to PreferredClassProvider.
Added permissions to some jtreg test policy files for new code where applicable.
JIni Standards Documentation updates:
Added JavaSpace05 to specification.
------------------------------------------
[...truncated 8010 lines...]
[exec] Certificate stored in file </zonestorage/hudson_solaris/home/hudson/hudson-slave/workspace/river-qa-refactoring-solaris@2/trunk/qa/harness/trust/group.cert>
are-passwords-available:
password:
[echo] creating passwords
truststore:
[exec] Certificate was added to keystore
[exec] Certificate was added to keystore
[exec] Certificate was added to keystore
[exec] Certificate was added to keystore
[exec] Certificate was added to keystore
[exec] Certificate was added to keystore
[exec] Certificate was added to keystore
[exec] Certificate was added to keystore
[exec] Certificate was added to keystore
trust:
qaman.jar:
[jar] Building jar: /zonestorage/hudson_solaris/home/hudson/hudson-slave/workspace/river-qa-refactoring-solaris@2/trunk/qa/lib/qaman.jar
mergedpolicyprovider.jar:
[jar] Building jar: /zonestorage/hudson_solaris/home/hudson/hudson-slave/workspace/river-qa-refactoring-solaris@2/trunk/qa/lib-ext/mergedpolicyprovider.jar
nonactivatablegroup.jar:
[jar] Building jar: /zonestorage/hudson_solaris/home/hudson/hudson-slave/workspace/river-qa-refactoring-solaris@2/trunk/qa/lib/nonactivatablegroup.jar
nonactivatablegroup-dl.jar:
[jar] Building jar: /zonestorage/hudson_solaris/home/hudson/hudson-slave/workspace/river-qa-refactoring-solaris@2/trunk/qa/lib/nonactivatablegroup-dl.jar
harness-killer.jar:
[jar] Building jar: /zonestorage/hudson_solaris/home/hudson/hudson-slave/workspace/river-qa-refactoring-solaris@2/trunk/qa/lib/harness-killer.jar
harness-killer-dl.jar:
[jar] Building jar: /zonestorage/hudson_solaris/home/hudson/hudson-slave/workspace/river-qa-refactoring-solaris@2/trunk/qa/lib/harness-killer-dl.jar
jiniharness.jar:
[jar] Building jar: /zonestorage/hudson_solaris/home/hudson/hudson-slave/workspace/river-qa-refactoring-solaris@2/trunk/qa/lib/jiniharness.jar
harness-jars:
qa1-end2end.jar:
[jar] Building jar: /zonestorage/hudson_solaris/home/hudson/hudson-slave/workspace/river-qa-refactoring-solaris@2/trunk/qa/lib/qa1-end2end.jar
qa1-fiddler-dl.jar:
[jar] Building jar: /zonestorage/hudson_solaris/home/hudson/hudson-slave/workspace/river-qa-refactoring-solaris@2/trunk/qa/lib/qa1-fiddler-dl.jar
qa1-joinmanager-dl.jar:
[jar] Building jar: /zonestorage/hudson_solaris/home/hudson/hudson-slave/workspace/river-qa-refactoring-solaris@2/trunk/qa/lib/qa1-joinmanager-dl.jar
qa1-mahalo-dl.jar:
[jar] Building jar: /zonestorage/hudson_solaris/home/hudson/hudson-slave/workspace/river-qa-refactoring-solaris@2/trunk/qa/lib/qa1-mahalo-dl.jar
qa1-mercury.jar:
[jar] Building jar: /zonestorage/hudson_solaris/home/hudson/hudson-slave/workspace/river-qa-refactoring-solaris@2/trunk/qa/lib/qa1-mercury.jar
[jar] Updating jar: /zonestorage/hudson_solaris/home/hudson/hudson-slave/workspace/river-qa-refactoring-solaris@2/trunk/qa/lib/qa1-mercury.jar
qa1-mercury-dl.jar:
[jar] Building jar: /zonestorage/hudson_solaris/home/hudson/hudson-slave/workspace/river-qa-refactoring-solaris@2/trunk/qa/lib/qa1-mercury-dl.jar
[jar] Updating jar: /zonestorage/hudson_solaris/home/hudson/hudson-slave/workspace/river-qa-refactoring-solaris@2/trunk/qa/lib/qa1-mercury-dl.jar
qa1-mercury-bogusimpl.jar:
[jar] Building jar: /zonestorage/hudson_solaris/home/hudson/hudson-slave/workspace/river-qa-refactoring-solaris@2/trunk/qa/lib/qa1-mercury-bogusimpl.jar
qa1-wrapper.jar:
[jar] Building jar: /zonestorage/hudson_solaris/home/hudson/hudson-slave/workspace/river-qa-refactoring-solaris@2/trunk/qa/lib/qa1-wrapper.jar
qa1-norm-dl.jar:
[jar] Building jar: /zonestorage/hudson_solaris/home/hudson/hudson-slave/workspace/river-qa-refactoring-solaris@2/trunk/qa/lib/qa1-norm-dl.jar
qa1-outrigger-dl.jar:
[jar] Building jar: /zonestorage/hudson_solaris/home/hudson/hudson-slave/workspace/river-qa-refactoring-solaris@2/trunk/qa/lib/qa1-outrigger-dl.jar
qa1-multihomedmetainf.jar:
[jar] Building jar: /zonestorage/hudson_solaris/home/hudson/hudson-slave/workspace/river-qa-refactoring-solaris@2/trunk/qa/lib/qa1-multihomedmetainf.jar
jinitests:
[jar] Building jar: /zonestorage/hudson_solaris/home/hudson/hudson-slave/workspace/river-qa-refactoring-solaris@2/trunk/qa/lib/jinitests.jar
[jar] Updating jar: /zonestorage/hudson_solaris/home/hudson/hudson-slave/workspace/river-qa-refactoring-solaris@2/trunk/qa/lib/jinitests.jar
[jar] Updating jar: /zonestorage/hudson_solaris/home/hudson/hudson-slave/workspace/river-qa-refactoring-solaris@2/trunk/qa/lib/jinitests.jar
jinitests.jar:
qa1-mainwrapper.jar:
[jar] Building jar: /zonestorage/hudson_solaris/home/hudson/hudson-slave/workspace/river-qa-refactoring-solaris@2/trunk/qa/lib/qa1-mainwrapper.jar
qa1-start-cb1.jar:
[jar] Building jar: /zonestorage/hudson_solaris/home/hudson/hudson-slave/workspace/river-qa-refactoring-solaris@2/trunk/qa/lib/qa1-start-cb1.jar
qa1-start-cb2.jar:
[jar] Building jar: /zonestorage/hudson_solaris/home/hudson/hudson-slave/workspace/river-qa-refactoring-solaris@2/trunk/qa/lib/qa1-start-cb2.jar
qa1-start-cb3.jar:
[jar] Building jar: /zonestorage/hudson_solaris/home/hudson/hudson-slave/workspace/river-qa-refactoring-solaris@2/trunk/qa/lib/qa1-start-cb3.jar
qa1-start-probe.jar:
[jar] Building jar: /zonestorage/hudson_solaris/home/hudson/hudson-slave/workspace/river-qa-refactoring-solaris@2/trunk/qa/lib/qa1-start-probe.jar
qa1-start-probe-dl.jar:
[jar] Building jar: /zonestorage/hudson_solaris/home/hudson/hudson-slave/workspace/river-qa-refactoring-solaris@2/trunk/qa/lib/qa1-start-probe-dl.jar
qa1-start-tests.jar:
[jar] Building jar: /zonestorage/hudson_solaris/home/hudson/hudson-slave/workspace/river-qa-refactoring-solaris@2/trunk/qa/lib/qa1-start-tests.jar
[jar] Updating jar: /zonestorage/hudson_solaris/home/hudson/hudson-slave/workspace/river-qa-refactoring-solaris@2/trunk/qa/lib/qa1-start-tests.jar
qa1-start-testservice1.jar:
[jar] Building jar: /zonestorage/hudson_solaris/home/hudson/hudson-slave/workspace/river-qa-refactoring-solaris@2/trunk/qa/lib/qa1-start-testservice1.jar
[jar] Updating jar: /zonestorage/hudson_solaris/home/hudson/hudson-slave/workspace/river-qa-refactoring-solaris@2/trunk/qa/lib/qa1-start-testservice1.jar
qa1-start-testservice1-dl.jar:
[jar] Building jar: /zonestorage/hudson_solaris/home/hudson/hudson-slave/workspace/river-qa-refactoring-solaris@2/trunk/qa/lib/qa1-start-testservice1-dl.jar
qa1-start-testservice2.jar:
[jar] Building jar: /zonestorage/hudson_solaris/home/hudson/hudson-slave/workspace/river-qa-refactoring-solaris@2/trunk/qa/lib/qa1-start-testservice2.jar
[jar] Updating jar: /zonestorage/hudson_solaris/home/hudson/hudson-slave/workspace/river-qa-refactoring-solaris@2/trunk/qa/lib/qa1-start-testservice2.jar
qa1-start-testservice2-dl.jar:
[jar] Building jar: /zonestorage/hudson_solaris/home/hudson/hudson-slave/workspace/river-qa-refactoring-solaris@2/trunk/qa/lib/qa1-start-testservice2-dl.jar
qa1-start-testservice-common.jar:
[jar] Building jar: /zonestorage/hudson_solaris/home/hudson/hudson-slave/workspace/river-qa-refactoring-solaris@2/trunk/qa/lib/qa1-start-testservice-common.jar
qa1-start-testservice-common-dl.jar:
[jar] Building jar: /zonestorage/hudson_solaris/home/hudson/hudson-slave/workspace/river-qa-refactoring-solaris@2/trunk/qa/lib/qa1-start-testservice-common-dl.jar
qa1-start-testservicenocons.jar:
[jar] Building jar: /zonestorage/hudson_solaris/home/hudson/hudson-slave/workspace/river-qa-refactoring-solaris@2/trunk/qa/lib/qa1-start-testservicenocons.jar
qa1-start-testservicenocons-dl.jar:
[jar] Building jar: /zonestorage/hudson_solaris/home/hudson/hudson-slave/workspace/river-qa-refactoring-solaris@2/trunk/qa/lib/qa1-start-testservicenocons-dl.jar
qa1-lookup-simulator.jar:
[jar] Building jar: /zonestorage/hudson_solaris/home/hudson/hudson-slave/workspace/river-qa-refactoring-solaris@2/trunk/qa/lib/qa1-lookup-simulator.jar
[jar] Updating jar: /zonestorage/hudson_solaris/home/hudson/hudson-slave/workspace/river-qa-refactoring-solaris@2/trunk/qa/lib/qa1-lookup-simulator.jar
qa1-lookup-simulator-dl.jar:
[jar] Building jar: /zonestorage/hudson_solaris/home/hudson/hudson-slave/workspace/river-qa-refactoring-solaris@2/trunk/qa/lib/qa1-lookup-simulator-dl.jar
[jar] Updating jar: /zonestorage/hudson_solaris/home/hudson/hudson-slave/workspace/river-qa-refactoring-solaris@2/trunk/qa/lib/qa1-lookup-simulator-dl.jar
qa1-share-dl.jar:
[jar] Building jar: /zonestorage/hudson_solaris/home/hudson/hudson-slave/workspace/river-qa-refactoring-solaris@2/trunk/qa/lib/qa1-share-dl.jar
[jar] Updating jar: /zonestorage/hudson_solaris/home/hudson/hudson-slave/workspace/river-qa-refactoring-solaris@2/trunk/qa/lib/qa1-share-dl.jar
qa1-reggie-race.jar:
[jar] Building jar: /zonestorage/hudson_solaris/home/hudson/hudson-slave/workspace/river-qa-refactoring-solaris@2/trunk/qa/lib/qa1-reggie-race.jar
qa1-reggie-race-dl.jar:
[jar] Building jar: /zonestorage/hudson_solaris/home/hudson/hudson-slave/workspace/river-qa-refactoring-solaris@2/trunk/qa/lib/qa1-reggie-race-dl.jar
fullloggingfilter.jar:
[jar] Building jar: /zonestorage/hudson_solaris/home/hudson/hudson-slave/workspace/river-qa-refactoring-solaris@2/trunk/qa/lib/fullloggingfilter.jar
qa1-discoveryservice-dl.jar:
[jar] Building jar: /zonestorage/hudson_solaris/home/hudson/hudson-slave/workspace/river-qa-refactoring-solaris@2/trunk/qa/lib/qa1-discoveryservice-dl.jar
qa1-export-servercontext-tests-non-null.jar:
[jar] Building jar: /zonestorage/hudson_solaris/home/hudson/hudson-slave/workspace/river-qa-refactoring-solaris@2/trunk/qa/lib/qa1-export-servercontext-tests-non-null.jar
qa1-export-servercontext-tests-null.jar:
[jar] Building jar: /zonestorage/hudson_solaris/home/hudson/hudson-slave/workspace/river-qa-refactoring-solaris@2/trunk/qa/lib/qa1-export-servercontext-tests-null.jar
qa1-export-servercontext-tests-providers-parsing.jar:
[jar] Building jar: /zonestorage/hudson_solaris/home/hudson/hudson-slave/workspace/river-qa-refactoring-solaris@2/trunk/qa/lib/qa1-export-servercontext-tests-providers-parsing.jar
qa1-io-util-dl.jar:
[jar] Building jar: /zonestorage/hudson_solaris/home/hudson/hudson-slave/workspace/river-qa-refactoring-solaris@2/trunk/qa/lib/qa1-io-util-dl.jar
qa1-io-marshalinputstream-test.jar:
[jar] Building jar: /zonestorage/hudson_solaris/home/hudson/hudson-slave/workspace/river-qa-refactoring-solaris@2/trunk/qa/lib/qa1-io-marshalinputstream-test.jar
[jar] Updating jar: /zonestorage/hudson_solaris/home/hudson/hudson-slave/workspace/river-qa-refactoring-solaris@2/trunk/qa/lib/qa1-io-marshalinputstream-test.jar
qa1-io-marshalledinstance-test.jar:
[jar] Building jar: /zonestorage/hudson_solaris/home/hudson/hudson-slave/workspace/river-qa-refactoring-solaris@2/trunk/qa/lib/qa1-io-marshalledinstance-test.jar
[jar] Updating jar: /zonestorage/hudson_solaris/home/hudson/hudson-slave/workspace/river-qa-refactoring-solaris@2/trunk/qa/lib/qa1-io-marshalledinstance-test.jar
qa1-javaspace-dl.jar:
[jar] Building jar: /zonestorage/hudson_solaris/home/hudson/hudson-slave/workspace/river-qa-refactoring-solaris@2/trunk/qa/lib/qa1-javaspace-dl.jar
qa1-lookupservice-dl.jar:
[jar] Building jar: /zonestorage/hudson_solaris/home/hudson/hudson-slave/workspace/river-qa-refactoring-solaris@2/trunk/qa/lib/qa1-lookupservice-dl.jar
qa1-renewalservice-dl.jar:
[jar] Building jar: /zonestorage/hudson_solaris/home/hudson/hudson-slave/workspace/river-qa-refactoring-solaris@2/trunk/qa/lib/qa1-renewalservice-dl.jar
[jar] Updating jar: /zonestorage/hudson_solaris/home/hudson/hudson-slave/workspace/river-qa-refactoring-solaris@2/trunk/qa/lib/qa1-renewalservice-dl.jar
qa1-securityDoPrivileged.jar:
[jar] Building jar: /zonestorage/hudson_solaris/home/hudson/hudson-slave/workspace/river-qa-refactoring-solaris@2/trunk/qa/lib/qa1-securityDoPrivileged.jar
qa1-securityUtil.jar:
[jar] Building jar: /zonestorage/hudson_solaris/home/hudson/hudson-slave/workspace/river-qa-refactoring-solaris@2/trunk/qa/lib/qa1-securityUtil.jar
qa1-servicediscovery-dl.jar:
[java] Warning: Class not found: net.jini.lookup.ServiceDiscoveryManager$LookupCacheImpl$LookupListener_Stub
[jar] Building jar: /zonestorage/hudson_solaris/home/hudson/hudson-slave/workspace/river-qa-refactoring-solaris@2/trunk/qa/lib/qa1-servicediscovery-dl.jar
[java] Warning: Class not found: net.jini.lookup.ServiceDiscoveryManager$LookupCacheImpl$LookupListener_Stub
[jar] Updating jar: /zonestorage/hudson_solaris/home/hudson/hudson-slave/workspace/river-qa-refactoring-solaris@2/trunk/qa/lib/qa1-servicediscovery-dl.jar
qa1-httpmd.jar:
[jar] Building jar: /zonestorage/hudson_solaris/home/hudson/hudson-slave/workspace/river-qa-refactoring-solaris@2/trunk/qa/lib/qa1-httpmd.jar
qa1-httpmd-same.jar:
[copy] Copying 1 file to /zonestorage/hudson_solaris/home/hudson/hudson-slave/workspace/river-qa-refactoring-solaris@2/trunk/qa/lib
qa1-httpmd-another.jar:
[jar] Building jar: /zonestorage/hudson_solaris/home/hudson/hudson-slave/workspace/river-qa-refactoring-solaris@2/trunk/qa/lib/qa1-httpmd-another.jar
ld.jar:
[jar] Building jar: /zonestorage/hudson_solaris/home/hudson/hudson-slave/workspace/river-qa-refactoring-solaris@2/trunk/qa/lib/ld.jar
qa1-loader-pref.jar:
[jar] Building jar: /zonestorage/hudson_solaris/home/hudson/hudson-slave/workspace/river-qa-refactoring-solaris@2/trunk/qa/lib/qa1-loader-pref.jar
qa1-policy-provider.jar:
[jar] Building jar: /zonestorage/hudson_solaris/home/hudson/hudson-slave/workspace/river-qa-refactoring-solaris@2/trunk/qa/lib/qa1-policy-provider.jar
jars:
harness-runtime:
run:
james-brown:
[mkdir] Created dir: /zonestorage/hudson_solaris/home/hudson/hudson-slave/workspace/river-qa-refactoring-solaris@2/trunk/qa/soul
[touch] Creating /zonestorage/hudson_solaris/home/hudson/hudson-slave/workspace/river-qa-refactoring-solaris@2/trunk/qa/soul/soul.201302101201034727
run-categories:
[java] Problem with KEEPALIVE_PORT:10004
[java] Unexpected exception:
[java] java.net.BindException: Address already in use
[java] at java.net.PlainSocketImpl.socketBind(Native Method)
[java] at java.net.PlainSocketImpl.bind(PlainSocketImpl.java:383)
[java] at java.net.ServerSocket.bind(ServerSocket.java:328)
[java] at java.net.ServerSocket.bind(ServerSocket.java:286)
[java] at com.sun.jini.qa.harness.MasterHarness$KeepAlivePort.run(MasterHarness.java:257)
[java] at java.lang.Thread.run(Thread.java:662)
[java] Java Result: 1
collect-result:
BUILD FAILED
/zonestorage/hudson_solaris/home/hudson/hudson-slave/workspace/river-qa-refactoring-solaris@2/trunk/build.xml:2093: The following error occurred while executing this line:
/zonestorage/hudson_solaris/home/hudson/hudson-slave/workspace/river-qa-refactoring-solaris@2/trunk/qa/build.xml:406: The following error occurred while executing this line:
/zonestorage/hudson_solaris/home/hudson/hudson-slave/workspace/river-qa-refactoring-solaris@2/trunk/qa/build.xml:380: condition satisfied
Total time: 5 minutes 52 seconds
Build step 'Invoke Ant' marked build as failure
Archiving artifacts
Build failed in Jenkins: river-qa-refactoring-solaris #29
Posted by Apache Jenkins Server <je...@builds.apache.org>.
See <https://builds.apache.org/job/river-qa-refactoring-solaris/29/changes>
Changes:
[peter_firmstone] RIVER-416
[peter_firmstone] RIVER-416
[peter_firmstone] Attempt to fix another failing javaspace test
com/sun/jini/test/spec/javaspace/conformance/ExpirationNotifyTest.td
[java] Test Failed: Test Failed: com.sun.jini.qa.harness.TestException: Not all listeners've got expected number of events.
------------------------------------------
[...truncated 1172 lines...]
[exec] Certificate stored in file </zonestorage/hudson_solaris/home/hudson/hudson-slave/workspace/river-qa-refactoring-solaris/trunk/qa/harness/trust/group.cert>
are-passwords-available:
password:
[echo] creating passwords
truststore:
[exec] Certificate was added to keystore
[exec] Certificate was added to keystore
[exec] Certificate was added to keystore
[exec] Certificate was added to keystore
[exec] Certificate was added to keystore
[exec] Certificate was added to keystore
[exec] Certificate was added to keystore
[exec] Certificate was added to keystore
[exec] Certificate was added to keystore
trust:
qaman.jar:
[jar] Building jar: /zonestorage/hudson_solaris/home/hudson/hudson-slave/workspace/river-qa-refactoring-solaris/trunk/qa/lib/qaman.jar
mergedpolicyprovider.jar:
[jar] Building jar: /zonestorage/hudson_solaris/home/hudson/hudson-slave/workspace/river-qa-refactoring-solaris/trunk/qa/lib-ext/mergedpolicyprovider.jar
nonactivatablegroup.jar:
[jar] Building jar: /zonestorage/hudson_solaris/home/hudson/hudson-slave/workspace/river-qa-refactoring-solaris/trunk/qa/lib/nonactivatablegroup.jar
nonactivatablegroup-dl.jar:
[jar] Building jar: /zonestorage/hudson_solaris/home/hudson/hudson-slave/workspace/river-qa-refactoring-solaris/trunk/qa/lib/nonactivatablegroup-dl.jar
harness-killer.jar:
[jar] Building jar: /zonestorage/hudson_solaris/home/hudson/hudson-slave/workspace/river-qa-refactoring-solaris/trunk/qa/lib/harness-killer.jar
harness-killer-dl.jar:
[jar] Building jar: /zonestorage/hudson_solaris/home/hudson/hudson-slave/workspace/river-qa-refactoring-solaris/trunk/qa/lib/harness-killer-dl.jar
jiniharness.jar:
[jar] Building jar: /zonestorage/hudson_solaris/home/hudson/hudson-slave/workspace/river-qa-refactoring-solaris/trunk/qa/lib/jiniharness.jar
harness-jars:
qa1-end2end.jar:
[jar] Building jar: /zonestorage/hudson_solaris/home/hudson/hudson-slave/workspace/river-qa-refactoring-solaris/trunk/qa/lib/qa1-end2end.jar
qa1-fiddler-dl.jar:
[jar] Building jar: /zonestorage/hudson_solaris/home/hudson/hudson-slave/workspace/river-qa-refactoring-solaris/trunk/qa/lib/qa1-fiddler-dl.jar
qa1-joinmanager-dl.jar:
[jar] Building jar: /zonestorage/hudson_solaris/home/hudson/hudson-slave/workspace/river-qa-refactoring-solaris/trunk/qa/lib/qa1-joinmanager-dl.jar
qa1-mahalo-dl.jar:
[jar] Building jar: /zonestorage/hudson_solaris/home/hudson/hudson-slave/workspace/river-qa-refactoring-solaris/trunk/qa/lib/qa1-mahalo-dl.jar
qa1-mercury.jar:
[jar] Building jar: /zonestorage/hudson_solaris/home/hudson/hudson-slave/workspace/river-qa-refactoring-solaris/trunk/qa/lib/qa1-mercury.jar
[jar] Updating jar: /zonestorage/hudson_solaris/home/hudson/hudson-slave/workspace/river-qa-refactoring-solaris/trunk/qa/lib/qa1-mercury.jar
qa1-mercury-dl.jar:
[jar] Building jar: /zonestorage/hudson_solaris/home/hudson/hudson-slave/workspace/river-qa-refactoring-solaris/trunk/qa/lib/qa1-mercury-dl.jar
[jar] Updating jar: /zonestorage/hudson_solaris/home/hudson/hudson-slave/workspace/river-qa-refactoring-solaris/trunk/qa/lib/qa1-mercury-dl.jar
qa1-mercury-bogusimpl.jar:
[jar] Building jar: /zonestorage/hudson_solaris/home/hudson/hudson-slave/workspace/river-qa-refactoring-solaris/trunk/qa/lib/qa1-mercury-bogusimpl.jar
qa1-wrapper.jar:
[jar] Building jar: /zonestorage/hudson_solaris/home/hudson/hudson-slave/workspace/river-qa-refactoring-solaris/trunk/qa/lib/qa1-wrapper.jar
qa1-norm-dl.jar:
[jar] Building jar: /zonestorage/hudson_solaris/home/hudson/hudson-slave/workspace/river-qa-refactoring-solaris/trunk/qa/lib/qa1-norm-dl.jar
qa1-outrigger-dl.jar:
[jar] Building jar: /zonestorage/hudson_solaris/home/hudson/hudson-slave/workspace/river-qa-refactoring-solaris/trunk/qa/lib/qa1-outrigger-dl.jar
qa1-multihomedmetainf.jar:
[jar] Building jar: /zonestorage/hudson_solaris/home/hudson/hudson-slave/workspace/river-qa-refactoring-solaris/trunk/qa/lib/qa1-multihomedmetainf.jar
jinitests:
[jar] Building jar: /zonestorage/hudson_solaris/home/hudson/hudson-slave/workspace/river-qa-refactoring-solaris/trunk/qa/lib/jinitests.jar
[jar] Updating jar: /zonestorage/hudson_solaris/home/hudson/hudson-slave/workspace/river-qa-refactoring-solaris/trunk/qa/lib/jinitests.jar
[jar] Updating jar: /zonestorage/hudson_solaris/home/hudson/hudson-slave/workspace/river-qa-refactoring-solaris/trunk/qa/lib/jinitests.jar
jinitests.jar:
qa1-mainwrapper.jar:
[jar] Building jar: /zonestorage/hudson_solaris/home/hudson/hudson-slave/workspace/river-qa-refactoring-solaris/trunk/qa/lib/qa1-mainwrapper.jar
qa1-start-cb1.jar:
[jar] Building jar: /zonestorage/hudson_solaris/home/hudson/hudson-slave/workspace/river-qa-refactoring-solaris/trunk/qa/lib/qa1-start-cb1.jar
qa1-start-cb2.jar:
[jar] Building jar: /zonestorage/hudson_solaris/home/hudson/hudson-slave/workspace/river-qa-refactoring-solaris/trunk/qa/lib/qa1-start-cb2.jar
qa1-start-cb3.jar:
[jar] Building jar: /zonestorage/hudson_solaris/home/hudson/hudson-slave/workspace/river-qa-refactoring-solaris/trunk/qa/lib/qa1-start-cb3.jar
qa1-start-probe.jar:
[jar] Building jar: /zonestorage/hudson_solaris/home/hudson/hudson-slave/workspace/river-qa-refactoring-solaris/trunk/qa/lib/qa1-start-probe.jar
qa1-start-probe-dl.jar:
[jar] Building jar: /zonestorage/hudson_solaris/home/hudson/hudson-slave/workspace/river-qa-refactoring-solaris/trunk/qa/lib/qa1-start-probe-dl.jar
qa1-start-tests.jar:
[jar] Building jar: /zonestorage/hudson_solaris/home/hudson/hudson-slave/workspace/river-qa-refactoring-solaris/trunk/qa/lib/qa1-start-tests.jar
[jar] Updating jar: /zonestorage/hudson_solaris/home/hudson/hudson-slave/workspace/river-qa-refactoring-solaris/trunk/qa/lib/qa1-start-tests.jar
qa1-start-testservice1.jar:
[jar] Building jar: /zonestorage/hudson_solaris/home/hudson/hudson-slave/workspace/river-qa-refactoring-solaris/trunk/qa/lib/qa1-start-testservice1.jar
[jar] Updating jar: /zonestorage/hudson_solaris/home/hudson/hudson-slave/workspace/river-qa-refactoring-solaris/trunk/qa/lib/qa1-start-testservice1.jar
qa1-start-testservice1-dl.jar:
[jar] Building jar: /zonestorage/hudson_solaris/home/hudson/hudson-slave/workspace/river-qa-refactoring-solaris/trunk/qa/lib/qa1-start-testservice1-dl.jar
qa1-start-testservice2.jar:
[jar] Building jar: /zonestorage/hudson_solaris/home/hudson/hudson-slave/workspace/river-qa-refactoring-solaris/trunk/qa/lib/qa1-start-testservice2.jar
[jar] Updating jar: /zonestorage/hudson_solaris/home/hudson/hudson-slave/workspace/river-qa-refactoring-solaris/trunk/qa/lib/qa1-start-testservice2.jar
qa1-start-testservice2-dl.jar:
[jar] Building jar: /zonestorage/hudson_solaris/home/hudson/hudson-slave/workspace/river-qa-refactoring-solaris/trunk/qa/lib/qa1-start-testservice2-dl.jar
qa1-start-testservice-common.jar:
[jar] Building jar: /zonestorage/hudson_solaris/home/hudson/hudson-slave/workspace/river-qa-refactoring-solaris/trunk/qa/lib/qa1-start-testservice-common.jar
qa1-start-testservice-common-dl.jar:
[jar] Building jar: /zonestorage/hudson_solaris/home/hudson/hudson-slave/workspace/river-qa-refactoring-solaris/trunk/qa/lib/qa1-start-testservice-common-dl.jar
qa1-start-testservicenocons.jar:
[jar] Building jar: /zonestorage/hudson_solaris/home/hudson/hudson-slave/workspace/river-qa-refactoring-solaris/trunk/qa/lib/qa1-start-testservicenocons.jar
qa1-start-testservicenocons-dl.jar:
[jar] Building jar: /zonestorage/hudson_solaris/home/hudson/hudson-slave/workspace/river-qa-refactoring-solaris/trunk/qa/lib/qa1-start-testservicenocons-dl.jar
qa1-lookup-simulator.jar:
[jar] Building jar: /zonestorage/hudson_solaris/home/hudson/hudson-slave/workspace/river-qa-refactoring-solaris/trunk/qa/lib/qa1-lookup-simulator.jar
[jar] Updating jar: /zonestorage/hudson_solaris/home/hudson/hudson-slave/workspace/river-qa-refactoring-solaris/trunk/qa/lib/qa1-lookup-simulator.jar
qa1-lookup-simulator-dl.jar:
[jar] Building jar: /zonestorage/hudson_solaris/home/hudson/hudson-slave/workspace/river-qa-refactoring-solaris/trunk/qa/lib/qa1-lookup-simulator-dl.jar
[jar] Updating jar: /zonestorage/hudson_solaris/home/hudson/hudson-slave/workspace/river-qa-refactoring-solaris/trunk/qa/lib/qa1-lookup-simulator-dl.jar
qa1-share-dl.jar:
[jar] Building jar: /zonestorage/hudson_solaris/home/hudson/hudson-slave/workspace/river-qa-refactoring-solaris/trunk/qa/lib/qa1-share-dl.jar
[jar] Updating jar: /zonestorage/hudson_solaris/home/hudson/hudson-slave/workspace/river-qa-refactoring-solaris/trunk/qa/lib/qa1-share-dl.jar
qa1-reggie-race.jar:
[jar] Building jar: /zonestorage/hudson_solaris/home/hudson/hudson-slave/workspace/river-qa-refactoring-solaris/trunk/qa/lib/qa1-reggie-race.jar
qa1-reggie-race-dl.jar:
[jar] Building jar: /zonestorage/hudson_solaris/home/hudson/hudson-slave/workspace/river-qa-refactoring-solaris/trunk/qa/lib/qa1-reggie-race-dl.jar
fullloggingfilter.jar:
[jar] Building jar: /zonestorage/hudson_solaris/home/hudson/hudson-slave/workspace/river-qa-refactoring-solaris/trunk/qa/lib/fullloggingfilter.jar
qa1-discoveryservice-dl.jar:
[jar] Building jar: /zonestorage/hudson_solaris/home/hudson/hudson-slave/workspace/river-qa-refactoring-solaris/trunk/qa/lib/qa1-discoveryservice-dl.jar
qa1-export-servercontext-tests-non-null.jar:
[jar] Building jar: /zonestorage/hudson_solaris/home/hudson/hudson-slave/workspace/river-qa-refactoring-solaris/trunk/qa/lib/qa1-export-servercontext-tests-non-null.jar
qa1-export-servercontext-tests-null.jar:
[jar] Building jar: /zonestorage/hudson_solaris/home/hudson/hudson-slave/workspace/river-qa-refactoring-solaris/trunk/qa/lib/qa1-export-servercontext-tests-null.jar
qa1-export-servercontext-tests-providers-parsing.jar:
[jar] Building jar: /zonestorage/hudson_solaris/home/hudson/hudson-slave/workspace/river-qa-refactoring-solaris/trunk/qa/lib/qa1-export-servercontext-tests-providers-parsing.jar
qa1-io-util-dl.jar:
[jar] Building jar: /zonestorage/hudson_solaris/home/hudson/hudson-slave/workspace/river-qa-refactoring-solaris/trunk/qa/lib/qa1-io-util-dl.jar
qa1-io-marshalinputstream-test.jar:
[jar] Building jar: /zonestorage/hudson_solaris/home/hudson/hudson-slave/workspace/river-qa-refactoring-solaris/trunk/qa/lib/qa1-io-marshalinputstream-test.jar
[jar] Updating jar: /zonestorage/hudson_solaris/home/hudson/hudson-slave/workspace/river-qa-refactoring-solaris/trunk/qa/lib/qa1-io-marshalinputstream-test.jar
qa1-io-marshalledinstance-test.jar:
[jar] Building jar: /zonestorage/hudson_solaris/home/hudson/hudson-slave/workspace/river-qa-refactoring-solaris/trunk/qa/lib/qa1-io-marshalledinstance-test.jar
[jar] Updating jar: /zonestorage/hudson_solaris/home/hudson/hudson-slave/workspace/river-qa-refactoring-solaris/trunk/qa/lib/qa1-io-marshalledinstance-test.jar
qa1-javaspace-dl.jar:
[jar] Building jar: /zonestorage/hudson_solaris/home/hudson/hudson-slave/workspace/river-qa-refactoring-solaris/trunk/qa/lib/qa1-javaspace-dl.jar
qa1-lookupservice-dl.jar:
[jar] Building jar: /zonestorage/hudson_solaris/home/hudson/hudson-slave/workspace/river-qa-refactoring-solaris/trunk/qa/lib/qa1-lookupservice-dl.jar
qa1-renewalservice-dl.jar:
[jar] Building jar: /zonestorage/hudson_solaris/home/hudson/hudson-slave/workspace/river-qa-refactoring-solaris/trunk/qa/lib/qa1-renewalservice-dl.jar
[jar] Updating jar: /zonestorage/hudson_solaris/home/hudson/hudson-slave/workspace/river-qa-refactoring-solaris/trunk/qa/lib/qa1-renewalservice-dl.jar
qa1-securityDoPrivileged.jar:
[jar] Building jar: /zonestorage/hudson_solaris/home/hudson/hudson-slave/workspace/river-qa-refactoring-solaris/trunk/qa/lib/qa1-securityDoPrivileged.jar
qa1-securityUtil.jar:
[jar] Building jar: /zonestorage/hudson_solaris/home/hudson/hudson-slave/workspace/river-qa-refactoring-solaris/trunk/qa/lib/qa1-securityUtil.jar
qa1-servicediscovery-dl.jar:
[java] Warning: Class not found: net.jini.lookup.ServiceDiscoveryManager$LookupCacheImpl$LookupListener_Stub
[jar] Building jar: /zonestorage/hudson_solaris/home/hudson/hudson-slave/workspace/river-qa-refactoring-solaris/trunk/qa/lib/qa1-servicediscovery-dl.jar
[java] Warning: Class not found: net.jini.lookup.ServiceDiscoveryManager$LookupCacheImpl$LookupListener_Stub
[jar] Updating jar: /zonestorage/hudson_solaris/home/hudson/hudson-slave/workspace/river-qa-refactoring-solaris/trunk/qa/lib/qa1-servicediscovery-dl.jar
qa1-httpmd.jar:
[jar] Building jar: /zonestorage/hudson_solaris/home/hudson/hudson-slave/workspace/river-qa-refactoring-solaris/trunk/qa/lib/qa1-httpmd.jar
qa1-httpmd-same.jar:
[copy] Copying 1 file to /zonestorage/hudson_solaris/home/hudson/hudson-slave/workspace/river-qa-refactoring-solaris/trunk/qa/lib
qa1-httpmd-another.jar:
[jar] Building jar: /zonestorage/hudson_solaris/home/hudson/hudson-slave/workspace/river-qa-refactoring-solaris/trunk/qa/lib/qa1-httpmd-another.jar
ld.jar:
[jar] Building jar: /zonestorage/hudson_solaris/home/hudson/hudson-slave/workspace/river-qa-refactoring-solaris/trunk/qa/lib/ld.jar
qa1-loader-pref.jar:
[jar] Building jar: /zonestorage/hudson_solaris/home/hudson/hudson-slave/workspace/river-qa-refactoring-solaris/trunk/qa/lib/qa1-loader-pref.jar
qa1-policy-provider.jar:
[jar] Building jar: /zonestorage/hudson_solaris/home/hudson/hudson-slave/workspace/river-qa-refactoring-solaris/trunk/qa/lib/qa1-policy-provider.jar
jars:
harness-runtime:
run:
james-brown:
[mkdir] Created dir: /zonestorage/hudson_solaris/home/hudson/hudson-slave/workspace/river-qa-refactoring-solaris/trunk/qa/soul
[touch] Creating /zonestorage/hudson_solaris/home/hudson/hudson-slave/workspace/river-qa-refactoring-solaris/trunk/qa/soul/soul.201302241018031210
run-categories:
[java] Problem with KEEPALIVE_PORT:10004
[java] Unexpected exception:
[java] java.net.BindException: Address already in use
[java] at java.net.PlainSocketImpl.socketBind(Native Method)
[java] at java.net.PlainSocketImpl.bind(PlainSocketImpl.java:383)
[java] at java.net.ServerSocket.bind(ServerSocket.java:328)
[java] at java.net.ServerSocket.bind(ServerSocket.java:286)
[java] at com.sun.jini.qa.harness.MasterHarness$KeepAlivePort.run(MasterHarness.java:257)
[java] at java.lang.Thread.run(Thread.java:662)
[java] Java Result: 1
collect-result:
BUILD FAILED
/zonestorage/hudson_solaris/home/hudson/hudson-slave/workspace/river-qa-refactoring-solaris/trunk/build.xml:2093: The following error occurred while executing this line:
/zonestorage/hudson_solaris/home/hudson/hudson-slave/workspace/river-qa-refactoring-solaris/trunk/qa/build.xml:406: The following error occurred while executing this line:
/zonestorage/hudson_solaris/home/hudson/hudson-slave/workspace/river-qa-refactoring-solaris/trunk/qa/build.xml:380: condition satisfied
Total time: 5 minutes 54 seconds
Build step 'Invoke Ant' marked build as failure
Archiving artifacts
Build failed in Jenkins: river-qa-refactoring-solaris #28
Posted by Apache Jenkins Server <je...@builds.apache.org>.
See <https://builds.apache.org/job/river-qa-refactoring-solaris/28/changes>
Changes:
[peter_firmstone] Attempt to fix failing javaspace test
------------------------------------------
[...truncated 1169 lines...]
[exec] Certificate stored in file </zonestorage/hudson_solaris/home/hudson/hudson-slave/workspace/river-qa-refactoring-solaris/trunk/qa/harness/trust/group.cert>
are-passwords-available:
password:
[echo] creating passwords
truststore:
[exec] Certificate was added to keystore
[exec] Certificate was added to keystore
[exec] Certificate was added to keystore
[exec] Certificate was added to keystore
[exec] Certificate was added to keystore
[exec] Certificate was added to keystore
[exec] Certificate was added to keystore
[exec] Certificate was added to keystore
[exec] Certificate was added to keystore
trust:
qaman.jar:
[jar] Building jar: /zonestorage/hudson_solaris/home/hudson/hudson-slave/workspace/river-qa-refactoring-solaris/trunk/qa/lib/qaman.jar
mergedpolicyprovider.jar:
[jar] Building jar: /zonestorage/hudson_solaris/home/hudson/hudson-slave/workspace/river-qa-refactoring-solaris/trunk/qa/lib-ext/mergedpolicyprovider.jar
nonactivatablegroup.jar:
[jar] Building jar: /zonestorage/hudson_solaris/home/hudson/hudson-slave/workspace/river-qa-refactoring-solaris/trunk/qa/lib/nonactivatablegroup.jar
nonactivatablegroup-dl.jar:
[jar] Building jar: /zonestorage/hudson_solaris/home/hudson/hudson-slave/workspace/river-qa-refactoring-solaris/trunk/qa/lib/nonactivatablegroup-dl.jar
harness-killer.jar:
[jar] Building jar: /zonestorage/hudson_solaris/home/hudson/hudson-slave/workspace/river-qa-refactoring-solaris/trunk/qa/lib/harness-killer.jar
harness-killer-dl.jar:
[jar] Building jar: /zonestorage/hudson_solaris/home/hudson/hudson-slave/workspace/river-qa-refactoring-solaris/trunk/qa/lib/harness-killer-dl.jar
jiniharness.jar:
[jar] Building jar: /zonestorage/hudson_solaris/home/hudson/hudson-slave/workspace/river-qa-refactoring-solaris/trunk/qa/lib/jiniharness.jar
harness-jars:
qa1-end2end.jar:
[jar] Building jar: /zonestorage/hudson_solaris/home/hudson/hudson-slave/workspace/river-qa-refactoring-solaris/trunk/qa/lib/qa1-end2end.jar
qa1-fiddler-dl.jar:
[jar] Building jar: /zonestorage/hudson_solaris/home/hudson/hudson-slave/workspace/river-qa-refactoring-solaris/trunk/qa/lib/qa1-fiddler-dl.jar
qa1-joinmanager-dl.jar:
[jar] Building jar: /zonestorage/hudson_solaris/home/hudson/hudson-slave/workspace/river-qa-refactoring-solaris/trunk/qa/lib/qa1-joinmanager-dl.jar
qa1-mahalo-dl.jar:
[jar] Building jar: /zonestorage/hudson_solaris/home/hudson/hudson-slave/workspace/river-qa-refactoring-solaris/trunk/qa/lib/qa1-mahalo-dl.jar
qa1-mercury.jar:
[jar] Building jar: /zonestorage/hudson_solaris/home/hudson/hudson-slave/workspace/river-qa-refactoring-solaris/trunk/qa/lib/qa1-mercury.jar
[jar] Updating jar: /zonestorage/hudson_solaris/home/hudson/hudson-slave/workspace/river-qa-refactoring-solaris/trunk/qa/lib/qa1-mercury.jar
qa1-mercury-dl.jar:
[jar] Building jar: /zonestorage/hudson_solaris/home/hudson/hudson-slave/workspace/river-qa-refactoring-solaris/trunk/qa/lib/qa1-mercury-dl.jar
[jar] Updating jar: /zonestorage/hudson_solaris/home/hudson/hudson-slave/workspace/river-qa-refactoring-solaris/trunk/qa/lib/qa1-mercury-dl.jar
qa1-mercury-bogusimpl.jar:
[jar] Building jar: /zonestorage/hudson_solaris/home/hudson/hudson-slave/workspace/river-qa-refactoring-solaris/trunk/qa/lib/qa1-mercury-bogusimpl.jar
qa1-wrapper.jar:
[jar] Building jar: /zonestorage/hudson_solaris/home/hudson/hudson-slave/workspace/river-qa-refactoring-solaris/trunk/qa/lib/qa1-wrapper.jar
qa1-norm-dl.jar:
[jar] Building jar: /zonestorage/hudson_solaris/home/hudson/hudson-slave/workspace/river-qa-refactoring-solaris/trunk/qa/lib/qa1-norm-dl.jar
qa1-outrigger-dl.jar:
[jar] Building jar: /zonestorage/hudson_solaris/home/hudson/hudson-slave/workspace/river-qa-refactoring-solaris/trunk/qa/lib/qa1-outrigger-dl.jar
qa1-multihomedmetainf.jar:
[jar] Building jar: /zonestorage/hudson_solaris/home/hudson/hudson-slave/workspace/river-qa-refactoring-solaris/trunk/qa/lib/qa1-multihomedmetainf.jar
jinitests:
[jar] Building jar: /zonestorage/hudson_solaris/home/hudson/hudson-slave/workspace/river-qa-refactoring-solaris/trunk/qa/lib/jinitests.jar
[jar] Updating jar: /zonestorage/hudson_solaris/home/hudson/hudson-slave/workspace/river-qa-refactoring-solaris/trunk/qa/lib/jinitests.jar
[jar] Updating jar: /zonestorage/hudson_solaris/home/hudson/hudson-slave/workspace/river-qa-refactoring-solaris/trunk/qa/lib/jinitests.jar
jinitests.jar:
qa1-mainwrapper.jar:
[jar] Building jar: /zonestorage/hudson_solaris/home/hudson/hudson-slave/workspace/river-qa-refactoring-solaris/trunk/qa/lib/qa1-mainwrapper.jar
qa1-start-cb1.jar:
[jar] Building jar: /zonestorage/hudson_solaris/home/hudson/hudson-slave/workspace/river-qa-refactoring-solaris/trunk/qa/lib/qa1-start-cb1.jar
qa1-start-cb2.jar:
[jar] Building jar: /zonestorage/hudson_solaris/home/hudson/hudson-slave/workspace/river-qa-refactoring-solaris/trunk/qa/lib/qa1-start-cb2.jar
qa1-start-cb3.jar:
[jar] Building jar: /zonestorage/hudson_solaris/home/hudson/hudson-slave/workspace/river-qa-refactoring-solaris/trunk/qa/lib/qa1-start-cb3.jar
qa1-start-probe.jar:
[jar] Building jar: /zonestorage/hudson_solaris/home/hudson/hudson-slave/workspace/river-qa-refactoring-solaris/trunk/qa/lib/qa1-start-probe.jar
qa1-start-probe-dl.jar:
[jar] Building jar: /zonestorage/hudson_solaris/home/hudson/hudson-slave/workspace/river-qa-refactoring-solaris/trunk/qa/lib/qa1-start-probe-dl.jar
qa1-start-tests.jar:
[jar] Building jar: /zonestorage/hudson_solaris/home/hudson/hudson-slave/workspace/river-qa-refactoring-solaris/trunk/qa/lib/qa1-start-tests.jar
[jar] Updating jar: /zonestorage/hudson_solaris/home/hudson/hudson-slave/workspace/river-qa-refactoring-solaris/trunk/qa/lib/qa1-start-tests.jar
qa1-start-testservice1.jar:
[jar] Building jar: /zonestorage/hudson_solaris/home/hudson/hudson-slave/workspace/river-qa-refactoring-solaris/trunk/qa/lib/qa1-start-testservice1.jar
[jar] Updating jar: /zonestorage/hudson_solaris/home/hudson/hudson-slave/workspace/river-qa-refactoring-solaris/trunk/qa/lib/qa1-start-testservice1.jar
qa1-start-testservice1-dl.jar:
[jar] Building jar: /zonestorage/hudson_solaris/home/hudson/hudson-slave/workspace/river-qa-refactoring-solaris/trunk/qa/lib/qa1-start-testservice1-dl.jar
qa1-start-testservice2.jar:
[jar] Building jar: /zonestorage/hudson_solaris/home/hudson/hudson-slave/workspace/river-qa-refactoring-solaris/trunk/qa/lib/qa1-start-testservice2.jar
[jar] Updating jar: /zonestorage/hudson_solaris/home/hudson/hudson-slave/workspace/river-qa-refactoring-solaris/trunk/qa/lib/qa1-start-testservice2.jar
qa1-start-testservice2-dl.jar:
[jar] Building jar: /zonestorage/hudson_solaris/home/hudson/hudson-slave/workspace/river-qa-refactoring-solaris/trunk/qa/lib/qa1-start-testservice2-dl.jar
qa1-start-testservice-common.jar:
[jar] Building jar: /zonestorage/hudson_solaris/home/hudson/hudson-slave/workspace/river-qa-refactoring-solaris/trunk/qa/lib/qa1-start-testservice-common.jar
qa1-start-testservice-common-dl.jar:
[jar] Building jar: /zonestorage/hudson_solaris/home/hudson/hudson-slave/workspace/river-qa-refactoring-solaris/trunk/qa/lib/qa1-start-testservice-common-dl.jar
qa1-start-testservicenocons.jar:
[jar] Building jar: /zonestorage/hudson_solaris/home/hudson/hudson-slave/workspace/river-qa-refactoring-solaris/trunk/qa/lib/qa1-start-testservicenocons.jar
qa1-start-testservicenocons-dl.jar:
[jar] Building jar: /zonestorage/hudson_solaris/home/hudson/hudson-slave/workspace/river-qa-refactoring-solaris/trunk/qa/lib/qa1-start-testservicenocons-dl.jar
qa1-lookup-simulator.jar:
[jar] Building jar: /zonestorage/hudson_solaris/home/hudson/hudson-slave/workspace/river-qa-refactoring-solaris/trunk/qa/lib/qa1-lookup-simulator.jar
[jar] Updating jar: /zonestorage/hudson_solaris/home/hudson/hudson-slave/workspace/river-qa-refactoring-solaris/trunk/qa/lib/qa1-lookup-simulator.jar
qa1-lookup-simulator-dl.jar:
[jar] Building jar: /zonestorage/hudson_solaris/home/hudson/hudson-slave/workspace/river-qa-refactoring-solaris/trunk/qa/lib/qa1-lookup-simulator-dl.jar
[jar] Updating jar: /zonestorage/hudson_solaris/home/hudson/hudson-slave/workspace/river-qa-refactoring-solaris/trunk/qa/lib/qa1-lookup-simulator-dl.jar
qa1-share-dl.jar:
[jar] Building jar: /zonestorage/hudson_solaris/home/hudson/hudson-slave/workspace/river-qa-refactoring-solaris/trunk/qa/lib/qa1-share-dl.jar
[jar] Updating jar: /zonestorage/hudson_solaris/home/hudson/hudson-slave/workspace/river-qa-refactoring-solaris/trunk/qa/lib/qa1-share-dl.jar
qa1-reggie-race.jar:
[jar] Building jar: /zonestorage/hudson_solaris/home/hudson/hudson-slave/workspace/river-qa-refactoring-solaris/trunk/qa/lib/qa1-reggie-race.jar
qa1-reggie-race-dl.jar:
[jar] Building jar: /zonestorage/hudson_solaris/home/hudson/hudson-slave/workspace/river-qa-refactoring-solaris/trunk/qa/lib/qa1-reggie-race-dl.jar
fullloggingfilter.jar:
[jar] Building jar: /zonestorage/hudson_solaris/home/hudson/hudson-slave/workspace/river-qa-refactoring-solaris/trunk/qa/lib/fullloggingfilter.jar
qa1-discoveryservice-dl.jar:
[jar] Building jar: /zonestorage/hudson_solaris/home/hudson/hudson-slave/workspace/river-qa-refactoring-solaris/trunk/qa/lib/qa1-discoveryservice-dl.jar
qa1-export-servercontext-tests-non-null.jar:
[jar] Building jar: /zonestorage/hudson_solaris/home/hudson/hudson-slave/workspace/river-qa-refactoring-solaris/trunk/qa/lib/qa1-export-servercontext-tests-non-null.jar
qa1-export-servercontext-tests-null.jar:
[jar] Building jar: /zonestorage/hudson_solaris/home/hudson/hudson-slave/workspace/river-qa-refactoring-solaris/trunk/qa/lib/qa1-export-servercontext-tests-null.jar
qa1-export-servercontext-tests-providers-parsing.jar:
[jar] Building jar: /zonestorage/hudson_solaris/home/hudson/hudson-slave/workspace/river-qa-refactoring-solaris/trunk/qa/lib/qa1-export-servercontext-tests-providers-parsing.jar
qa1-io-util-dl.jar:
[jar] Building jar: /zonestorage/hudson_solaris/home/hudson/hudson-slave/workspace/river-qa-refactoring-solaris/trunk/qa/lib/qa1-io-util-dl.jar
qa1-io-marshalinputstream-test.jar:
[jar] Building jar: /zonestorage/hudson_solaris/home/hudson/hudson-slave/workspace/river-qa-refactoring-solaris/trunk/qa/lib/qa1-io-marshalinputstream-test.jar
[jar] Updating jar: /zonestorage/hudson_solaris/home/hudson/hudson-slave/workspace/river-qa-refactoring-solaris/trunk/qa/lib/qa1-io-marshalinputstream-test.jar
qa1-io-marshalledinstance-test.jar:
[jar] Building jar: /zonestorage/hudson_solaris/home/hudson/hudson-slave/workspace/river-qa-refactoring-solaris/trunk/qa/lib/qa1-io-marshalledinstance-test.jar
[jar] Updating jar: /zonestorage/hudson_solaris/home/hudson/hudson-slave/workspace/river-qa-refactoring-solaris/trunk/qa/lib/qa1-io-marshalledinstance-test.jar
qa1-javaspace-dl.jar:
[jar] Building jar: /zonestorage/hudson_solaris/home/hudson/hudson-slave/workspace/river-qa-refactoring-solaris/trunk/qa/lib/qa1-javaspace-dl.jar
qa1-lookupservice-dl.jar:
[jar] Building jar: /zonestorage/hudson_solaris/home/hudson/hudson-slave/workspace/river-qa-refactoring-solaris/trunk/qa/lib/qa1-lookupservice-dl.jar
qa1-renewalservice-dl.jar:
[jar] Building jar: /zonestorage/hudson_solaris/home/hudson/hudson-slave/workspace/river-qa-refactoring-solaris/trunk/qa/lib/qa1-renewalservice-dl.jar
[jar] Updating jar: /zonestorage/hudson_solaris/home/hudson/hudson-slave/workspace/river-qa-refactoring-solaris/trunk/qa/lib/qa1-renewalservice-dl.jar
qa1-securityDoPrivileged.jar:
[jar] Building jar: /zonestorage/hudson_solaris/home/hudson/hudson-slave/workspace/river-qa-refactoring-solaris/trunk/qa/lib/qa1-securityDoPrivileged.jar
qa1-securityUtil.jar:
[jar] Building jar: /zonestorage/hudson_solaris/home/hudson/hudson-slave/workspace/river-qa-refactoring-solaris/trunk/qa/lib/qa1-securityUtil.jar
qa1-servicediscovery-dl.jar:
[java] Warning: Class not found: net.jini.lookup.ServiceDiscoveryManager$LookupCacheImpl$LookupListener_Stub
[jar] Building jar: /zonestorage/hudson_solaris/home/hudson/hudson-slave/workspace/river-qa-refactoring-solaris/trunk/qa/lib/qa1-servicediscovery-dl.jar
[java] Warning: Class not found: net.jini.lookup.ServiceDiscoveryManager$LookupCacheImpl$LookupListener_Stub
[jar] Updating jar: /zonestorage/hudson_solaris/home/hudson/hudson-slave/workspace/river-qa-refactoring-solaris/trunk/qa/lib/qa1-servicediscovery-dl.jar
qa1-httpmd.jar:
[jar] Building jar: /zonestorage/hudson_solaris/home/hudson/hudson-slave/workspace/river-qa-refactoring-solaris/trunk/qa/lib/qa1-httpmd.jar
qa1-httpmd-same.jar:
[copy] Copying 1 file to /zonestorage/hudson_solaris/home/hudson/hudson-slave/workspace/river-qa-refactoring-solaris/trunk/qa/lib
qa1-httpmd-another.jar:
[jar] Building jar: /zonestorage/hudson_solaris/home/hudson/hudson-slave/workspace/river-qa-refactoring-solaris/trunk/qa/lib/qa1-httpmd-another.jar
ld.jar:
[jar] Building jar: /zonestorage/hudson_solaris/home/hudson/hudson-slave/workspace/river-qa-refactoring-solaris/trunk/qa/lib/ld.jar
qa1-loader-pref.jar:
[jar] Building jar: /zonestorage/hudson_solaris/home/hudson/hudson-slave/workspace/river-qa-refactoring-solaris/trunk/qa/lib/qa1-loader-pref.jar
qa1-policy-provider.jar:
[jar] Building jar: /zonestorage/hudson_solaris/home/hudson/hudson-slave/workspace/river-qa-refactoring-solaris/trunk/qa/lib/qa1-policy-provider.jar
jars:
harness-runtime:
run:
james-brown:
[mkdir] Created dir: /zonestorage/hudson_solaris/home/hudson/hudson-slave/workspace/river-qa-refactoring-solaris/trunk/qa/soul
[touch] Creating /zonestorage/hudson_solaris/home/hudson/hudson-slave/workspace/river-qa-refactoring-solaris/trunk/qa/soul/soul.201302240457045644
run-categories:
[java] Problem with KEEPALIVE_PORT:10004
[java] Unexpected exception:
[java] java.net.BindException: Address already in use
[java] at java.net.PlainSocketImpl.socketBind(Native Method)
[java] at java.net.PlainSocketImpl.bind(PlainSocketImpl.java:383)
[java] at java.net.ServerSocket.bind(ServerSocket.java:328)
[java] at java.net.ServerSocket.bind(ServerSocket.java:286)
[java] at com.sun.jini.qa.harness.MasterHarness$KeepAlivePort.run(MasterHarness.java:257)
[java] at java.lang.Thread.run(Thread.java:662)
[java] Java Result: 1
collect-result:
BUILD FAILED
/zonestorage/hudson_solaris/home/hudson/hudson-slave/workspace/river-qa-refactoring-solaris/trunk/build.xml:2093: The following error occurred while executing this line:
/zonestorage/hudson_solaris/home/hudson/hudson-slave/workspace/river-qa-refactoring-solaris/trunk/qa/build.xml:406: The following error occurred while executing this line:
/zonestorage/hudson_solaris/home/hudson/hudson-slave/workspace/river-qa-refactoring-solaris/trunk/qa/build.xml:380: condition satisfied
Total time: 11 minutes 14 seconds
Build step 'Invoke Ant' marked build as failure
Archiving artifacts
Build failed in Jenkins: river-qa-refactoring-solaris #27
Posted by Apache Jenkins Server <je...@builds.apache.org>.
See <https://builds.apache.org/job/river-qa-refactoring-solaris/27/changes>
Changes:
[peter_firmstone] Attempt to fix last failing test UseNotifyLeaseTestRenew on arm
------------------------------------------
[...truncated 1172 lines...]
[exec] Certificate stored in file </zonestorage/hudson_solaris/home/hudson/hudson-slave/workspace/river-qa-refactoring-solaris/trunk/qa/harness/trust/group.cert>
are-passwords-available:
password:
[echo] creating passwords
truststore:
[exec] Certificate was added to keystore
[exec] Certificate was added to keystore
[exec] Certificate was added to keystore
[exec] Certificate was added to keystore
[exec] Certificate was added to keystore
[exec] Certificate was added to keystore
[exec] Certificate was added to keystore
[exec] Certificate was added to keystore
[exec] Certificate was added to keystore
trust:
qaman.jar:
[jar] Building jar: /zonestorage/hudson_solaris/home/hudson/hudson-slave/workspace/river-qa-refactoring-solaris/trunk/qa/lib/qaman.jar
mergedpolicyprovider.jar:
[jar] Building jar: /zonestorage/hudson_solaris/home/hudson/hudson-slave/workspace/river-qa-refactoring-solaris/trunk/qa/lib-ext/mergedpolicyprovider.jar
nonactivatablegroup.jar:
[jar] Building jar: /zonestorage/hudson_solaris/home/hudson/hudson-slave/workspace/river-qa-refactoring-solaris/trunk/qa/lib/nonactivatablegroup.jar
nonactivatablegroup-dl.jar:
[jar] Building jar: /zonestorage/hudson_solaris/home/hudson/hudson-slave/workspace/river-qa-refactoring-solaris/trunk/qa/lib/nonactivatablegroup-dl.jar
harness-killer.jar:
[jar] Building jar: /zonestorage/hudson_solaris/home/hudson/hudson-slave/workspace/river-qa-refactoring-solaris/trunk/qa/lib/harness-killer.jar
harness-killer-dl.jar:
[jar] Building jar: /zonestorage/hudson_solaris/home/hudson/hudson-slave/workspace/river-qa-refactoring-solaris/trunk/qa/lib/harness-killer-dl.jar
jiniharness.jar:
[jar] Building jar: /zonestorage/hudson_solaris/home/hudson/hudson-slave/workspace/river-qa-refactoring-solaris/trunk/qa/lib/jiniharness.jar
harness-jars:
qa1-end2end.jar:
[jar] Building jar: /zonestorage/hudson_solaris/home/hudson/hudson-slave/workspace/river-qa-refactoring-solaris/trunk/qa/lib/qa1-end2end.jar
qa1-fiddler-dl.jar:
[jar] Building jar: /zonestorage/hudson_solaris/home/hudson/hudson-slave/workspace/river-qa-refactoring-solaris/trunk/qa/lib/qa1-fiddler-dl.jar
qa1-joinmanager-dl.jar:
[jar] Building jar: /zonestorage/hudson_solaris/home/hudson/hudson-slave/workspace/river-qa-refactoring-solaris/trunk/qa/lib/qa1-joinmanager-dl.jar
qa1-mahalo-dl.jar:
[jar] Building jar: /zonestorage/hudson_solaris/home/hudson/hudson-slave/workspace/river-qa-refactoring-solaris/trunk/qa/lib/qa1-mahalo-dl.jar
qa1-mercury.jar:
[jar] Building jar: /zonestorage/hudson_solaris/home/hudson/hudson-slave/workspace/river-qa-refactoring-solaris/trunk/qa/lib/qa1-mercury.jar
[jar] Updating jar: /zonestorage/hudson_solaris/home/hudson/hudson-slave/workspace/river-qa-refactoring-solaris/trunk/qa/lib/qa1-mercury.jar
qa1-mercury-dl.jar:
[jar] Building jar: /zonestorage/hudson_solaris/home/hudson/hudson-slave/workspace/river-qa-refactoring-solaris/trunk/qa/lib/qa1-mercury-dl.jar
[jar] Updating jar: /zonestorage/hudson_solaris/home/hudson/hudson-slave/workspace/river-qa-refactoring-solaris/trunk/qa/lib/qa1-mercury-dl.jar
qa1-mercury-bogusimpl.jar:
[jar] Building jar: /zonestorage/hudson_solaris/home/hudson/hudson-slave/workspace/river-qa-refactoring-solaris/trunk/qa/lib/qa1-mercury-bogusimpl.jar
qa1-wrapper.jar:
[jar] Building jar: /zonestorage/hudson_solaris/home/hudson/hudson-slave/workspace/river-qa-refactoring-solaris/trunk/qa/lib/qa1-wrapper.jar
qa1-norm-dl.jar:
[jar] Building jar: /zonestorage/hudson_solaris/home/hudson/hudson-slave/workspace/river-qa-refactoring-solaris/trunk/qa/lib/qa1-norm-dl.jar
qa1-outrigger-dl.jar:
[jar] Building jar: /zonestorage/hudson_solaris/home/hudson/hudson-slave/workspace/river-qa-refactoring-solaris/trunk/qa/lib/qa1-outrigger-dl.jar
qa1-multihomedmetainf.jar:
[jar] Building jar: /zonestorage/hudson_solaris/home/hudson/hudson-slave/workspace/river-qa-refactoring-solaris/trunk/qa/lib/qa1-multihomedmetainf.jar
jinitests:
[jar] Building jar: /zonestorage/hudson_solaris/home/hudson/hudson-slave/workspace/river-qa-refactoring-solaris/trunk/qa/lib/jinitests.jar
[jar] Updating jar: /zonestorage/hudson_solaris/home/hudson/hudson-slave/workspace/river-qa-refactoring-solaris/trunk/qa/lib/jinitests.jar
[jar] Updating jar: /zonestorage/hudson_solaris/home/hudson/hudson-slave/workspace/river-qa-refactoring-solaris/trunk/qa/lib/jinitests.jar
jinitests.jar:
qa1-mainwrapper.jar:
[jar] Building jar: /zonestorage/hudson_solaris/home/hudson/hudson-slave/workspace/river-qa-refactoring-solaris/trunk/qa/lib/qa1-mainwrapper.jar
qa1-start-cb1.jar:
[jar] Building jar: /zonestorage/hudson_solaris/home/hudson/hudson-slave/workspace/river-qa-refactoring-solaris/trunk/qa/lib/qa1-start-cb1.jar
qa1-start-cb2.jar:
[jar] Building jar: /zonestorage/hudson_solaris/home/hudson/hudson-slave/workspace/river-qa-refactoring-solaris/trunk/qa/lib/qa1-start-cb2.jar
qa1-start-cb3.jar:
[jar] Building jar: /zonestorage/hudson_solaris/home/hudson/hudson-slave/workspace/river-qa-refactoring-solaris/trunk/qa/lib/qa1-start-cb3.jar
qa1-start-probe.jar:
[jar] Building jar: /zonestorage/hudson_solaris/home/hudson/hudson-slave/workspace/river-qa-refactoring-solaris/trunk/qa/lib/qa1-start-probe.jar
qa1-start-probe-dl.jar:
[jar] Building jar: /zonestorage/hudson_solaris/home/hudson/hudson-slave/workspace/river-qa-refactoring-solaris/trunk/qa/lib/qa1-start-probe-dl.jar
qa1-start-tests.jar:
[jar] Building jar: /zonestorage/hudson_solaris/home/hudson/hudson-slave/workspace/river-qa-refactoring-solaris/trunk/qa/lib/qa1-start-tests.jar
[jar] Updating jar: /zonestorage/hudson_solaris/home/hudson/hudson-slave/workspace/river-qa-refactoring-solaris/trunk/qa/lib/qa1-start-tests.jar
qa1-start-testservice1.jar:
[jar] Building jar: /zonestorage/hudson_solaris/home/hudson/hudson-slave/workspace/river-qa-refactoring-solaris/trunk/qa/lib/qa1-start-testservice1.jar
[jar] Updating jar: /zonestorage/hudson_solaris/home/hudson/hudson-slave/workspace/river-qa-refactoring-solaris/trunk/qa/lib/qa1-start-testservice1.jar
qa1-start-testservice1-dl.jar:
[jar] Building jar: /zonestorage/hudson_solaris/home/hudson/hudson-slave/workspace/river-qa-refactoring-solaris/trunk/qa/lib/qa1-start-testservice1-dl.jar
qa1-start-testservice2.jar:
[jar] Building jar: /zonestorage/hudson_solaris/home/hudson/hudson-slave/workspace/river-qa-refactoring-solaris/trunk/qa/lib/qa1-start-testservice2.jar
[jar] Updating jar: /zonestorage/hudson_solaris/home/hudson/hudson-slave/workspace/river-qa-refactoring-solaris/trunk/qa/lib/qa1-start-testservice2.jar
qa1-start-testservice2-dl.jar:
[jar] Building jar: /zonestorage/hudson_solaris/home/hudson/hudson-slave/workspace/river-qa-refactoring-solaris/trunk/qa/lib/qa1-start-testservice2-dl.jar
qa1-start-testservice-common.jar:
[jar] Building jar: /zonestorage/hudson_solaris/home/hudson/hudson-slave/workspace/river-qa-refactoring-solaris/trunk/qa/lib/qa1-start-testservice-common.jar
qa1-start-testservice-common-dl.jar:
[jar] Building jar: /zonestorage/hudson_solaris/home/hudson/hudson-slave/workspace/river-qa-refactoring-solaris/trunk/qa/lib/qa1-start-testservice-common-dl.jar
qa1-start-testservicenocons.jar:
[jar] Building jar: /zonestorage/hudson_solaris/home/hudson/hudson-slave/workspace/river-qa-refactoring-solaris/trunk/qa/lib/qa1-start-testservicenocons.jar
qa1-start-testservicenocons-dl.jar:
[jar] Building jar: /zonestorage/hudson_solaris/home/hudson/hudson-slave/workspace/river-qa-refactoring-solaris/trunk/qa/lib/qa1-start-testservicenocons-dl.jar
qa1-lookup-simulator.jar:
[jar] Building jar: /zonestorage/hudson_solaris/home/hudson/hudson-slave/workspace/river-qa-refactoring-solaris/trunk/qa/lib/qa1-lookup-simulator.jar
[jar] Updating jar: /zonestorage/hudson_solaris/home/hudson/hudson-slave/workspace/river-qa-refactoring-solaris/trunk/qa/lib/qa1-lookup-simulator.jar
qa1-lookup-simulator-dl.jar:
[jar] Building jar: /zonestorage/hudson_solaris/home/hudson/hudson-slave/workspace/river-qa-refactoring-solaris/trunk/qa/lib/qa1-lookup-simulator-dl.jar
[jar] Updating jar: /zonestorage/hudson_solaris/home/hudson/hudson-slave/workspace/river-qa-refactoring-solaris/trunk/qa/lib/qa1-lookup-simulator-dl.jar
qa1-share-dl.jar:
[jar] Building jar: /zonestorage/hudson_solaris/home/hudson/hudson-slave/workspace/river-qa-refactoring-solaris/trunk/qa/lib/qa1-share-dl.jar
[jar] Updating jar: /zonestorage/hudson_solaris/home/hudson/hudson-slave/workspace/river-qa-refactoring-solaris/trunk/qa/lib/qa1-share-dl.jar
qa1-reggie-race.jar:
[jar] Building jar: /zonestorage/hudson_solaris/home/hudson/hudson-slave/workspace/river-qa-refactoring-solaris/trunk/qa/lib/qa1-reggie-race.jar
qa1-reggie-race-dl.jar:
[jar] Building jar: /zonestorage/hudson_solaris/home/hudson/hudson-slave/workspace/river-qa-refactoring-solaris/trunk/qa/lib/qa1-reggie-race-dl.jar
fullloggingfilter.jar:
[jar] Building jar: /zonestorage/hudson_solaris/home/hudson/hudson-slave/workspace/river-qa-refactoring-solaris/trunk/qa/lib/fullloggingfilter.jar
qa1-discoveryservice-dl.jar:
[jar] Building jar: /zonestorage/hudson_solaris/home/hudson/hudson-slave/workspace/river-qa-refactoring-solaris/trunk/qa/lib/qa1-discoveryservice-dl.jar
qa1-export-servercontext-tests-non-null.jar:
[jar] Building jar: /zonestorage/hudson_solaris/home/hudson/hudson-slave/workspace/river-qa-refactoring-solaris/trunk/qa/lib/qa1-export-servercontext-tests-non-null.jar
qa1-export-servercontext-tests-null.jar:
[jar] Building jar: /zonestorage/hudson_solaris/home/hudson/hudson-slave/workspace/river-qa-refactoring-solaris/trunk/qa/lib/qa1-export-servercontext-tests-null.jar
qa1-export-servercontext-tests-providers-parsing.jar:
[jar] Building jar: /zonestorage/hudson_solaris/home/hudson/hudson-slave/workspace/river-qa-refactoring-solaris/trunk/qa/lib/qa1-export-servercontext-tests-providers-parsing.jar
qa1-io-util-dl.jar:
[jar] Building jar: /zonestorage/hudson_solaris/home/hudson/hudson-slave/workspace/river-qa-refactoring-solaris/trunk/qa/lib/qa1-io-util-dl.jar
qa1-io-marshalinputstream-test.jar:
[jar] Building jar: /zonestorage/hudson_solaris/home/hudson/hudson-slave/workspace/river-qa-refactoring-solaris/trunk/qa/lib/qa1-io-marshalinputstream-test.jar
[jar] Updating jar: /zonestorage/hudson_solaris/home/hudson/hudson-slave/workspace/river-qa-refactoring-solaris/trunk/qa/lib/qa1-io-marshalinputstream-test.jar
qa1-io-marshalledinstance-test.jar:
[jar] Building jar: /zonestorage/hudson_solaris/home/hudson/hudson-slave/workspace/river-qa-refactoring-solaris/trunk/qa/lib/qa1-io-marshalledinstance-test.jar
[jar] Updating jar: /zonestorage/hudson_solaris/home/hudson/hudson-slave/workspace/river-qa-refactoring-solaris/trunk/qa/lib/qa1-io-marshalledinstance-test.jar
qa1-javaspace-dl.jar:
[jar] Building jar: /zonestorage/hudson_solaris/home/hudson/hudson-slave/workspace/river-qa-refactoring-solaris/trunk/qa/lib/qa1-javaspace-dl.jar
qa1-lookupservice-dl.jar:
[jar] Building jar: /zonestorage/hudson_solaris/home/hudson/hudson-slave/workspace/river-qa-refactoring-solaris/trunk/qa/lib/qa1-lookupservice-dl.jar
qa1-renewalservice-dl.jar:
[jar] Building jar: /zonestorage/hudson_solaris/home/hudson/hudson-slave/workspace/river-qa-refactoring-solaris/trunk/qa/lib/qa1-renewalservice-dl.jar
[jar] Updating jar: /zonestorage/hudson_solaris/home/hudson/hudson-slave/workspace/river-qa-refactoring-solaris/trunk/qa/lib/qa1-renewalservice-dl.jar
qa1-securityDoPrivileged.jar:
[jar] Building jar: /zonestorage/hudson_solaris/home/hudson/hudson-slave/workspace/river-qa-refactoring-solaris/trunk/qa/lib/qa1-securityDoPrivileged.jar
qa1-securityUtil.jar:
[jar] Building jar: /zonestorage/hudson_solaris/home/hudson/hudson-slave/workspace/river-qa-refactoring-solaris/trunk/qa/lib/qa1-securityUtil.jar
qa1-servicediscovery-dl.jar:
[java] Warning: Class not found: net.jini.lookup.ServiceDiscoveryManager$LookupCacheImpl$LookupListener_Stub
[jar] Building jar: /zonestorage/hudson_solaris/home/hudson/hudson-slave/workspace/river-qa-refactoring-solaris/trunk/qa/lib/qa1-servicediscovery-dl.jar
[java] Warning: Class not found: net.jini.lookup.ServiceDiscoveryManager$LookupCacheImpl$LookupListener_Stub
[jar] Updating jar: /zonestorage/hudson_solaris/home/hudson/hudson-slave/workspace/river-qa-refactoring-solaris/trunk/qa/lib/qa1-servicediscovery-dl.jar
qa1-httpmd.jar:
[jar] Building jar: /zonestorage/hudson_solaris/home/hudson/hudson-slave/workspace/river-qa-refactoring-solaris/trunk/qa/lib/qa1-httpmd.jar
qa1-httpmd-same.jar:
[copy] Copying 1 file to /zonestorage/hudson_solaris/home/hudson/hudson-slave/workspace/river-qa-refactoring-solaris/trunk/qa/lib
qa1-httpmd-another.jar:
[jar] Building jar: /zonestorage/hudson_solaris/home/hudson/hudson-slave/workspace/river-qa-refactoring-solaris/trunk/qa/lib/qa1-httpmd-another.jar
ld.jar:
[jar] Building jar: /zonestorage/hudson_solaris/home/hudson/hudson-slave/workspace/river-qa-refactoring-solaris/trunk/qa/lib/ld.jar
qa1-loader-pref.jar:
[jar] Building jar: /zonestorage/hudson_solaris/home/hudson/hudson-slave/workspace/river-qa-refactoring-solaris/trunk/qa/lib/qa1-loader-pref.jar
qa1-policy-provider.jar:
[jar] Building jar: /zonestorage/hudson_solaris/home/hudson/hudson-slave/workspace/river-qa-refactoring-solaris/trunk/qa/lib/qa1-policy-provider.jar
jars:
harness-runtime:
run:
james-brown:
[mkdir] Created dir: /zonestorage/hudson_solaris/home/hudson/hudson-slave/workspace/river-qa-refactoring-solaris/trunk/qa/soul
[touch] Creating /zonestorage/hudson_solaris/home/hudson/hudson-slave/workspace/river-qa-refactoring-solaris/trunk/qa/soul/soul.201302231401011238
run-categories:
[java] Problem with KEEPALIVE_PORT:10004
[java] Unexpected exception:
[java] java.net.BindException: Address already in use
[java] at java.net.PlainSocketImpl.socketBind(Native Method)
[java] at java.net.PlainSocketImpl.bind(PlainSocketImpl.java:383)
[java] at java.net.ServerSocket.bind(ServerSocket.java:328)
[java] at java.net.ServerSocket.bind(ServerSocket.java:286)
[java] at com.sun.jini.qa.harness.MasterHarness$KeepAlivePort.run(MasterHarness.java:257)
[java] at java.lang.Thread.run(Thread.java:662)
[java] Java Result: 1
collect-result:
BUILD FAILED
/zonestorage/hudson_solaris/home/hudson/hudson-slave/workspace/river-qa-refactoring-solaris/trunk/build.xml:2093: The following error occurred while executing this line:
/zonestorage/hudson_solaris/home/hudson/hudson-slave/workspace/river-qa-refactoring-solaris/trunk/qa/build.xml:406: The following error occurred while executing this line:
/zonestorage/hudson_solaris/home/hudson/hudson-slave/workspace/river-qa-refactoring-solaris/trunk/qa/build.xml:380: condition satisfied
Total time: 8 minutes 21 seconds
Build step 'Invoke Ant' marked build as failure
Archiving artifacts
Build failed in Jenkins: river-qa-refactoring-solaris #38
Posted by Apache Jenkins Server <je...@builds.apache.org>.
See <https://builds.apache.org/job/river-qa-refactoring-solaris/38/changes>
Changes:
[peter_firmstone] Reduce logging output, builds appear to be filling up disk space on hudson
[peter_firmstone] Fix for failing test:
com/sun/jini/test/spec/discoveryservice/event/MulticastMonitorStop.td
Test Passed: OK
Enabled assertions.
[peter_firmstone] Fix UriString normalisation, related to test failure of com/sun/jini/test/impl/start/CodebaseTest.td on OSX.
Refactor Distributed, renamed SerialFactory to SerialReflectionFactory to more accurately describe function.
Improved performance of SerialReflectionFactory, by serialising primitive Object parameters as primitives instead of objects.
[peter_firmstone] Fix UriString normalisation, related to test failure of com/sun/jini/test/impl/start/CodebaseTest.td on OSX.
[peter_firmstone] Distributed serialization updates
[peter_firmstone] Unit test updates
[peter_firmstone] RIVER-416
Added fail safe mechanism in case of future Level serial form breakage based on suggestion made by Robert Gibson that only uses public API.
[peter_firmstone] Clean and simple replacement for Serializable - Distributed objects.
[peter_firmstone] Clean and simple replacement for Serializable - Distributed objects.
[peter_firmstone] Distributed object serialization test.
[peter_firmstone] Fix OOM error.
[peter_firmstone] Fix OOM error.
[peter_firmstone] Fix OOM error.
[peter_firmstone] Ensure action fields are populated before publishing Permission objects.
[peter_firmstone] Refactoring: delete commented out code, rename field
[peter_firmstone] Modifications to ensure safe publication of Permission after parsing.
[peter_firmstone] Ensure AggregatePolicyProvider blocks during modification.
------------------------------------------
[...truncated 9391 lines...]
[java] Test Passed: OK
[java]
[java] -----------------------------------------
[java] com/sun/jini/test/spec/javaspace/conformance/snapshot/SnapshotTransactionTakeIfExistsTest.td
[java] Test Passed: OK
[java]
[java] -----------------------------------------
[java] com/sun/jini/test/spec/javaspace/conformance/snapshot/SnapshotTransactionTakeIfExistsWaitTest.td
[java] Test Passed: OK
[java]
[java] -----------------------------------------
[java] com/sun/jini/test/spec/javaspace/conformance/snapshot/SnapshotTransactionTakeNO_WAITTest.td
[java] Test Passed: OK
[java]
[java] -----------------------------------------
[java] com/sun/jini/test/spec/javaspace/conformance/snapshot/SnapshotTransactionTakeReadTest.td
[java] Test Passed: OK
[java]
[java] -----------------------------------------
[java] com/sun/jini/test/spec/javaspace/conformance/snapshot/SnapshotTransactionTakeTest.td
[java] Test Passed: OK
[java]
[java] -----------------------------------------
[java] com/sun/jini/test/spec/javaspace/conformance/snapshot/SnapshotTransactionTakeWaitTest.td
[java] Test Passed: OK
[java]
[java] -----------------------------------------
[java] com/sun/jini/test/spec/javaspace/conformance/snapshot/SnapshotTransactionWriteLeaseANYTest.td
[java] Test Passed: OK
[java]
[java] -----------------------------------------
[java] com/sun/jini/test/spec/javaspace/conformance/snapshot/SnapshotTransactionWriteLeaseFOREVERTest.td
[java] Test Passed: OK
[java]
[java] -----------------------------------------
[java] com/sun/jini/test/spec/javaspace/conformance/snapshot/SnapshotTransactionWriteNegativeLeaseTest.td
[java] Test Passed: OK
[java]
[java] -----------------------------------------
[java] com/sun/jini/test/spec/javaspace/conformance/snapshot/SnapshotTransactionWriteTakeIfExistsNotifyTest.td
[java] Test Passed: OK
[java]
[java] -----------------------------------------
[java] com/sun/jini/test/spec/javaspace/conformance/snapshot/SnapshotTransactionWriteTakeIfExistsTest.td
[java] Test Passed: OK
[java]
[java] -----------------------------------------
[java] com/sun/jini/test/spec/javaspace/conformance/snapshot/SnapshotTransactionWriteTakeNotifyTest.td
[java] Test Passed: OK
[java]
[java] -----------------------------------------
[java] com/sun/jini/test/spec/javaspace/conformance/snapshot/SnapshotTransactionWriteTakeTest.td
[java] Test Passed: OK
[java]
[java] -----------------------------------------
[java] com/sun/jini/test/spec/javaspace/conformance/snapshot/SnapshotTransactionWriteTest.td
[java] Test Passed: OK
[java]
[java] -----------------------------------------
[java] com/sun/jini/test/spec/javaspace/conformance/snapshot/SnapshotWriteLeaseANYTest.td
[java] Test Passed: OK
[java]
[java] -----------------------------------------
[java] com/sun/jini/test/spec/javaspace/conformance/snapshot/SnapshotWriteLeaseFOREVERTest.td
[java] Test Passed: OK
[java]
[java] -----------------------------------------
[java] com/sun/jini/test/spec/javaspace/conformance/snapshot/SnapshotWriteNegativeLeaseTest.td
[java] Test Passed: OK
[java]
[java] -----------------------------------------
[java] com/sun/jini/test/spec/javaspace/conformance/snapshot/SnapshotWriteTest.td
[java] Test Passed: OK
[java]
[java] -----------------------------------------
[java] com/sun/jini/test/impl/mahalo/AdminIFShutdownTest.td
[java] Test Passed: OK
[java]
[java] -----------------------------------------
[java] com/sun/jini/test/impl/mahalo/AdminIFTest.td
[java] Test Passed: OK
[java]
[java] -----------------------------------------
[java] com/sun/jini/test/impl/mahalo/LeaseExpireCancelTest.td
[java] Test Passed: OK
[java]
[java] -----------------------------------------
[java] com/sun/jini/test/impl/mahalo/LeaseExpireRenewTest.td
[java] Test Passed: OK
[java]
[java] -----------------------------------------
[java] com/sun/jini/test/impl/mahalo/LeaseMapTest.td
[java] Test Passed: OK
[java]
[java] -----------------------------------------
[java] com/sun/jini/test/impl/mahalo/LeaseTest.td
[java] Test Passed: OK
[java]
[java] -----------------------------------------
[java] com/sun/jini/test/impl/mahalo/MahaloCreateShutdownTest.td
[java] Test Passed: OK
[java]
[java] -----------------------------------------
[java] com/sun/jini/test/impl/mahalo/MahaloIFTest.td
[java] Test Passed: OK
[java]
[java] -----------------------------------------
[java] com/sun/jini/test/impl/mahalo/MahaloImplReadyStateTest.td
[java] Test Skipped: verifiers are: com.sun.jini.test.impl.mercury.ActivatableMercuryVerifier com.sun.jini.qa.harness.SkipConfigTestVerifier
[java] -----------------------------------------
[java] com/sun/jini/test/impl/mahalo/NestableServerTransactionCreatedToStringTest.td
[java] Test Passed: OK
[java]
[java] -----------------------------------------
[java] com/sun/jini/test/impl/mahalo/NestableTransactionCreatedToStringTest.td
[java] Test Passed: OK
[java]
[java] -----------------------------------------
[java] com/sun/jini/test/impl/mahalo/PrepareAndCommitExceptionTest.td
[java] Test Passed: OK
[java]
[java] -----------------------------------------
[java] com/sun/jini/test/impl/mahalo/PrepareAndCommitExceptionTest2.td
[java] Test Passed: OK
[java]
[java] -----------------------------------------
[java] com/sun/jini/test/impl/mahalo/PrepareAndCommitExceptionTest3.td
[java] Test Passed: OK
[java]
[java] -----------------------------------------
[java] com/sun/jini/test/impl/mahalo/PrepareAndCommitExceptionTest4.td
[java] Test Passed: OK
[java]
[java] -----------------------------------------
[java] com/sun/jini/test/impl/mahalo/PrepareAndCommitExceptionTest5.td
[java] Test Passed: OK
[java]
[java] -----------------------------------------
[java] com/sun/jini/test/impl/mahalo/RandomStressTest.td
[java] Test Passed: OK
[java]
[java] -----------------------------------------
[java] com/sun/jini/test/impl/mahalo/ServerTransactionEqualityTest.td
[java] Test Passed: OK
[java]
[java] -----------------------------------------
[java] com/sun/jini/test/impl/mahalo/ServerTransactionToStringTest.td
[java] Test Passed: OK
[java]
[java] -----------------------------------------
[java] com/sun/jini/test/impl/mahalo/TransactionCreatedToStringTest.td
[java] Test Passed: OK
[java]
[java] -----------------------------------------
[java] com/sun/jini/test/impl/mahalo/TransactionManagerCreatedToStringTest.td
[java] Test Passed: OK
[java]
[java] -----------------------------------------
[java] com/sun/jini/test/impl/mahalo/TxnMgrImplNullActivationConfigEntries.td
[java] Test Skipped: verifiers are: com.sun.jini.test.impl.mahalo.ActivatableMahaloVerifier
[java] -----------------------------------------
[java] com/sun/jini/test/impl/mahalo/TxnMgrImplNullConfigEntries.td
[java] Test Passed: OK
[java]
[java] -----------------------------------------
[java] com/sun/jini/test/impl/mahalo/TxnMgrImplNullRecoveredLocators.td
[java] Test Skipped: verifiers are: com.sun.jini.test.impl.mahalo.ActivatableMahaloVerifier
[java] -----------------------------------------
[java] com/sun/jini/test/impl/mahalo/TxnMgrProxyEqualityTest.td
[java] Test Passed: OK
[java]
[java] -----------------------------------------
[java] com/sun/jini/test/spec/txnmanager/AsynchAbortOnCommitTest.td
[java] Test Passed: OK
[java]
[java] -----------------------------------------
[java] com/sun/jini/test/spec/txnmanager/AsynchAbortOnPrepareTest.td
[java] Test Passed: OK
[java]
[java] -----------------------------------------
[java] com/sun/jini/test/spec/txnmanager/CommitExpiredTest.td
[java] Test Passed: OK
[java]
[java] -----------------------------------------
[java] com/sun/jini/test/spec/txnmanager/CommitTimeoutTest.td
[java] Test Passed: OK
[java]
[java] -----------------------------------------
[java] com/sun/jini/test/spec/txnmanager/GetStateTest.td
[java] Test Passed: OK
[java]
[java] -----------------------------------------
[java] com/sun/jini/test/spec/txnmanager/JoinIdempotentTest.td
[java] Test Passed: OK
[java]
[java] -----------------------------------------
[java] com/sun/jini/test/spec/txnmanager/JoinWhileActiveTest.td
[java] Test Passed: OK
[java]
[java] -----------------------------------------
[java] com/sun/jini/test/spec/txnmanager/ManyParticipantsTest.td
[java] Test Passed: OK
[java]
[java] -----------------------------------------
[java] com/sun/jini/test/spec/txnmanager/PrepareTimeoutTest.td
[java] Test Passed: OK
[java]
[java] -----------------------------------------
[java] com/sun/jini/test/spec/txnmanager/RollBackErrorTest.td
[java] Test Passed: OK
[java]
[java] -----------------------------------------
[java] com/sun/jini/test/spec/txnmanager/RollForwardErrorTest.td
[java] Test Passed: OK
[java]
[java] -----------------------------------------
[java] com/sun/jini/test/spec/txnmanager/TwoPhaseTest.td
[java] Test Passed: OK
[java]
[java] -----------------------------------------
[java]
[java] # of tests started = 1412
[java] # of tests completed = 1412
[java] # of tests skipped = 46
[java] # of tests passed = 1131
[java] # of tests failed = 281
[java]
[java] -----------------------------------------
[java]
[java] Date finished:
[java] Wed Mar 06 00:10:10 GMT+00:00 2013
[java] Time elapsed:
[java] 47996 seconds
[java]
[java] Java Result: 1
collect-result:
[copy] Copying 1 file to /zonestorage/hudson_solaris/home/hudson/hudson-slave/workspace/river-qa-refactoring-solaris/trunk/qa/result
[copy] Copying 1 file to /zonestorage/hudson_solaris/home/hudson/hudson-slave/workspace/river-qa-refactoring-solaris/trunk/qa/result
[zip] Building zip: /zonestorage/hudson_solaris/home/hudson/hudson-slave/workspace/river-qa-refactoring-solaris/trunk/qa/result/qaresults-x86-SunOS-1.6.0_26.zip
BUILD FAILED
/zonestorage/hudson_solaris/home/hudson/hudson-slave/workspace/river-qa-refactoring-solaris/trunk/build.xml:2093: The following error occurred while executing this line:
/zonestorage/hudson_solaris/home/hudson/hudson-slave/workspace/river-qa-refactoring-solaris/trunk/qa/build.xml:406: The following error occurred while executing this line:
/zonestorage/hudson_solaris/home/hudson/hudson-slave/workspace/river-qa-refactoring-solaris/trunk/qa/build.xml:380: condition satisfied
Total time: 807 minutes 49 seconds
Build step 'Invoke Ant' marked build as failure
Archiving artifacts
Build failed in Jenkins: river-qa-refactoring-solaris #41
Posted by Apache Jenkins Server <je...@builds.apache.org>.
See <https://builds.apache.org/job/river-qa-refactoring-solaris/41/changes>
Changes:
[peter_firmstone] Ran FindBugs, fixed numerous minor visibility race condition bugs, along with some other identified bugs.
[peter_firmstone] Fixed SnapshotExpirationNotifyTest - test was sleeping, waking up at the same time the DGC lease expired, DGC's much faster than it used to be. Gave the test a 10ms timeout wakeup head start, stopped failures.
Ran FindBugs on QA suite, fixed numerous concurrency / visibility issues.
------------------------------------------
[...truncated 9465 lines...]
[java] Test Passed: OK
[java]
[java] -----------------------------------------
[java] com/sun/jini/test/spec/javaspace/conformance/snapshot/SnapshotTransactionTakeIfExistsTest.td
[java] Test Passed: OK
[java]
[java] -----------------------------------------
[java] com/sun/jini/test/spec/javaspace/conformance/snapshot/SnapshotTransactionTakeIfExistsWaitTest.td
[java] Test Passed: OK
[java]
[java] -----------------------------------------
[java] com/sun/jini/test/spec/javaspace/conformance/snapshot/SnapshotTransactionTakeNO_WAITTest.td
[java] Test Passed: OK
[java]
[java] -----------------------------------------
[java] com/sun/jini/test/spec/javaspace/conformance/snapshot/SnapshotTransactionTakeReadTest.td
[java] Test Passed: OK
[java]
[java] -----------------------------------------
[java] com/sun/jini/test/spec/javaspace/conformance/snapshot/SnapshotTransactionTakeTest.td
[java] Test Passed: OK
[java]
[java] -----------------------------------------
[java] com/sun/jini/test/spec/javaspace/conformance/snapshot/SnapshotTransactionTakeWaitTest.td
[java] Test Passed: OK
[java]
[java] -----------------------------------------
[java] com/sun/jini/test/spec/javaspace/conformance/snapshot/SnapshotTransactionWriteLeaseANYTest.td
[java] Test Passed: OK
[java]
[java] -----------------------------------------
[java] com/sun/jini/test/spec/javaspace/conformance/snapshot/SnapshotTransactionWriteLeaseFOREVERTest.td
[java] Test Passed: OK
[java]
[java] -----------------------------------------
[java] com/sun/jini/test/spec/javaspace/conformance/snapshot/SnapshotTransactionWriteNegativeLeaseTest.td
[java] Test Passed: OK
[java]
[java] -----------------------------------------
[java] com/sun/jini/test/spec/javaspace/conformance/snapshot/SnapshotTransactionWriteTakeIfExistsNotifyTest.td
[java] Test Passed: OK
[java]
[java] -----------------------------------------
[java] com/sun/jini/test/spec/javaspace/conformance/snapshot/SnapshotTransactionWriteTakeIfExistsTest.td
[java] Test Passed: OK
[java]
[java] -----------------------------------------
[java] com/sun/jini/test/spec/javaspace/conformance/snapshot/SnapshotTransactionWriteTakeNotifyTest.td
[java] Test Passed: OK
[java]
[java] -----------------------------------------
[java] com/sun/jini/test/spec/javaspace/conformance/snapshot/SnapshotTransactionWriteTakeTest.td
[java] Test Passed: OK
[java]
[java] -----------------------------------------
[java] com/sun/jini/test/spec/javaspace/conformance/snapshot/SnapshotTransactionWriteTest.td
[java] Test Passed: OK
[java]
[java] -----------------------------------------
[java] com/sun/jini/test/spec/javaspace/conformance/snapshot/SnapshotWriteLeaseANYTest.td
[java] Test Passed: OK
[java]
[java] -----------------------------------------
[java] com/sun/jini/test/spec/javaspace/conformance/snapshot/SnapshotWriteLeaseFOREVERTest.td
[java] Test Passed: OK
[java]
[java] -----------------------------------------
[java] com/sun/jini/test/spec/javaspace/conformance/snapshot/SnapshotWriteNegativeLeaseTest.td
[java] Test Passed: OK
[java]
[java] -----------------------------------------
[java] com/sun/jini/test/spec/javaspace/conformance/snapshot/SnapshotWriteTest.td
[java] Test Passed: OK
[java]
[java] -----------------------------------------
[java] com/sun/jini/test/impl/mahalo/AdminIFShutdownTest.td
[java] Test Passed: OK
[java]
[java] -----------------------------------------
[java] com/sun/jini/test/impl/mahalo/AdminIFTest.td
[java] Test Passed: OK
[java]
[java] -----------------------------------------
[java] com/sun/jini/test/impl/mahalo/LeaseExpireCancelTest.td
[java] Test Passed: OK
[java]
[java] -----------------------------------------
[java] com/sun/jini/test/impl/mahalo/LeaseExpireRenewTest.td
[java] Test Passed: OK
[java]
[java] -----------------------------------------
[java] com/sun/jini/test/impl/mahalo/LeaseMapTest.td
[java] Test Passed: OK
[java]
[java] -----------------------------------------
[java] com/sun/jini/test/impl/mahalo/LeaseTest.td
[java] Test Passed: OK
[java]
[java] -----------------------------------------
[java] com/sun/jini/test/impl/mahalo/MahaloCreateShutdownTest.td
[java] Test Passed: OK
[java]
[java] -----------------------------------------
[java] com/sun/jini/test/impl/mahalo/MahaloIFTest.td
[java] Test Passed: OK
[java]
[java] -----------------------------------------
[java] com/sun/jini/test/impl/mahalo/MahaloImplReadyStateTest.td
[java] Test Skipped: verifiers are: com.sun.jini.test.impl.mercury.ActivatableMercuryVerifier com.sun.jini.qa.harness.SkipConfigTestVerifier
[java] -----------------------------------------
[java] com/sun/jini/test/impl/mahalo/NestableServerTransactionCreatedToStringTest.td
[java] Test Passed: OK
[java]
[java] -----------------------------------------
[java] com/sun/jini/test/impl/mahalo/NestableTransactionCreatedToStringTest.td
[java] Test Passed: OK
[java]
[java] -----------------------------------------
[java] com/sun/jini/test/impl/mahalo/PrepareAndCommitExceptionTest.td
[java] Test Passed: OK
[java]
[java] -----------------------------------------
[java] com/sun/jini/test/impl/mahalo/PrepareAndCommitExceptionTest2.td
[java] Test Passed: OK
[java]
[java] -----------------------------------------
[java] com/sun/jini/test/impl/mahalo/PrepareAndCommitExceptionTest3.td
[java] Test Passed: OK
[java]
[java] -----------------------------------------
[java] com/sun/jini/test/impl/mahalo/PrepareAndCommitExceptionTest4.td
[java] Test Passed: OK
[java]
[java] -----------------------------------------
[java] com/sun/jini/test/impl/mahalo/PrepareAndCommitExceptionTest5.td
[java] Test Passed: OK
[java]
[java] -----------------------------------------
[java] com/sun/jini/test/impl/mahalo/RandomStressTest.td
[java] Test Passed: OK
[java]
[java] -----------------------------------------
[java] com/sun/jini/test/impl/mahalo/ServerTransactionEqualityTest.td
[java] Test Passed: OK
[java]
[java] -----------------------------------------
[java] com/sun/jini/test/impl/mahalo/ServerTransactionToStringTest.td
[java] Test Passed: OK
[java]
[java] -----------------------------------------
[java] com/sun/jini/test/impl/mahalo/TransactionCreatedToStringTest.td
[java] Test Passed: OK
[java]
[java] -----------------------------------------
[java] com/sun/jini/test/impl/mahalo/TransactionManagerCreatedToStringTest.td
[java] Test Passed: OK
[java]
[java] -----------------------------------------
[java] com/sun/jini/test/impl/mahalo/TxnMgrImplNullActivationConfigEntries.td
[java] Test Skipped: verifiers are: com.sun.jini.test.impl.mahalo.ActivatableMahaloVerifier
[java] -----------------------------------------
[java] com/sun/jini/test/impl/mahalo/TxnMgrImplNullConfigEntries.td
[java] Test Passed: OK
[java]
[java] -----------------------------------------
[java] com/sun/jini/test/impl/mahalo/TxnMgrImplNullRecoveredLocators.td
[java] Test Skipped: verifiers are: com.sun.jini.test.impl.mahalo.ActivatableMahaloVerifier
[java] -----------------------------------------
[java] com/sun/jini/test/impl/mahalo/TxnMgrProxyEqualityTest.td
[java] Test Passed: OK
[java]
[java] -----------------------------------------
[java] com/sun/jini/test/spec/txnmanager/AsynchAbortOnCommitTest.td
[java] Test Passed: OK
[java]
[java] -----------------------------------------
[java] com/sun/jini/test/spec/txnmanager/AsynchAbortOnPrepareTest.td
[java] Test Passed: OK
[java]
[java] -----------------------------------------
[java] com/sun/jini/test/spec/txnmanager/CommitExpiredTest.td
[java] Test Passed: OK
[java]
[java] -----------------------------------------
[java] com/sun/jini/test/spec/txnmanager/CommitTimeoutTest.td
[java] Test Passed: OK
[java]
[java] -----------------------------------------
[java] com/sun/jini/test/spec/txnmanager/GetStateTest.td
[java] Test Passed: OK
[java]
[java] -----------------------------------------
[java] com/sun/jini/test/spec/txnmanager/JoinIdempotentTest.td
[java] Test Passed: OK
[java]
[java] -----------------------------------------
[java] com/sun/jini/test/spec/txnmanager/JoinWhileActiveTest.td
[java] Test Passed: OK
[java]
[java] -----------------------------------------
[java] com/sun/jini/test/spec/txnmanager/ManyParticipantsTest.td
[java] Test Passed: OK
[java]
[java] -----------------------------------------
[java] com/sun/jini/test/spec/txnmanager/PrepareTimeoutTest.td
[java] Test Passed: OK
[java]
[java] -----------------------------------------
[java] com/sun/jini/test/spec/txnmanager/RollBackErrorTest.td
[java] Test Passed: OK
[java]
[java] -----------------------------------------
[java] com/sun/jini/test/spec/txnmanager/RollForwardErrorTest.td
[java] Test Passed: OK
[java]
[java] -----------------------------------------
[java] com/sun/jini/test/spec/txnmanager/TwoPhaseTest.td
[java] Test Passed: OK
[java]
[java] -----------------------------------------
[java]
[java] # of tests started = 1412
[java] # of tests completed = 1412
[java] # of tests skipped = 46
[java] # of tests passed = 1098
[java] # of tests failed = 314
[java]
[java] -----------------------------------------
[java]
[java] Date finished:
[java] Fri Mar 08 00:21:35 GMT+00:00 2013
[java] Time elapsed:
[java] 47729 seconds
[java]
[java] Java Result: 1
collect-result:
[copy] Copying 1 file to /zonestorage/hudson_solaris/home/hudson/hudson-slave/workspace/river-qa-refactoring-solaris/trunk/qa/result
[copy] Copying 1 file to /zonestorage/hudson_solaris/home/hudson/hudson-slave/workspace/river-qa-refactoring-solaris/trunk/qa/result
[zip] Building zip: /zonestorage/hudson_solaris/home/hudson/hudson-slave/workspace/river-qa-refactoring-solaris/trunk/qa/result/qaresults-x86-SunOS-1.6.0_26.zip
BUILD FAILED
/zonestorage/hudson_solaris/home/hudson/hudson-slave/workspace/river-qa-refactoring-solaris/trunk/build.xml:2093: The following error occurred while executing this line:
/zonestorage/hudson_solaris/home/hudson/hudson-slave/workspace/river-qa-refactoring-solaris/trunk/qa/build.xml:406: The following error occurred while executing this line:
/zonestorage/hudson_solaris/home/hudson/hudson-slave/workspace/river-qa-refactoring-solaris/trunk/qa/build.xml:380: condition satisfied
Total time: 807 minutes 2 seconds
Build step 'Invoke Ant' marked build as failure
Archiving artifacts
Build failed in Jenkins: river-qa-refactoring-solaris #40
Posted by Apache Jenkins Server <je...@builds.apache.org>.
See <https://builds.apache.org/job/river-qa-refactoring-solaris/40/changes>
Changes:
[peter_firmstone] Refactor: Minor visibility updates, setting variables to volatile and adding synchronisation to collections.
[peter_firmstone] Found synchronization issue in JERI DGC, may be related to
com/sun/jini/test/spec/javaspace/conformance/snapshot/SnapshotExpirationNotifyTest.td
test failure due to events not being received, caused by no object in table.
No guarantee, since I don't have access to hardware where this fails.
[peter_firmstone] Reduce logging output, builds appear to be filling up disk space on hudson
[peter_firmstone] Fix for failing test:
com/sun/jini/test/spec/discoveryservice/event/MulticastMonitorStop.td
Test Passed: OK
Enabled assertions.
[peter_firmstone] Fix UriString normalisation, related to test failure of com/sun/jini/test/impl/start/CodebaseTest.td on OSX.
Refactor Distributed, renamed SerialFactory to SerialReflectionFactory to more accurately describe function.
Improved performance of SerialReflectionFactory, by serialising primitive Object parameters as primitives instead of objects.
[peter_firmstone] Fix UriString normalisation, related to test failure of com/sun/jini/test/impl/start/CodebaseTest.td on OSX.
[peter_firmstone] Distributed serialization updates
[peter_firmstone] Unit test updates
[peter_firmstone] RIVER-416
Added fail safe mechanism in case of future Level serial form breakage based on suggestion made by Robert Gibson that only uses public API.
[peter_firmstone] Clean and simple replacement for Serializable - Distributed objects.
[peter_firmstone] Clean and simple replacement for Serializable - Distributed objects.
[peter_firmstone] Distributed object serialization test.
[peter_firmstone] Fix OOM error.
[peter_firmstone] Fix OOM error.
[peter_firmstone] Fix OOM error.
[peter_firmstone] Ensure action fields are populated before publishing Permission objects.
[peter_firmstone] Refactoring: delete commented out code, rename field
[peter_firmstone] Modifications to ensure safe publication of Permission after parsing.
[peter_firmstone] Ensure AggregatePolicyProvider blocks during modification.
------------------------------------------
[...truncated 9365 lines...]
[java] Test Passed: OK
[java]
[java] -----------------------------------------
[java] com/sun/jini/test/spec/javaspace/conformance/snapshot/SnapshotTransactionTakeIfExistsTest.td
[java] Test Passed: OK
[java]
[java] -----------------------------------------
[java] com/sun/jini/test/spec/javaspace/conformance/snapshot/SnapshotTransactionTakeIfExistsWaitTest.td
[java] Test Passed: OK
[java]
[java] -----------------------------------------
[java] com/sun/jini/test/spec/javaspace/conformance/snapshot/SnapshotTransactionTakeNO_WAITTest.td
[java] Test Passed: OK
[java]
[java] -----------------------------------------
[java] com/sun/jini/test/spec/javaspace/conformance/snapshot/SnapshotTransactionTakeReadTest.td
[java] Test Passed: OK
[java]
[java] -----------------------------------------
[java] com/sun/jini/test/spec/javaspace/conformance/snapshot/SnapshotTransactionTakeTest.td
[java] Test Passed: OK
[java]
[java] -----------------------------------------
[java] com/sun/jini/test/spec/javaspace/conformance/snapshot/SnapshotTransactionTakeWaitTest.td
[java] Test Passed: OK
[java]
[java] -----------------------------------------
[java] com/sun/jini/test/spec/javaspace/conformance/snapshot/SnapshotTransactionWriteLeaseANYTest.td
[java] Test Passed: OK
[java]
[java] -----------------------------------------
[java] com/sun/jini/test/spec/javaspace/conformance/snapshot/SnapshotTransactionWriteLeaseFOREVERTest.td
[java] Test Passed: OK
[java]
[java] -----------------------------------------
[java] com/sun/jini/test/spec/javaspace/conformance/snapshot/SnapshotTransactionWriteNegativeLeaseTest.td
[java] Test Passed: OK
[java]
[java] -----------------------------------------
[java] com/sun/jini/test/spec/javaspace/conformance/snapshot/SnapshotTransactionWriteTakeIfExistsNotifyTest.td
[java] Test Passed: OK
[java]
[java] -----------------------------------------
[java] com/sun/jini/test/spec/javaspace/conformance/snapshot/SnapshotTransactionWriteTakeIfExistsTest.td
[java] Test Passed: OK
[java]
[java] -----------------------------------------
[java] com/sun/jini/test/spec/javaspace/conformance/snapshot/SnapshotTransactionWriteTakeNotifyTest.td
[java] Test Passed: OK
[java]
[java] -----------------------------------------
[java] com/sun/jini/test/spec/javaspace/conformance/snapshot/SnapshotTransactionWriteTakeTest.td
[java] Test Passed: OK
[java]
[java] -----------------------------------------
[java] com/sun/jini/test/spec/javaspace/conformance/snapshot/SnapshotTransactionWriteTest.td
[java] Test Passed: OK
[java]
[java] -----------------------------------------
[java] com/sun/jini/test/spec/javaspace/conformance/snapshot/SnapshotWriteLeaseANYTest.td
[java] Test Passed: OK
[java]
[java] -----------------------------------------
[java] com/sun/jini/test/spec/javaspace/conformance/snapshot/SnapshotWriteLeaseFOREVERTest.td
[java] Test Passed: OK
[java]
[java] -----------------------------------------
[java] com/sun/jini/test/spec/javaspace/conformance/snapshot/SnapshotWriteNegativeLeaseTest.td
[java] Test Passed: OK
[java]
[java] -----------------------------------------
[java] com/sun/jini/test/spec/javaspace/conformance/snapshot/SnapshotWriteTest.td
[java] Test Passed: OK
[java]
[java] -----------------------------------------
[java] com/sun/jini/test/impl/mahalo/AdminIFShutdownTest.td
[java] Test Passed: OK
[java]
[java] -----------------------------------------
[java] com/sun/jini/test/impl/mahalo/AdminIFTest.td
[java] Test Passed: OK
[java]
[java] -----------------------------------------
[java] com/sun/jini/test/impl/mahalo/LeaseExpireCancelTest.td
[java] Test Passed: OK
[java]
[java] -----------------------------------------
[java] com/sun/jini/test/impl/mahalo/LeaseExpireRenewTest.td
[java] Test Passed: OK
[java]
[java] -----------------------------------------
[java] com/sun/jini/test/impl/mahalo/LeaseMapTest.td
[java] Test Passed: OK
[java]
[java] -----------------------------------------
[java] com/sun/jini/test/impl/mahalo/LeaseTest.td
[java] Test Passed: OK
[java]
[java] -----------------------------------------
[java] com/sun/jini/test/impl/mahalo/MahaloCreateShutdownTest.td
[java] Test Passed: OK
[java]
[java] -----------------------------------------
[java] com/sun/jini/test/impl/mahalo/MahaloIFTest.td
[java] Test Passed: OK
[java]
[java] -----------------------------------------
[java] com/sun/jini/test/impl/mahalo/MahaloImplReadyStateTest.td
[java] Test Skipped: verifiers are: com.sun.jini.test.impl.mercury.ActivatableMercuryVerifier com.sun.jini.qa.harness.SkipConfigTestVerifier
[java] -----------------------------------------
[java] com/sun/jini/test/impl/mahalo/NestableServerTransactionCreatedToStringTest.td
[java] Test Passed: OK
[java]
[java] -----------------------------------------
[java] com/sun/jini/test/impl/mahalo/NestableTransactionCreatedToStringTest.td
[java] Test Passed: OK
[java]
[java] -----------------------------------------
[java] com/sun/jini/test/impl/mahalo/PrepareAndCommitExceptionTest.td
[java] Test Passed: OK
[java]
[java] -----------------------------------------
[java] com/sun/jini/test/impl/mahalo/PrepareAndCommitExceptionTest2.td
[java] Test Passed: OK
[java]
[java] -----------------------------------------
[java] com/sun/jini/test/impl/mahalo/PrepareAndCommitExceptionTest3.td
[java] Test Passed: OK
[java]
[java] -----------------------------------------
[java] com/sun/jini/test/impl/mahalo/PrepareAndCommitExceptionTest4.td
[java] Test Passed: OK
[java]
[java] -----------------------------------------
[java] com/sun/jini/test/impl/mahalo/PrepareAndCommitExceptionTest5.td
[java] Test Passed: OK
[java]
[java] -----------------------------------------
[java] com/sun/jini/test/impl/mahalo/RandomStressTest.td
[java] Test Passed: OK
[java]
[java] -----------------------------------------
[java] com/sun/jini/test/impl/mahalo/ServerTransactionEqualityTest.td
[java] Test Passed: OK
[java]
[java] -----------------------------------------
[java] com/sun/jini/test/impl/mahalo/ServerTransactionToStringTest.td
[java] Test Passed: OK
[java]
[java] -----------------------------------------
[java] com/sun/jini/test/impl/mahalo/TransactionCreatedToStringTest.td
[java] Test Passed: OK
[java]
[java] -----------------------------------------
[java] com/sun/jini/test/impl/mahalo/TransactionManagerCreatedToStringTest.td
[java] Test Passed: OK
[java]
[java] -----------------------------------------
[java] com/sun/jini/test/impl/mahalo/TxnMgrImplNullActivationConfigEntries.td
[java] Test Skipped: verifiers are: com.sun.jini.test.impl.mahalo.ActivatableMahaloVerifier
[java] -----------------------------------------
[java] com/sun/jini/test/impl/mahalo/TxnMgrImplNullConfigEntries.td
[java] Test Passed: OK
[java]
[java] -----------------------------------------
[java] com/sun/jini/test/impl/mahalo/TxnMgrImplNullRecoveredLocators.td
[java] Test Skipped: verifiers are: com.sun.jini.test.impl.mahalo.ActivatableMahaloVerifier
[java] -----------------------------------------
[java] com/sun/jini/test/impl/mahalo/TxnMgrProxyEqualityTest.td
[java] Test Passed: OK
[java]
[java] -----------------------------------------
[java] com/sun/jini/test/spec/txnmanager/AsynchAbortOnCommitTest.td
[java] Test Passed: OK
[java]
[java] -----------------------------------------
[java] com/sun/jini/test/spec/txnmanager/AsynchAbortOnPrepareTest.td
[java] Test Passed: OK
[java]
[java] -----------------------------------------
[java] com/sun/jini/test/spec/txnmanager/CommitExpiredTest.td
[java] Test Passed: OK
[java]
[java] -----------------------------------------
[java] com/sun/jini/test/spec/txnmanager/CommitTimeoutTest.td
[java] Test Passed: OK
[java]
[java] -----------------------------------------
[java] com/sun/jini/test/spec/txnmanager/GetStateTest.td
[java] Test Passed: OK
[java]
[java] -----------------------------------------
[java] com/sun/jini/test/spec/txnmanager/JoinIdempotentTest.td
[java] Test Passed: OK
[java]
[java] -----------------------------------------
[java] com/sun/jini/test/spec/txnmanager/JoinWhileActiveTest.td
[java] Test Passed: OK
[java]
[java] -----------------------------------------
[java] com/sun/jini/test/spec/txnmanager/ManyParticipantsTest.td
[java] Test Passed: OK
[java]
[java] -----------------------------------------
[java] com/sun/jini/test/spec/txnmanager/PrepareTimeoutTest.td
[java] Test Passed: OK
[java]
[java] -----------------------------------------
[java] com/sun/jini/test/spec/txnmanager/RollBackErrorTest.td
[java] Test Passed: OK
[java]
[java] -----------------------------------------
[java] com/sun/jini/test/spec/txnmanager/RollForwardErrorTest.td
[java] Test Passed: OK
[java]
[java] -----------------------------------------
[java] com/sun/jini/test/spec/txnmanager/TwoPhaseTest.td
[java] Test Passed: OK
[java]
[java] -----------------------------------------
[java]
[java] # of tests started = 1412
[java] # of tests completed = 1412
[java] # of tests skipped = 46
[java] # of tests passed = 1131
[java] # of tests failed = 281
[java]
[java] -----------------------------------------
[java]
[java] Date finished:
[java] Wed Mar 06 22:29:34 GMT+00:00 2013
[java] Time elapsed:
[java] 48805 seconds
[java]
[java] Java Result: 1
collect-result:
[copy] Copying 1 file to /zonestorage/hudson_solaris/home/hudson/hudson-slave/workspace/river-qa-refactoring-solaris/trunk/qa/result
[copy] Copying 1 file to /zonestorage/hudson_solaris/home/hudson/hudson-slave/workspace/river-qa-refactoring-solaris/trunk/qa/result
[zip] Building zip: /zonestorage/hudson_solaris/home/hudson/hudson-slave/workspace/river-qa-refactoring-solaris/trunk/qa/result/qaresults-x86-SunOS-1.6.0_26.zip
BUILD FAILED
/zonestorage/hudson_solaris/home/hudson/hudson-slave/workspace/river-qa-refactoring-solaris/trunk/build.xml:2093: The following error occurred while executing this line:
/zonestorage/hudson_solaris/home/hudson/hudson-slave/workspace/river-qa-refactoring-solaris/trunk/qa/build.xml:406: The following error occurred while executing this line:
/zonestorage/hudson_solaris/home/hudson/hudson-slave/workspace/river-qa-refactoring-solaris/trunk/qa/build.xml:380: condition satisfied
Total time: 821 minutes 5 seconds
Build step 'Invoke Ant' marked build as failure
Archiving artifacts
Build failed in Jenkins: river-qa-refactoring-solaris #37
Posted by Apache Jenkins Server <je...@builds.apache.org>.
See <https://builds.apache.org/job/river-qa-refactoring-solaris/37/changes>
Changes:
[peter_firmstone] Fix UriString normalisation, related to test failure of com/sun/jini/test/impl/start/CodebaseTest.td on OSX.
Refactor Distributed, renamed SerialFactory to SerialReflectionFactory to more accurately describe function.
Improved performance of SerialReflectionFactory, by serialising primitive Object parameters as primitives instead of objects.
[peter_firmstone] Fix UriString normalisation, related to test failure of com/sun/jini/test/impl/start/CodebaseTest.td on OSX.
------------------------------------------
[...truncated 9373 lines...]
[java] Test Passed: OK
[java]
[java] -----------------------------------------
[java] com/sun/jini/test/spec/javaspace/conformance/snapshot/SnapshotTransactionTakeIfExistsTest.td
[java] Test Passed: OK
[java]
[java] -----------------------------------------
[java] com/sun/jini/test/spec/javaspace/conformance/snapshot/SnapshotTransactionTakeIfExistsWaitTest.td
[java] Test Passed: OK
[java]
[java] -----------------------------------------
[java] com/sun/jini/test/spec/javaspace/conformance/snapshot/SnapshotTransactionTakeNO_WAITTest.td
[java] Test Passed: OK
[java]
[java] -----------------------------------------
[java] com/sun/jini/test/spec/javaspace/conformance/snapshot/SnapshotTransactionTakeReadTest.td
[java] Test Passed: OK
[java]
[java] -----------------------------------------
[java] com/sun/jini/test/spec/javaspace/conformance/snapshot/SnapshotTransactionTakeTest.td
[java] Test Passed: OK
[java]
[java] -----------------------------------------
[java] com/sun/jini/test/spec/javaspace/conformance/snapshot/SnapshotTransactionTakeWaitTest.td
[java] Test Passed: OK
[java]
[java] -----------------------------------------
[java] com/sun/jini/test/spec/javaspace/conformance/snapshot/SnapshotTransactionWriteLeaseANYTest.td
[java] Test Passed: OK
[java]
[java] -----------------------------------------
[java] com/sun/jini/test/spec/javaspace/conformance/snapshot/SnapshotTransactionWriteLeaseFOREVERTest.td
[java] Test Passed: OK
[java]
[java] -----------------------------------------
[java] com/sun/jini/test/spec/javaspace/conformance/snapshot/SnapshotTransactionWriteNegativeLeaseTest.td
[java] Test Passed: OK
[java]
[java] -----------------------------------------
[java] com/sun/jini/test/spec/javaspace/conformance/snapshot/SnapshotTransactionWriteTakeIfExistsNotifyTest.td
[java] Test Passed: OK
[java]
[java] -----------------------------------------
[java] com/sun/jini/test/spec/javaspace/conformance/snapshot/SnapshotTransactionWriteTakeIfExistsTest.td
[java] Test Passed: OK
[java]
[java] -----------------------------------------
[java] com/sun/jini/test/spec/javaspace/conformance/snapshot/SnapshotTransactionWriteTakeNotifyTest.td
[java] Test Passed: OK
[java]
[java] -----------------------------------------
[java] com/sun/jini/test/spec/javaspace/conformance/snapshot/SnapshotTransactionWriteTakeTest.td
[java] Test Passed: OK
[java]
[java] -----------------------------------------
[java] com/sun/jini/test/spec/javaspace/conformance/snapshot/SnapshotTransactionWriteTest.td
[java] Test Passed: OK
[java]
[java] -----------------------------------------
[java] com/sun/jini/test/spec/javaspace/conformance/snapshot/SnapshotWriteLeaseANYTest.td
[java] Test Passed: OK
[java]
[java] -----------------------------------------
[java] com/sun/jini/test/spec/javaspace/conformance/snapshot/SnapshotWriteLeaseFOREVERTest.td
[java] Test Passed: OK
[java]
[java] -----------------------------------------
[java] com/sun/jini/test/spec/javaspace/conformance/snapshot/SnapshotWriteNegativeLeaseTest.td
[java] Test Passed: OK
[java]
[java] -----------------------------------------
[java] com/sun/jini/test/spec/javaspace/conformance/snapshot/SnapshotWriteTest.td
[java] Test Passed: OK
[java]
[java] -----------------------------------------
[java] com/sun/jini/test/impl/mahalo/AdminIFShutdownTest.td
[java] Test Passed: OK
[java]
[java] -----------------------------------------
[java] com/sun/jini/test/impl/mahalo/AdminIFTest.td
[java] Test Passed: OK
[java]
[java] -----------------------------------------
[java] com/sun/jini/test/impl/mahalo/LeaseExpireCancelTest.td
[java] Test Passed: OK
[java]
[java] -----------------------------------------
[java] com/sun/jini/test/impl/mahalo/LeaseExpireRenewTest.td
[java] Test Passed: OK
[java]
[java] -----------------------------------------
[java] com/sun/jini/test/impl/mahalo/LeaseMapTest.td
[java] Test Passed: OK
[java]
[java] -----------------------------------------
[java] com/sun/jini/test/impl/mahalo/LeaseTest.td
[java] Test Passed: OK
[java]
[java] -----------------------------------------
[java] com/sun/jini/test/impl/mahalo/MahaloCreateShutdownTest.td
[java] Test Passed: OK
[java]
[java] -----------------------------------------
[java] com/sun/jini/test/impl/mahalo/MahaloIFTest.td
[java] Test Passed: OK
[java]
[java] -----------------------------------------
[java] com/sun/jini/test/impl/mahalo/MahaloImplReadyStateTest.td
[java] Test Skipped: verifiers are: com.sun.jini.test.impl.mercury.ActivatableMercuryVerifier com.sun.jini.qa.harness.SkipConfigTestVerifier
[java] -----------------------------------------
[java] com/sun/jini/test/impl/mahalo/NestableServerTransactionCreatedToStringTest.td
[java] Test Passed: OK
[java]
[java] -----------------------------------------
[java] com/sun/jini/test/impl/mahalo/NestableTransactionCreatedToStringTest.td
[java] Test Passed: OK
[java]
[java] -----------------------------------------
[java] com/sun/jini/test/impl/mahalo/PrepareAndCommitExceptionTest.td
[java] Test Passed: OK
[java]
[java] -----------------------------------------
[java] com/sun/jini/test/impl/mahalo/PrepareAndCommitExceptionTest2.td
[java] Test Passed: OK
[java]
[java] -----------------------------------------
[java] com/sun/jini/test/impl/mahalo/PrepareAndCommitExceptionTest3.td
[java] Test Passed: OK
[java]
[java] -----------------------------------------
[java] com/sun/jini/test/impl/mahalo/PrepareAndCommitExceptionTest4.td
[java] Test Passed: OK
[java]
[java] -----------------------------------------
[java] com/sun/jini/test/impl/mahalo/PrepareAndCommitExceptionTest5.td
[java] Test Passed: OK
[java]
[java] -----------------------------------------
[java] com/sun/jini/test/impl/mahalo/RandomStressTest.td
[java] Test Passed: OK
[java]
[java] -----------------------------------------
[java] com/sun/jini/test/impl/mahalo/ServerTransactionEqualityTest.td
[java] Test Passed: OK
[java]
[java] -----------------------------------------
[java] com/sun/jini/test/impl/mahalo/ServerTransactionToStringTest.td
[java] Test Passed: OK
[java]
[java] -----------------------------------------
[java] com/sun/jini/test/impl/mahalo/TransactionCreatedToStringTest.td
[java] Test Passed: OK
[java]
[java] -----------------------------------------
[java] com/sun/jini/test/impl/mahalo/TransactionManagerCreatedToStringTest.td
[java] Test Passed: OK
[java]
[java] -----------------------------------------
[java] com/sun/jini/test/impl/mahalo/TxnMgrImplNullActivationConfigEntries.td
[java] Test Skipped: verifiers are: com.sun.jini.test.impl.mahalo.ActivatableMahaloVerifier
[java] -----------------------------------------
[java] com/sun/jini/test/impl/mahalo/TxnMgrImplNullConfigEntries.td
[java] Test Passed: OK
[java]
[java] -----------------------------------------
[java] com/sun/jini/test/impl/mahalo/TxnMgrImplNullRecoveredLocators.td
[java] Test Skipped: verifiers are: com.sun.jini.test.impl.mahalo.ActivatableMahaloVerifier
[java] -----------------------------------------
[java] com/sun/jini/test/impl/mahalo/TxnMgrProxyEqualityTest.td
[java] Test Passed: OK
[java]
[java] -----------------------------------------
[java] com/sun/jini/test/spec/txnmanager/AsynchAbortOnCommitTest.td
[java] Test Passed: OK
[java]
[java] -----------------------------------------
[java] com/sun/jini/test/spec/txnmanager/AsynchAbortOnPrepareTest.td
[java] Test Passed: OK
[java]
[java] -----------------------------------------
[java] com/sun/jini/test/spec/txnmanager/CommitExpiredTest.td
[java] Test Passed: OK
[java]
[java] -----------------------------------------
[java] com/sun/jini/test/spec/txnmanager/CommitTimeoutTest.td
[java] Test Passed: OK
[java]
[java] -----------------------------------------
[java] com/sun/jini/test/spec/txnmanager/GetStateTest.td
[java] Test Passed: OK
[java]
[java] -----------------------------------------
[java] com/sun/jini/test/spec/txnmanager/JoinIdempotentTest.td
[java] Test Passed: OK
[java]
[java] -----------------------------------------
[java] com/sun/jini/test/spec/txnmanager/JoinWhileActiveTest.td
[java] Test Passed: OK
[java]
[java] -----------------------------------------
[java] com/sun/jini/test/spec/txnmanager/ManyParticipantsTest.td
[java] Test Passed: OK
[java]
[java] -----------------------------------------
[java] com/sun/jini/test/spec/txnmanager/PrepareTimeoutTest.td
[java] Test Passed: OK
[java]
[java] -----------------------------------------
[java] com/sun/jini/test/spec/txnmanager/RollBackErrorTest.td
[java] Test Passed: OK
[java]
[java] -----------------------------------------
[java] com/sun/jini/test/spec/txnmanager/RollForwardErrorTest.td
[java] Test Passed: OK
[java]
[java] -----------------------------------------
[java] com/sun/jini/test/spec/txnmanager/TwoPhaseTest.td
[java] Test Passed: OK
[java]
[java] -----------------------------------------
[java]
[java] # of tests started = 1412
[java] # of tests completed = 1412
[java] # of tests skipped = 46
[java] # of tests passed = 1130
[java] # of tests failed = 282
[java]
[java] -----------------------------------------
[java]
[java] Date finished:
[java] Sun Mar 03 18:36:12 GMT+00:00 2013
[java] Time elapsed:
[java] 54414 seconds
[java]
[java] Java Result: 1
collect-result:
[copy] Copying 1 file to /zonestorage/hudson_solaris/home/hudson/hudson-slave/workspace/river-qa-refactoring-solaris/trunk/qa/result
[copy] Copying 1 file to /zonestorage/hudson_solaris/home/hudson/hudson-slave/workspace/river-qa-refactoring-solaris/trunk/qa/result
[zip] Building zip: /zonestorage/hudson_solaris/home/hudson/hudson-slave/workspace/river-qa-refactoring-solaris/trunk/qa/result/qaresults-x86-SunOS-1.6.0_26.zip
BUILD FAILED
/zonestorage/hudson_solaris/home/hudson/hudson-slave/workspace/river-qa-refactoring-solaris/trunk/build.xml:2093: The following error occurred while executing this line:
/zonestorage/hudson_solaris/home/hudson/hudson-slave/workspace/river-qa-refactoring-solaris/trunk/qa/build.xml:406: The following error occurred while executing this line:
/zonestorage/hudson_solaris/home/hudson/hudson-slave/workspace/river-qa-refactoring-solaris/trunk/qa/build.xml:380: condition satisfied
Total time: 923 minutes 44 seconds
Build step 'Invoke Ant' marked build as failure
Archiving artifacts
Build failed in Jenkins: river-qa-refactoring-solaris #36
Posted by Apache Jenkins Server <je...@builds.apache.org>.
See <https://builds.apache.org/job/river-qa-refactoring-solaris/36/changes>
Changes:
[peter_firmstone] Distributed serialization updates
[peter_firmstone] Unit test updates
------------------------------------------
[...truncated 1187 lines...]
[exec] Certificate stored in file </zonestorage/hudson_solaris/home/hudson/hudson-slave/workspace/river-qa-refactoring-solaris/trunk/qa/harness/trust/group.cert>
are-passwords-available:
password:
[echo] creating passwords
truststore:
[exec] Certificate was added to keystore
[exec] Certificate was added to keystore
[exec] Certificate was added to keystore
[exec] Certificate was added to keystore
[exec] Certificate was added to keystore
[exec] Certificate was added to keystore
[exec] Certificate was added to keystore
[exec] Certificate was added to keystore
[exec] Certificate was added to keystore
trust:
qaman.jar:
[jar] Building jar: /zonestorage/hudson_solaris/home/hudson/hudson-slave/workspace/river-qa-refactoring-solaris/trunk/qa/lib/qaman.jar
mergedpolicyprovider.jar:
[jar] Building jar: /zonestorage/hudson_solaris/home/hudson/hudson-slave/workspace/river-qa-refactoring-solaris/trunk/qa/lib-ext/mergedpolicyprovider.jar
nonactivatablegroup.jar:
[jar] Building jar: /zonestorage/hudson_solaris/home/hudson/hudson-slave/workspace/river-qa-refactoring-solaris/trunk/qa/lib/nonactivatablegroup.jar
nonactivatablegroup-dl.jar:
[jar] Building jar: /zonestorage/hudson_solaris/home/hudson/hudson-slave/workspace/river-qa-refactoring-solaris/trunk/qa/lib/nonactivatablegroup-dl.jar
harness-killer.jar:
[jar] Building jar: /zonestorage/hudson_solaris/home/hudson/hudson-slave/workspace/river-qa-refactoring-solaris/trunk/qa/lib/harness-killer.jar
harness-killer-dl.jar:
[jar] Building jar: /zonestorage/hudson_solaris/home/hudson/hudson-slave/workspace/river-qa-refactoring-solaris/trunk/qa/lib/harness-killer-dl.jar
jiniharness.jar:
[jar] Building jar: /zonestorage/hudson_solaris/home/hudson/hudson-slave/workspace/river-qa-refactoring-solaris/trunk/qa/lib/jiniharness.jar
harness-jars:
qa1-end2end.jar:
[jar] Building jar: /zonestorage/hudson_solaris/home/hudson/hudson-slave/workspace/river-qa-refactoring-solaris/trunk/qa/lib/qa1-end2end.jar
qa1-fiddler-dl.jar:
[jar] Building jar: /zonestorage/hudson_solaris/home/hudson/hudson-slave/workspace/river-qa-refactoring-solaris/trunk/qa/lib/qa1-fiddler-dl.jar
qa1-joinmanager-dl.jar:
[jar] Building jar: /zonestorage/hudson_solaris/home/hudson/hudson-slave/workspace/river-qa-refactoring-solaris/trunk/qa/lib/qa1-joinmanager-dl.jar
qa1-mahalo-dl.jar:
[jar] Building jar: /zonestorage/hudson_solaris/home/hudson/hudson-slave/workspace/river-qa-refactoring-solaris/trunk/qa/lib/qa1-mahalo-dl.jar
qa1-mercury.jar:
[jar] Building jar: /zonestorage/hudson_solaris/home/hudson/hudson-slave/workspace/river-qa-refactoring-solaris/trunk/qa/lib/qa1-mercury.jar
[jar] Updating jar: /zonestorage/hudson_solaris/home/hudson/hudson-slave/workspace/river-qa-refactoring-solaris/trunk/qa/lib/qa1-mercury.jar
qa1-mercury-dl.jar:
[jar] Building jar: /zonestorage/hudson_solaris/home/hudson/hudson-slave/workspace/river-qa-refactoring-solaris/trunk/qa/lib/qa1-mercury-dl.jar
[jar] Updating jar: /zonestorage/hudson_solaris/home/hudson/hudson-slave/workspace/river-qa-refactoring-solaris/trunk/qa/lib/qa1-mercury-dl.jar
qa1-mercury-bogusimpl.jar:
[jar] Building jar: /zonestorage/hudson_solaris/home/hudson/hudson-slave/workspace/river-qa-refactoring-solaris/trunk/qa/lib/qa1-mercury-bogusimpl.jar
qa1-wrapper.jar:
[jar] Building jar: /zonestorage/hudson_solaris/home/hudson/hudson-slave/workspace/river-qa-refactoring-solaris/trunk/qa/lib/qa1-wrapper.jar
qa1-norm-dl.jar:
[jar] Building jar: /zonestorage/hudson_solaris/home/hudson/hudson-slave/workspace/river-qa-refactoring-solaris/trunk/qa/lib/qa1-norm-dl.jar
qa1-outrigger-dl.jar:
[jar] Building jar: /zonestorage/hudson_solaris/home/hudson/hudson-slave/workspace/river-qa-refactoring-solaris/trunk/qa/lib/qa1-outrigger-dl.jar
qa1-multihomedmetainf.jar:
[jar] Building jar: /zonestorage/hudson_solaris/home/hudson/hudson-slave/workspace/river-qa-refactoring-solaris/trunk/qa/lib/qa1-multihomedmetainf.jar
jinitests:
[jar] Building jar: /zonestorage/hudson_solaris/home/hudson/hudson-slave/workspace/river-qa-refactoring-solaris/trunk/qa/lib/jinitests.jar
[jar] Updating jar: /zonestorage/hudson_solaris/home/hudson/hudson-slave/workspace/river-qa-refactoring-solaris/trunk/qa/lib/jinitests.jar
[jar] Updating jar: /zonestorage/hudson_solaris/home/hudson/hudson-slave/workspace/river-qa-refactoring-solaris/trunk/qa/lib/jinitests.jar
jinitests.jar:
qa1-mainwrapper.jar:
[jar] Building jar: /zonestorage/hudson_solaris/home/hudson/hudson-slave/workspace/river-qa-refactoring-solaris/trunk/qa/lib/qa1-mainwrapper.jar
qa1-start-cb1.jar:
[jar] Building jar: /zonestorage/hudson_solaris/home/hudson/hudson-slave/workspace/river-qa-refactoring-solaris/trunk/qa/lib/qa1-start-cb1.jar
qa1-start-cb2.jar:
[jar] Building jar: /zonestorage/hudson_solaris/home/hudson/hudson-slave/workspace/river-qa-refactoring-solaris/trunk/qa/lib/qa1-start-cb2.jar
qa1-start-cb3.jar:
[jar] Building jar: /zonestorage/hudson_solaris/home/hudson/hudson-slave/workspace/river-qa-refactoring-solaris/trunk/qa/lib/qa1-start-cb3.jar
qa1-start-probe.jar:
[jar] Building jar: /zonestorage/hudson_solaris/home/hudson/hudson-slave/workspace/river-qa-refactoring-solaris/trunk/qa/lib/qa1-start-probe.jar
qa1-start-probe-dl.jar:
[jar] Building jar: /zonestorage/hudson_solaris/home/hudson/hudson-slave/workspace/river-qa-refactoring-solaris/trunk/qa/lib/qa1-start-probe-dl.jar
qa1-start-tests.jar:
[jar] Building jar: /zonestorage/hudson_solaris/home/hudson/hudson-slave/workspace/river-qa-refactoring-solaris/trunk/qa/lib/qa1-start-tests.jar
[jar] Updating jar: /zonestorage/hudson_solaris/home/hudson/hudson-slave/workspace/river-qa-refactoring-solaris/trunk/qa/lib/qa1-start-tests.jar
qa1-start-testservice1.jar:
[jar] Building jar: /zonestorage/hudson_solaris/home/hudson/hudson-slave/workspace/river-qa-refactoring-solaris/trunk/qa/lib/qa1-start-testservice1.jar
[jar] Updating jar: /zonestorage/hudson_solaris/home/hudson/hudson-slave/workspace/river-qa-refactoring-solaris/trunk/qa/lib/qa1-start-testservice1.jar
qa1-start-testservice1-dl.jar:
[jar] Building jar: /zonestorage/hudson_solaris/home/hudson/hudson-slave/workspace/river-qa-refactoring-solaris/trunk/qa/lib/qa1-start-testservice1-dl.jar
qa1-start-testservice2.jar:
[jar] Building jar: /zonestorage/hudson_solaris/home/hudson/hudson-slave/workspace/river-qa-refactoring-solaris/trunk/qa/lib/qa1-start-testservice2.jar
[jar] Updating jar: /zonestorage/hudson_solaris/home/hudson/hudson-slave/workspace/river-qa-refactoring-solaris/trunk/qa/lib/qa1-start-testservice2.jar
qa1-start-testservice2-dl.jar:
[jar] Building jar: /zonestorage/hudson_solaris/home/hudson/hudson-slave/workspace/river-qa-refactoring-solaris/trunk/qa/lib/qa1-start-testservice2-dl.jar
qa1-start-testservice-common.jar:
[jar] Building jar: /zonestorage/hudson_solaris/home/hudson/hudson-slave/workspace/river-qa-refactoring-solaris/trunk/qa/lib/qa1-start-testservice-common.jar
qa1-start-testservice-common-dl.jar:
[jar] Building jar: /zonestorage/hudson_solaris/home/hudson/hudson-slave/workspace/river-qa-refactoring-solaris/trunk/qa/lib/qa1-start-testservice-common-dl.jar
qa1-start-testservicenocons.jar:
[jar] Building jar: /zonestorage/hudson_solaris/home/hudson/hudson-slave/workspace/river-qa-refactoring-solaris/trunk/qa/lib/qa1-start-testservicenocons.jar
qa1-start-testservicenocons-dl.jar:
[jar] Building jar: /zonestorage/hudson_solaris/home/hudson/hudson-slave/workspace/river-qa-refactoring-solaris/trunk/qa/lib/qa1-start-testservicenocons-dl.jar
qa1-lookup-simulator.jar:
[jar] Building jar: /zonestorage/hudson_solaris/home/hudson/hudson-slave/workspace/river-qa-refactoring-solaris/trunk/qa/lib/qa1-lookup-simulator.jar
[jar] Updating jar: /zonestorage/hudson_solaris/home/hudson/hudson-slave/workspace/river-qa-refactoring-solaris/trunk/qa/lib/qa1-lookup-simulator.jar
qa1-lookup-simulator-dl.jar:
[jar] Building jar: /zonestorage/hudson_solaris/home/hudson/hudson-slave/workspace/river-qa-refactoring-solaris/trunk/qa/lib/qa1-lookup-simulator-dl.jar
[jar] Updating jar: /zonestorage/hudson_solaris/home/hudson/hudson-slave/workspace/river-qa-refactoring-solaris/trunk/qa/lib/qa1-lookup-simulator-dl.jar
qa1-share-dl.jar:
[jar] Building jar: /zonestorage/hudson_solaris/home/hudson/hudson-slave/workspace/river-qa-refactoring-solaris/trunk/qa/lib/qa1-share-dl.jar
[jar] Updating jar: /zonestorage/hudson_solaris/home/hudson/hudson-slave/workspace/river-qa-refactoring-solaris/trunk/qa/lib/qa1-share-dl.jar
qa1-reggie-race.jar:
[jar] Building jar: /zonestorage/hudson_solaris/home/hudson/hudson-slave/workspace/river-qa-refactoring-solaris/trunk/qa/lib/qa1-reggie-race.jar
qa1-reggie-race-dl.jar:
[jar] Building jar: /zonestorage/hudson_solaris/home/hudson/hudson-slave/workspace/river-qa-refactoring-solaris/trunk/qa/lib/qa1-reggie-race-dl.jar
fullloggingfilter.jar:
[jar] Building jar: /zonestorage/hudson_solaris/home/hudson/hudson-slave/workspace/river-qa-refactoring-solaris/trunk/qa/lib/fullloggingfilter.jar
qa1-discoveryservice-dl.jar:
[jar] Building jar: /zonestorage/hudson_solaris/home/hudson/hudson-slave/workspace/river-qa-refactoring-solaris/trunk/qa/lib/qa1-discoveryservice-dl.jar
qa1-export-servercontext-tests-non-null.jar:
[jar] Building jar: /zonestorage/hudson_solaris/home/hudson/hudson-slave/workspace/river-qa-refactoring-solaris/trunk/qa/lib/qa1-export-servercontext-tests-non-null.jar
qa1-export-servercontext-tests-null.jar:
[jar] Building jar: /zonestorage/hudson_solaris/home/hudson/hudson-slave/workspace/river-qa-refactoring-solaris/trunk/qa/lib/qa1-export-servercontext-tests-null.jar
qa1-export-servercontext-tests-providers-parsing.jar:
[jar] Building jar: /zonestorage/hudson_solaris/home/hudson/hudson-slave/workspace/river-qa-refactoring-solaris/trunk/qa/lib/qa1-export-servercontext-tests-providers-parsing.jar
qa1-io-util-dl.jar:
[jar] Building jar: /zonestorage/hudson_solaris/home/hudson/hudson-slave/workspace/river-qa-refactoring-solaris/trunk/qa/lib/qa1-io-util-dl.jar
qa1-io-marshalinputstream-test.jar:
[jar] Building jar: /zonestorage/hudson_solaris/home/hudson/hudson-slave/workspace/river-qa-refactoring-solaris/trunk/qa/lib/qa1-io-marshalinputstream-test.jar
[jar] Updating jar: /zonestorage/hudson_solaris/home/hudson/hudson-slave/workspace/river-qa-refactoring-solaris/trunk/qa/lib/qa1-io-marshalinputstream-test.jar
qa1-io-marshalledinstance-test.jar:
[jar] Building jar: /zonestorage/hudson_solaris/home/hudson/hudson-slave/workspace/river-qa-refactoring-solaris/trunk/qa/lib/qa1-io-marshalledinstance-test.jar
[jar] Updating jar: /zonestorage/hudson_solaris/home/hudson/hudson-slave/workspace/river-qa-refactoring-solaris/trunk/qa/lib/qa1-io-marshalledinstance-test.jar
qa1-javaspace-dl.jar:
[jar] Building jar: /zonestorage/hudson_solaris/home/hudson/hudson-slave/workspace/river-qa-refactoring-solaris/trunk/qa/lib/qa1-javaspace-dl.jar
qa1-lookupservice-dl.jar:
[jar] Building jar: /zonestorage/hudson_solaris/home/hudson/hudson-slave/workspace/river-qa-refactoring-solaris/trunk/qa/lib/qa1-lookupservice-dl.jar
qa1-renewalservice-dl.jar:
[jar] Building jar: /zonestorage/hudson_solaris/home/hudson/hudson-slave/workspace/river-qa-refactoring-solaris/trunk/qa/lib/qa1-renewalservice-dl.jar
[jar] Updating jar: /zonestorage/hudson_solaris/home/hudson/hudson-slave/workspace/river-qa-refactoring-solaris/trunk/qa/lib/qa1-renewalservice-dl.jar
qa1-securityDoPrivileged.jar:
[jar] Building jar: /zonestorage/hudson_solaris/home/hudson/hudson-slave/workspace/river-qa-refactoring-solaris/trunk/qa/lib/qa1-securityDoPrivileged.jar
qa1-securityUtil.jar:
[jar] Building jar: /zonestorage/hudson_solaris/home/hudson/hudson-slave/workspace/river-qa-refactoring-solaris/trunk/qa/lib/qa1-securityUtil.jar
qa1-servicediscovery-dl.jar:
[java] Warning: Class not found: net.jini.lookup.ServiceDiscoveryManager$LookupCacheImpl$LookupListener_Stub
[jar] Building jar: /zonestorage/hudson_solaris/home/hudson/hudson-slave/workspace/river-qa-refactoring-solaris/trunk/qa/lib/qa1-servicediscovery-dl.jar
[java] Warning: Class not found: net.jini.lookup.ServiceDiscoveryManager$LookupCacheImpl$LookupListener_Stub
[jar] Updating jar: /zonestorage/hudson_solaris/home/hudson/hudson-slave/workspace/river-qa-refactoring-solaris/trunk/qa/lib/qa1-servicediscovery-dl.jar
qa1-httpmd.jar:
[jar] Building jar: /zonestorage/hudson_solaris/home/hudson/hudson-slave/workspace/river-qa-refactoring-solaris/trunk/qa/lib/qa1-httpmd.jar
qa1-httpmd-same.jar:
[copy] Copying 1 file to /zonestorage/hudson_solaris/home/hudson/hudson-slave/workspace/river-qa-refactoring-solaris/trunk/qa/lib
qa1-httpmd-another.jar:
[jar] Building jar: /zonestorage/hudson_solaris/home/hudson/hudson-slave/workspace/river-qa-refactoring-solaris/trunk/qa/lib/qa1-httpmd-another.jar
ld.jar:
[jar] Building jar: /zonestorage/hudson_solaris/home/hudson/hudson-slave/workspace/river-qa-refactoring-solaris/trunk/qa/lib/ld.jar
qa1-loader-pref.jar:
[jar] Building jar: /zonestorage/hudson_solaris/home/hudson/hudson-slave/workspace/river-qa-refactoring-solaris/trunk/qa/lib/qa1-loader-pref.jar
qa1-policy-provider.jar:
[jar] Building jar: /zonestorage/hudson_solaris/home/hudson/hudson-slave/workspace/river-qa-refactoring-solaris/trunk/qa/lib/qa1-policy-provider.jar
jars:
harness-runtime:
run:
james-brown:
[mkdir] Created dir: /zonestorage/hudson_solaris/home/hudson/hudson-slave/workspace/river-qa-refactoring-solaris/trunk/qa/soul
[touch] Creating /zonestorage/hudson_solaris/home/hudson/hudson-slave/workspace/river-qa-refactoring-solaris/trunk/qa/soul/soul.201303011306052115
run-categories:
[java] Problem with KEEPALIVE_PORT:10004
[java] Unexpected exception:
[java] java.net.BindException: Address already in use
[java] at java.net.PlainSocketImpl.socketBind(Native Method)
[java] at java.net.PlainSocketImpl.bind(PlainSocketImpl.java:383)
[java] at java.net.ServerSocket.bind(ServerSocket.java:328)
[java] at java.net.ServerSocket.bind(ServerSocket.java:286)
[java] at com.sun.jini.qa.harness.MasterHarness$KeepAlivePort.run(MasterHarness.java:257)
[java] at java.lang.Thread.run(Thread.java:662)
[java] Java Result: 1
collect-result:
BUILD FAILED
/zonestorage/hudson_solaris/home/hudson/hudson-slave/workspace/river-qa-refactoring-solaris/trunk/build.xml:2093: The following error occurred while executing this line:
/zonestorage/hudson_solaris/home/hudson/hudson-slave/workspace/river-qa-refactoring-solaris/trunk/qa/build.xml:406: The following error occurred while executing this line:
/zonestorage/hudson_solaris/home/hudson/hudson-slave/workspace/river-qa-refactoring-solaris/trunk/qa/build.xml:380: condition satisfied
Total time: 9 minutes 44 seconds
Build step 'Invoke Ant' marked build as failure
Archiving artifacts
Build failed in Jenkins: river-qa-refactoring-solaris #35
Posted by Apache Jenkins Server <je...@builds.apache.org>.
See <https://builds.apache.org/job/river-qa-refactoring-solaris/35/changes>
Changes:
[peter_firmstone] RIVER-416
Added fail safe mechanism in case of future Level serial form breakage based on suggestion made by Robert Gibson that only uses public API.
[peter_firmstone] Clean and simple replacement for Serializable - Distributed objects.
[peter_firmstone] Clean and simple replacement for Serializable - Distributed objects.
[peter_firmstone] Distributed object serialization test.
[peter_firmstone] Fix OOM error.
[peter_firmstone] Fix OOM error.
[peter_firmstone] Fix OOM error.
------------------------------------------
[...truncated 9503 lines...]
[java] Test Passed: OK
[java]
[java] -----------------------------------------
[java] com/sun/jini/test/spec/javaspace/conformance/snapshot/SnapshotTransactionTakeIfExistsTest.td
[java] Test Passed: OK
[java]
[java] -----------------------------------------
[java] com/sun/jini/test/spec/javaspace/conformance/snapshot/SnapshotTransactionTakeIfExistsWaitTest.td
[java] Test Passed: OK
[java]
[java] -----------------------------------------
[java] com/sun/jini/test/spec/javaspace/conformance/snapshot/SnapshotTransactionTakeNO_WAITTest.td
[java] Test Passed: OK
[java]
[java] -----------------------------------------
[java] com/sun/jini/test/spec/javaspace/conformance/snapshot/SnapshotTransactionTakeReadTest.td
[java] Test Passed: OK
[java]
[java] -----------------------------------------
[java] com/sun/jini/test/spec/javaspace/conformance/snapshot/SnapshotTransactionTakeTest.td
[java] Test Passed: OK
[java]
[java] -----------------------------------------
[java] com/sun/jini/test/spec/javaspace/conformance/snapshot/SnapshotTransactionTakeWaitTest.td
[java] Test Passed: OK
[java]
[java] -----------------------------------------
[java] com/sun/jini/test/spec/javaspace/conformance/snapshot/SnapshotTransactionWriteLeaseANYTest.td
[java] Test Passed: OK
[java]
[java] -----------------------------------------
[java] com/sun/jini/test/spec/javaspace/conformance/snapshot/SnapshotTransactionWriteLeaseFOREVERTest.td
[java] Test Passed: OK
[java]
[java] -----------------------------------------
[java] com/sun/jini/test/spec/javaspace/conformance/snapshot/SnapshotTransactionWriteNegativeLeaseTest.td
[java] Test Passed: OK
[java]
[java] -----------------------------------------
[java] com/sun/jini/test/spec/javaspace/conformance/snapshot/SnapshotTransactionWriteTakeIfExistsNotifyTest.td
[java] Test Passed: OK
[java]
[java] -----------------------------------------
[java] com/sun/jini/test/spec/javaspace/conformance/snapshot/SnapshotTransactionWriteTakeIfExistsTest.td
[java] Test Passed: OK
[java]
[java] -----------------------------------------
[java] com/sun/jini/test/spec/javaspace/conformance/snapshot/SnapshotTransactionWriteTakeNotifyTest.td
[java] Test Passed: OK
[java]
[java] -----------------------------------------
[java] com/sun/jini/test/spec/javaspace/conformance/snapshot/SnapshotTransactionWriteTakeTest.td
[java] Test Passed: OK
[java]
[java] -----------------------------------------
[java] com/sun/jini/test/spec/javaspace/conformance/snapshot/SnapshotTransactionWriteTest.td
[java] Test Passed: OK
[java]
[java] -----------------------------------------
[java] com/sun/jini/test/spec/javaspace/conformance/snapshot/SnapshotWriteLeaseANYTest.td
[java] Test Passed: OK
[java]
[java] -----------------------------------------
[java] com/sun/jini/test/spec/javaspace/conformance/snapshot/SnapshotWriteLeaseFOREVERTest.td
[java] Test Passed: OK
[java]
[java] -----------------------------------------
[java] com/sun/jini/test/spec/javaspace/conformance/snapshot/SnapshotWriteNegativeLeaseTest.td
[java] Test Passed: OK
[java]
[java] -----------------------------------------
[java] com/sun/jini/test/spec/javaspace/conformance/snapshot/SnapshotWriteTest.td
[java] Test Passed: OK
[java]
[java] -----------------------------------------
[java] com/sun/jini/test/impl/mahalo/AdminIFShutdownTest.td
[java] Test Passed: OK
[java]
[java] -----------------------------------------
[java] com/sun/jini/test/impl/mahalo/AdminIFTest.td
[java] Test Passed: OK
[java]
[java] -----------------------------------------
[java] com/sun/jini/test/impl/mahalo/LeaseExpireCancelTest.td
[java] Test Passed: OK
[java]
[java] -----------------------------------------
[java] com/sun/jini/test/impl/mahalo/LeaseExpireRenewTest.td
[java] Test Passed: OK
[java]
[java] -----------------------------------------
[java] com/sun/jini/test/impl/mahalo/LeaseMapTest.td
[java] Test Passed: OK
[java]
[java] -----------------------------------------
[java] com/sun/jini/test/impl/mahalo/LeaseTest.td
[java] Test Passed: OK
[java]
[java] -----------------------------------------
[java] com/sun/jini/test/impl/mahalo/MahaloCreateShutdownTest.td
[java] Test Passed: OK
[java]
[java] -----------------------------------------
[java] com/sun/jini/test/impl/mahalo/MahaloIFTest.td
[java] Test Passed: OK
[java]
[java] -----------------------------------------
[java] com/sun/jini/test/impl/mahalo/MahaloImplReadyStateTest.td
[java] Test Skipped: verifiers are: com.sun.jini.test.impl.mercury.ActivatableMercuryVerifier com.sun.jini.qa.harness.SkipConfigTestVerifier
[java] -----------------------------------------
[java] com/sun/jini/test/impl/mahalo/NestableServerTransactionCreatedToStringTest.td
[java] Test Passed: OK
[java]
[java] -----------------------------------------
[java] com/sun/jini/test/impl/mahalo/NestableTransactionCreatedToStringTest.td
[java] Test Passed: OK
[java]
[java] -----------------------------------------
[java] com/sun/jini/test/impl/mahalo/PrepareAndCommitExceptionTest.td
[java] Test Passed: OK
[java]
[java] -----------------------------------------
[java] com/sun/jini/test/impl/mahalo/PrepareAndCommitExceptionTest2.td
[java] Test Passed: OK
[java]
[java] -----------------------------------------
[java] com/sun/jini/test/impl/mahalo/PrepareAndCommitExceptionTest3.td
[java] Test Passed: OK
[java]
[java] -----------------------------------------
[java] com/sun/jini/test/impl/mahalo/PrepareAndCommitExceptionTest4.td
[java] Test Passed: OK
[java]
[java] -----------------------------------------
[java] com/sun/jini/test/impl/mahalo/PrepareAndCommitExceptionTest5.td
[java] Test Passed: OK
[java]
[java] -----------------------------------------
[java] com/sun/jini/test/impl/mahalo/RandomStressTest.td
[java] Test Passed: OK
[java]
[java] -----------------------------------------
[java] com/sun/jini/test/impl/mahalo/ServerTransactionEqualityTest.td
[java] Test Passed: OK
[java]
[java] -----------------------------------------
[java] com/sun/jini/test/impl/mahalo/ServerTransactionToStringTest.td
[java] Test Passed: OK
[java]
[java] -----------------------------------------
[java] com/sun/jini/test/impl/mahalo/TransactionCreatedToStringTest.td
[java] Test Passed: OK
[java]
[java] -----------------------------------------
[java] com/sun/jini/test/impl/mahalo/TransactionManagerCreatedToStringTest.td
[java] Test Passed: OK
[java]
[java] -----------------------------------------
[java] com/sun/jini/test/impl/mahalo/TxnMgrImplNullActivationConfigEntries.td
[java] Test Skipped: verifiers are: com.sun.jini.test.impl.mahalo.ActivatableMahaloVerifier
[java] -----------------------------------------
[java] com/sun/jini/test/impl/mahalo/TxnMgrImplNullConfigEntries.td
[java] Test Passed: OK
[java]
[java] -----------------------------------------
[java] com/sun/jini/test/impl/mahalo/TxnMgrImplNullRecoveredLocators.td
[java] Test Skipped: verifiers are: com.sun.jini.test.impl.mahalo.ActivatableMahaloVerifier
[java] -----------------------------------------
[java] com/sun/jini/test/impl/mahalo/TxnMgrProxyEqualityTest.td
[java] Test Passed: OK
[java]
[java] -----------------------------------------
[java] com/sun/jini/test/spec/txnmanager/AsynchAbortOnCommitTest.td
[java] Test Passed: OK
[java]
[java] -----------------------------------------
[java] com/sun/jini/test/spec/txnmanager/AsynchAbortOnPrepareTest.td
[java] Test Passed: OK
[java]
[java] -----------------------------------------
[java] com/sun/jini/test/spec/txnmanager/CommitExpiredTest.td
[java] Test Passed: OK
[java]
[java] -----------------------------------------
[java] com/sun/jini/test/spec/txnmanager/CommitTimeoutTest.td
[java] Test Passed: OK
[java]
[java] -----------------------------------------
[java] com/sun/jini/test/spec/txnmanager/GetStateTest.td
[java] Test Passed: OK
[java]
[java] -----------------------------------------
[java] com/sun/jini/test/spec/txnmanager/JoinIdempotentTest.td
[java] Test Passed: OK
[java]
[java] -----------------------------------------
[java] com/sun/jini/test/spec/txnmanager/JoinWhileActiveTest.td
[java] Test Passed: OK
[java]
[java] -----------------------------------------
[java] com/sun/jini/test/spec/txnmanager/ManyParticipantsTest.td
[java] Test Passed: OK
[java]
[java] -----------------------------------------
[java] com/sun/jini/test/spec/txnmanager/PrepareTimeoutTest.td
[java] Test Passed: OK
[java]
[java] -----------------------------------------
[java] com/sun/jini/test/spec/txnmanager/RollBackErrorTest.td
[java] Test Passed: OK
[java]
[java] -----------------------------------------
[java] com/sun/jini/test/spec/txnmanager/RollForwardErrorTest.td
[java] Test Passed: OK
[java]
[java] -----------------------------------------
[java] com/sun/jini/test/spec/txnmanager/TwoPhaseTest.td
[java] Test Passed: OK
[java]
[java] -----------------------------------------
[java]
[java] # of tests started = 1412
[java] # of tests completed = 1412
[java] # of tests skipped = 46
[java] # of tests passed = 1081
[java] # of tests failed = 331
[java]
[java] -----------------------------------------
[java]
[java] Date finished:
[java] Fri Mar 01 01:21:44 GMT+00:00 2013
[java] Time elapsed:
[java] 55536 seconds
[java]
[java] Java Result: 1
collect-result:
[copy] Copying 1 file to /zonestorage/hudson_solaris/home/hudson/hudson-slave/workspace/river-qa-refactoring-solaris/trunk/qa/result
[copy] Copying 1 file to /zonestorage/hudson_solaris/home/hudson/hudson-slave/workspace/river-qa-refactoring-solaris/trunk/qa/result
[zip] Building zip: /zonestorage/hudson_solaris/home/hudson/hudson-slave/workspace/river-qa-refactoring-solaris/trunk/qa/result/qaresults-x86-SunOS-1.6.0_26.zip
BUILD FAILED
/zonestorage/hudson_solaris/home/hudson/hudson-slave/workspace/river-qa-refactoring-solaris/trunk/build.xml:2093: The following error occurred while executing this line:
/zonestorage/hudson_solaris/home/hudson/hudson-slave/workspace/river-qa-refactoring-solaris/trunk/qa/build.xml:406: The following error occurred while executing this line:
/zonestorage/hudson_solaris/home/hudson/hudson-slave/workspace/river-qa-refactoring-solaris/trunk/qa/build.xml:380: condition satisfied
Total time: 939 minutes 22 seconds
Build step 'Invoke Ant' marked build as failure
Archiving artifacts
Build failed in Jenkins: river-qa-refactoring-solaris #32
Posted by Apache Jenkins Server <je...@builds.apache.org>.
See <https://builds.apache.org/job/river-qa-refactoring-solaris/32/changes>
Changes:
[peter_firmstone] Ensure action fields are populated before publishing Permission objects.
[peter_firmstone] Refactoring: delete commented out code, rename field
[peter_firmstone] Modifications to ensure safe publication of Permission after parsing.
[peter_firmstone] Ensure AggregatePolicyProvider blocks during modification.
------------------------------------------
[...truncated 11213 lines...]
[java] -----------------------------------------
[java] com/sun/jini/test/impl/mahalo/AdminIFTest.td
[java] Test Failed: Test Failed: com.sun.jini.qa.harness.TestException: Exception has been caught in specifyServices: Problem creating service for net.jini.core.transaction.server.TransactionManager; nested exception is:
[java] Failed to start the shared nonactivatable group; nested exception is:
[java] NonActivatableGroupAdmin: Failed to exec the group; nested exception is:
[java] null
[java]
[java] -----------------------------------------
[java] com/sun/jini/test/impl/mahalo/LeaseExpireCancelTest.td
[java] Test Failed: Test Failed: com.sun.jini.qa.harness.TestException: Exception has been caught in specifyServices: Problem creating service for net.jini.core.transaction.server.TransactionManager; nested exception is:
[java] Failed to start the shared nonactivatable group; nested exception is:
[java] NonActivatableGroupAdmin: Failed to exec the group; nested exception is:
[java] null
[java]
[java] -----------------------------------------
[java] com/sun/jini/test/impl/mahalo/LeaseExpireRenewTest.td
[java] Test Failed: Test Failed: com.sun.jini.qa.harness.TestException: Exception has been caught in specifyServices: Problem creating service for net.jini.core.transaction.server.TransactionManager; nested exception is:
[java] Failed to start the shared nonactivatable group; nested exception is:
[java] NonActivatableGroupAdmin: Failed to exec the group; nested exception is:
[java] null
[java]
[java] -----------------------------------------
[java] com/sun/jini/test/impl/mahalo/LeaseMapTest.td
[java] Test Failed: Test Failed: com.sun.jini.qa.harness.TestException: Exception has been caught in specifyServices: Problem creating service for net.jini.core.transaction.server.TransactionManager; nested exception is:
[java] Failed to start the shared nonactivatable group; nested exception is:
[java] NonActivatableGroupAdmin: Failed to exec the group; nested exception is:
[java] null
[java]
[java] -----------------------------------------
[java] com/sun/jini/test/impl/mahalo/LeaseTest.td
[java] Test Failed: Test Failed: com.sun.jini.qa.harness.TestException: Exception has been caught in specifyServices: Problem creating service for net.jini.core.transaction.server.TransactionManager; nested exception is:
[java] Failed to start the shared nonactivatable group; nested exception is:
[java] NonActivatableGroupAdmin: Failed to exec the group; nested exception is:
[java] null
[java]
[java] -----------------------------------------
[java] com/sun/jini/test/impl/mahalo/MahaloCreateShutdownTest.td
[java] Test Passed: OK
[java]
[java] -----------------------------------------
[java] com/sun/jini/test/impl/mahalo/MahaloIFTest.td
[java] Test Passed: OK
[java]
[java] -----------------------------------------
[java] com/sun/jini/test/impl/mahalo/MahaloImplReadyStateTest.td
[java] Test Skipped: verifiers are: com.sun.jini.test.impl.mercury.ActivatableMercuryVerifier com.sun.jini.qa.harness.SkipConfigTestVerifier
[java] -----------------------------------------
[java] com/sun/jini/test/impl/mahalo/NestableServerTransactionCreatedToStringTest.td
[java] Test Passed: OK
[java]
[java] -----------------------------------------
[java] com/sun/jini/test/impl/mahalo/NestableTransactionCreatedToStringTest.td
[java] Test Passed: OK
[java]
[java] -----------------------------------------
[java] com/sun/jini/test/impl/mahalo/PrepareAndCommitExceptionTest.td
[java] Test Failed: Test Failed: com.sun.jini.qa.harness.TestException: Exception has been caught in specifyServices: Problem creating service for net.jini.core.transaction.server.TransactionManager; nested exception is:
[java] Failed to start the shared nonactivatable group; nested exception is:
[java] NonActivatableGroupAdmin: Failed to exec the group; nested exception is:
[java] null
[java]
[java] -----------------------------------------
[java] com/sun/jini/test/impl/mahalo/PrepareAndCommitExceptionTest2.td
[java] Test Failed: Test Failed: com.sun.jini.qa.harness.TestException: Exception has been caught in specifyServices: Problem creating service for net.jini.core.transaction.server.TransactionManager; nested exception is:
[java] Failed to start the shared nonactivatable group; nested exception is:
[java] NonActivatableGroupAdmin: Failed to exec the group; nested exception is:
[java] null
[java]
[java] -----------------------------------------
[java] com/sun/jini/test/impl/mahalo/PrepareAndCommitExceptionTest3.td
[java] Test Failed: Test Failed: com.sun.jini.qa.harness.TestException: Exception has been caught in specifyServices: Problem creating service for net.jini.core.transaction.server.TransactionManager; nested exception is:
[java] Failed to start the shared nonactivatable group; nested exception is:
[java] NonActivatableGroupAdmin: Failed to exec the group; nested exception is:
[java] null
[java]
[java] -----------------------------------------
[java] com/sun/jini/test/impl/mahalo/PrepareAndCommitExceptionTest4.td
[java] Test Failed: Test Failed: com.sun.jini.qa.harness.TestException: Exception has been caught in specifyServices: Problem creating service for net.jini.core.transaction.server.TransactionManager; nested exception is:
[java] Failed to start the shared nonactivatable group; nested exception is:
[java] NonActivatableGroupAdmin: Failed to exec the group; nested exception is:
[java] null
[java]
[java] -----------------------------------------
[java] com/sun/jini/test/impl/mahalo/PrepareAndCommitExceptionTest5.td
[java] Test Failed: Test Failed: com.sun.jini.qa.harness.TestException: Exception has been caught in specifyServices: Problem creating service for net.jini.core.transaction.server.TransactionManager; nested exception is:
[java] Failed to start the shared nonactivatable group; nested exception is:
[java] NonActivatableGroupAdmin: Failed to exec the group; nested exception is:
[java] null
[java]
[java] -----------------------------------------
[java] com/sun/jini/test/impl/mahalo/RandomStressTest.td
[java] Test Failed: Test Failed: com.sun.jini.qa.harness.TestException: Exception has been caught in specifyServices: Problem creating service for net.jini.core.transaction.server.TransactionManager; nested exception is:
[java] Failed to start the shared nonactivatable group; nested exception is:
[java] NonActivatableGroupAdmin: Failed to exec the group; nested exception is:
[java] null
[java]
[java] -----------------------------------------
[java] com/sun/jini/test/impl/mahalo/ServerTransactionEqualityTest.td
[java] Test Failed: Test Failed: com.sun.jini.qa.harness.TestException: Exception has been caught in specifyServices: Problem creating service for net.jini.core.transaction.server.TransactionManager; nested exception is:
[java] Failed to start the shared nonactivatable group; nested exception is:
[java] NonActivatableGroupAdmin: Failed to exec the group; nested exception is:
[java] null
[java]
[java] -----------------------------------------
[java] com/sun/jini/test/impl/mahalo/ServerTransactionToStringTest.td
[java] Test Failed: Test Failed: com.sun.jini.qa.harness.TestException: Exception has been caught in specifyServices: Problem creating service for net.jini.core.transaction.server.TransactionManager; nested exception is:
[java] Failed to start the shared nonactivatable group; nested exception is:
[java] NonActivatableGroupAdmin: Failed to exec the group; nested exception is:
[java] null
[java]
[java] -----------------------------------------
[java] com/sun/jini/test/impl/mahalo/TransactionCreatedToStringTest.td
[java] Test Passed: OK
[java]
[java] -----------------------------------------
[java] com/sun/jini/test/impl/mahalo/TransactionManagerCreatedToStringTest.td
[java] Test Passed: OK
[java]
[java] -----------------------------------------
[java] com/sun/jini/test/impl/mahalo/TxnMgrImplNullActivationConfigEntries.td
[java] Test Skipped: verifiers are: com.sun.jini.test.impl.mahalo.ActivatableMahaloVerifier
[java] -----------------------------------------
[java] com/sun/jini/test/impl/mahalo/TxnMgrImplNullConfigEntries.td
[java] Test Failed: Test Failed: com.sun.jini.qa.harness.TestException: Service failed due to non-configuration relatedexception.
[java]
[java] -----------------------------------------
[java] com/sun/jini/test/impl/mahalo/TxnMgrImplNullRecoveredLocators.td
[java] Test Skipped: verifiers are: com.sun.jini.test.impl.mahalo.ActivatableMahaloVerifier
[java] -----------------------------------------
[java] com/sun/jini/test/impl/mahalo/TxnMgrProxyEqualityTest.td
[java] Test Failed: Test Failed: com.sun.jini.qa.harness.TestException: Exception has been caught in specifyServices: Problem creating service for net.jini.core.transaction.server.TransactionManager; nested exception is:
[java] Failed to start the shared nonactivatable group; nested exception is:
[java] NonActivatableGroupAdmin: Failed to exec the group; nested exception is:
[java] null
[java]
[java] -----------------------------------------
[java] com/sun/jini/test/spec/txnmanager/AsynchAbortOnCommitTest.td
[java] Test Failed: Test Failed: com.sun.jini.qa.harness.TestException: Exception has been caught in specifyServices: Problem creating service for net.jini.core.transaction.server.TransactionManager; nested exception is:
[java] Failed to start the shared nonactivatable group; nested exception is:
[java] NonActivatableGroupAdmin: Failed to exec the group; nested exception is:
[java] null
[java]
[java] -----------------------------------------
[java] com/sun/jini/test/spec/txnmanager/AsynchAbortOnPrepareTest.td
[java] Test Failed: Test Failed: com.sun.jini.qa.harness.TestException: Exception has been caught in specifyServices: Problem creating service for net.jini.core.transaction.server.TransactionManager; nested exception is:
[java] Failed to start the shared nonactivatable group; nested exception is:
[java] NonActivatableGroupAdmin: Failed to exec the group; nested exception is:
[java] null
[java]
[java] -----------------------------------------
[java] com/sun/jini/test/spec/txnmanager/CommitExpiredTest.td
[java] Test Failed: Test Failed: com.sun.jini.qa.harness.TestException: Exception has been caught in specifyServices: Problem creating service for net.jini.core.transaction.server.TransactionManager; nested exception is:
[java] Failed to start the shared nonactivatable group; nested exception is:
[java] NonActivatableGroupAdmin: Failed to exec the group; nested exception is:
[java] null
[java]
[java] -----------------------------------------
[java] com/sun/jini/test/spec/txnmanager/CommitTimeoutTest.td
[java] Test Failed: Test Failed: com.sun.jini.qa.harness.TestException: Exception has been caught in specifyServices: Problem creating service for net.jini.core.transaction.server.TransactionManager; nested exception is:
[java] Failed to start the shared nonactivatable group; nested exception is:
[java] NonActivatableGroupAdmin: Failed to exec the group; nested exception is:
[java] null
[java]
[java] -----------------------------------------
[java] com/sun/jini/test/spec/txnmanager/GetStateTest.td
[java] Test Failed: Test Failed: com.sun.jini.qa.harness.TestException: Exception has been caught in specifyServices: Problem creating service for net.jini.core.transaction.server.TransactionManager; nested exception is:
[java] Failed to start the shared nonactivatable group; nested exception is:
[java] NonActivatableGroupAdmin: Failed to exec the group; nested exception is:
[java] null
[java]
[java] -----------------------------------------
[java] com/sun/jini/test/spec/txnmanager/JoinIdempotentTest.td
[java] Test Failed: Test Failed: com.sun.jini.qa.harness.TestException: Exception has been caught in specifyServices: Problem creating service for net.jini.core.transaction.server.TransactionManager; nested exception is:
[java] Failed to start the shared nonactivatable group; nested exception is:
[java] NonActivatableGroupAdmin: Failed to exec the group; nested exception is:
[java] null
[java]
[java] -----------------------------------------
[java] com/sun/jini/test/spec/txnmanager/JoinWhileActiveTest.td
[java] Test Failed: Test Failed: com.sun.jini.qa.harness.TestException: Exception has been caught in specifyServices: Problem creating service for net.jini.core.transaction.server.TransactionManager; nested exception is:
[java] Failed to start the shared nonactivatable group; nested exception is:
[java] NonActivatableGroupAdmin: Failed to exec the group; nested exception is:
[java] null
[java]
[java] -----------------------------------------
[java] com/sun/jini/test/spec/txnmanager/ManyParticipantsTest.td
[java] Test Failed: Test Failed: com.sun.jini.qa.harness.TestException: Exception has been caught in specifyServices: Problem creating service for net.jini.core.transaction.server.TransactionManager; nested exception is:
[java] Failed to start the shared nonactivatable group; nested exception is:
[java] NonActivatableGroupAdmin: Failed to exec the group; nested exception is:
[java] null
[java]
[java] -----------------------------------------
[java] com/sun/jini/test/spec/txnmanager/PrepareTimeoutTest.td
[java] Test Failed: Test Failed: com.sun.jini.qa.harness.TestException: Exception has been caught in specifyServices: Problem creating service for net.jini.core.transaction.server.TransactionManager; nested exception is:
[java] Failed to start the shared nonactivatable group; nested exception is:
[java] NonActivatableGroupAdmin: Failed to exec the group; nested exception is:
[java] null
[java]
[java] -----------------------------------------
[java] com/sun/jini/test/spec/txnmanager/RollBackErrorTest.td
[java] Test Failed: Test Failed: com.sun.jini.qa.harness.TestException: Exception has been caught in specifyServices: Problem creating service for net.jini.core.transaction.server.TransactionManager; nested exception is:
[java] Failed to start the shared nonactivatable group; nested exception is:
[java] NonActivatableGroupAdmin: Failed to exec the group; nested exception is:
[java] null
[java]
[java] -----------------------------------------
[java] com/sun/jini/test/spec/txnmanager/RollForwardErrorTest.td
[java] Test Failed: Test Failed: com.sun.jini.qa.harness.TestException: Exception has been caught in specifyServices: Problem creating service for net.jini.core.transaction.server.TransactionManager; nested exception is:
[java] Failed to start the shared nonactivatable group; nested exception is:
[java] NonActivatableGroupAdmin: Failed to exec the group; nested exception is:
[java] null
[java]
[java] -----------------------------------------
[java] com/sun/jini/test/spec/txnmanager/TwoPhaseTest.td
[java] Test Failed: Test Failed: com.sun.jini.qa.harness.TestException: Exception has been caught in specifyServices: Problem creating service for net.jini.core.transaction.server.TransactionManager; nested exception is:
[java] Failed to start the shared nonactivatable group; nested exception is:
[java] NonActivatableGroupAdmin: Failed to exec the group; nested exception is:
[java] null
[java]
[java] -----------------------------------------
[java]
[java] # of tests started = 1412
[java] # of tests completed = 1412
[java] # of tests skipped = 46
[java] # of tests passed = 591
[java] # of tests failed = 821
[java]
[java] -----------------------------------------
[java]
[java] Date finished:
[java] Tue Feb 26 16:53:59 GMT+00:00 2013
[java] Time elapsed:
[java] 17226 seconds
[java]
[java] Java Result: 1
collect-result:
[copy] Copying 1 file to /zonestorage/hudson_solaris/home/hudson/hudson-slave/workspace/river-qa-refactoring-solaris/trunk/qa/result
[copy] Copying 1 file to /zonestorage/hudson_solaris/home/hudson/hudson-slave/workspace/river-qa-refactoring-solaris/trunk/qa/result
[zip] Building zip: /zonestorage/hudson_solaris/home/hudson/hudson-slave/workspace/river-qa-refactoring-solaris/trunk/qa/result/qaresults-x86-SunOS-1.6.0_26.zip
BUILD FAILED
/zonestorage/hudson_solaris/home/hudson/hudson-slave/workspace/river-qa-refactoring-solaris/trunk/build.xml:2093: The following error occurred while executing this line:
/zonestorage/hudson_solaris/home/hudson/hudson-slave/workspace/river-qa-refactoring-solaris/trunk/qa/build.xml:406: The following error occurred while executing this line:
/zonestorage/hudson_solaris/home/hudson/hudson-slave/workspace/river-qa-refactoring-solaris/trunk/qa/build.xml:380: condition satisfied
Total time: 295 minutes 55 seconds
Build step 'Invoke Ant' marked build as failure
Archiving artifacts
Build failed in Jenkins: river-qa-refactoring-solaris #30
Posted by Apache Jenkins Server <je...@builds.apache.org>.
See <https://builds.apache.org/job/river-qa-refactoring-solaris/30/changes>
Changes:
[peter_firmstone] RIVER-416
[peter_firmstone] RIVER-416
[peter_firmstone] Attempt to fix another failing javaspace test
com/sun/jini/test/spec/javaspace/conformance/ExpirationNotifyTest.td
[java] Test Failed: Test Failed: com.sun.jini.qa.harness.TestException: Not all listeners've got expected number of events.
[peter_firmstone] Attempt to fix failing javaspace test
[peter_firmstone] Attempt to fix last failing test UseNotifyLeaseTestRenew on arm
------------------------------------------
[...truncated 8814 lines...]
[java] Test Passed: OK
[java]
[java] -----------------------------------------
[java] com/sun/jini/test/spec/javaspace/conformance/snapshot/SnapshotTransactionTakeIfExistsTest.td
[java] Test Passed: OK
[java]
[java] -----------------------------------------
[java] com/sun/jini/test/spec/javaspace/conformance/snapshot/SnapshotTransactionTakeIfExistsWaitTest.td
[java] Test Passed: OK
[java]
[java] -----------------------------------------
[java] com/sun/jini/test/spec/javaspace/conformance/snapshot/SnapshotTransactionTakeNO_WAITTest.td
[java] Test Passed: OK
[java]
[java] -----------------------------------------
[java] com/sun/jini/test/spec/javaspace/conformance/snapshot/SnapshotTransactionTakeReadTest.td
[java] Test Passed: OK
[java]
[java] -----------------------------------------
[java] com/sun/jini/test/spec/javaspace/conformance/snapshot/SnapshotTransactionTakeTest.td
[java] Test Passed: OK
[java]
[java] -----------------------------------------
[java] com/sun/jini/test/spec/javaspace/conformance/snapshot/SnapshotTransactionTakeWaitTest.td
[java] Test Passed: OK
[java]
[java] -----------------------------------------
[java] com/sun/jini/test/spec/javaspace/conformance/snapshot/SnapshotTransactionWriteLeaseANYTest.td
[java] Test Passed: OK
[java]
[java] -----------------------------------------
[java] com/sun/jini/test/spec/javaspace/conformance/snapshot/SnapshotTransactionWriteLeaseFOREVERTest.td
[java] Test Passed: OK
[java]
[java] -----------------------------------------
[java] com/sun/jini/test/spec/javaspace/conformance/snapshot/SnapshotTransactionWriteNegativeLeaseTest.td
[java] Test Passed: OK
[java]
[java] -----------------------------------------
[java] com/sun/jini/test/spec/javaspace/conformance/snapshot/SnapshotTransactionWriteTakeIfExistsNotifyTest.td
[java] Test Passed: OK
[java]
[java] -----------------------------------------
[java] com/sun/jini/test/spec/javaspace/conformance/snapshot/SnapshotTransactionWriteTakeIfExistsTest.td
[java] Test Passed: OK
[java]
[java] -----------------------------------------
[java] com/sun/jini/test/spec/javaspace/conformance/snapshot/SnapshotTransactionWriteTakeNotifyTest.td
[java] Test Passed: OK
[java]
[java] -----------------------------------------
[java] com/sun/jini/test/spec/javaspace/conformance/snapshot/SnapshotTransactionWriteTakeTest.td
[java] Test Passed: OK
[java]
[java] -----------------------------------------
[java] com/sun/jini/test/spec/javaspace/conformance/snapshot/SnapshotTransactionWriteTest.td
[java] Test Passed: OK
[java]
[java] -----------------------------------------
[java] com/sun/jini/test/spec/javaspace/conformance/snapshot/SnapshotWriteLeaseANYTest.td
[java] Test Passed: OK
[java]
[java] -----------------------------------------
[java] com/sun/jini/test/spec/javaspace/conformance/snapshot/SnapshotWriteLeaseFOREVERTest.td
[java] Test Passed: OK
[java]
[java] -----------------------------------------
[java] com/sun/jini/test/spec/javaspace/conformance/snapshot/SnapshotWriteNegativeLeaseTest.td
[java] Test Passed: OK
[java]
[java] -----------------------------------------
[java] com/sun/jini/test/spec/javaspace/conformance/snapshot/SnapshotWriteTest.td
[java] Test Passed: OK
[java]
[java] -----------------------------------------
[java] com/sun/jini/test/impl/mahalo/AdminIFShutdownTest.td
[java] Test Passed: OK
[java]
[java] -----------------------------------------
[java] com/sun/jini/test/impl/mahalo/AdminIFTest.td
[java] Test Passed: OK
[java]
[java] -----------------------------------------
[java] com/sun/jini/test/impl/mahalo/LeaseExpireCancelTest.td
[java] Test Passed: OK
[java]
[java] -----------------------------------------
[java] com/sun/jini/test/impl/mahalo/LeaseExpireRenewTest.td
[java] Test Passed: OK
[java]
[java] -----------------------------------------
[java] com/sun/jini/test/impl/mahalo/LeaseMapTest.td
[java] Test Passed: OK
[java]
[java] -----------------------------------------
[java] com/sun/jini/test/impl/mahalo/LeaseTest.td
[java] Test Passed: OK
[java]
[java] -----------------------------------------
[java] com/sun/jini/test/impl/mahalo/MahaloCreateShutdownTest.td
[java] Test Passed: OK
[java]
[java] -----------------------------------------
[java] com/sun/jini/test/impl/mahalo/MahaloIFTest.td
[java] Test Passed: OK
[java]
[java] -----------------------------------------
[java] com/sun/jini/test/impl/mahalo/MahaloImplReadyStateTest.td
[java] Test Skipped: verifiers are: com.sun.jini.test.impl.mercury.ActivatableMercuryVerifier com.sun.jini.qa.harness.SkipConfigTestVerifier
[java] -----------------------------------------
[java] com/sun/jini/test/impl/mahalo/NestableServerTransactionCreatedToStringTest.td
[java] Test Passed: OK
[java]
[java] -----------------------------------------
[java] com/sun/jini/test/impl/mahalo/NestableTransactionCreatedToStringTest.td
[java] Test Passed: OK
[java]
[java] -----------------------------------------
[java] com/sun/jini/test/impl/mahalo/PrepareAndCommitExceptionTest.td
[java] Test Passed: OK
[java]
[java] -----------------------------------------
[java] com/sun/jini/test/impl/mahalo/PrepareAndCommitExceptionTest2.td
[java] Test Passed: OK
[java]
[java] -----------------------------------------
[java] com/sun/jini/test/impl/mahalo/PrepareAndCommitExceptionTest3.td
[java] Test Passed: OK
[java]
[java] -----------------------------------------
[java] com/sun/jini/test/impl/mahalo/PrepareAndCommitExceptionTest4.td
[java] Test Passed: OK
[java]
[java] -----------------------------------------
[java] com/sun/jini/test/impl/mahalo/PrepareAndCommitExceptionTest5.td
[java] Test Passed: OK
[java]
[java] -----------------------------------------
[java] com/sun/jini/test/impl/mahalo/RandomStressTest.td
[java] Test Passed: OK
[java]
[java] -----------------------------------------
[java] com/sun/jini/test/impl/mahalo/ServerTransactionEqualityTest.td
[java] Test Passed: OK
[java]
[java] -----------------------------------------
[java] com/sun/jini/test/impl/mahalo/ServerTransactionToStringTest.td
[java] Test Passed: OK
[java]
[java] -----------------------------------------
[java] com/sun/jini/test/impl/mahalo/TransactionCreatedToStringTest.td
[java] Test Passed: OK
[java]
[java] -----------------------------------------
[java] com/sun/jini/test/impl/mahalo/TransactionManagerCreatedToStringTest.td
[java] Test Passed: OK
[java]
[java] -----------------------------------------
[java] com/sun/jini/test/impl/mahalo/TxnMgrImplNullActivationConfigEntries.td
[java] Test Skipped: verifiers are: com.sun.jini.test.impl.mahalo.ActivatableMahaloVerifier
[java] -----------------------------------------
[java] com/sun/jini/test/impl/mahalo/TxnMgrImplNullConfigEntries.td
[java] Test Passed: OK
[java]
[java] -----------------------------------------
[java] com/sun/jini/test/impl/mahalo/TxnMgrImplNullRecoveredLocators.td
[java] Test Skipped: verifiers are: com.sun.jini.test.impl.mahalo.ActivatableMahaloVerifier
[java] -----------------------------------------
[java] com/sun/jini/test/impl/mahalo/TxnMgrProxyEqualityTest.td
[java] Test Passed: OK
[java]
[java] -----------------------------------------
[java] com/sun/jini/test/spec/txnmanager/AsynchAbortOnCommitTest.td
[java] Test Passed: OK
[java]
[java] -----------------------------------------
[java] com/sun/jini/test/spec/txnmanager/AsynchAbortOnPrepareTest.td
[java] Test Passed: OK
[java]
[java] -----------------------------------------
[java] com/sun/jini/test/spec/txnmanager/CommitExpiredTest.td
[java] Test Passed: OK
[java]
[java] -----------------------------------------
[java] com/sun/jini/test/spec/txnmanager/CommitTimeoutTest.td
[java] Test Passed: OK
[java]
[java] -----------------------------------------
[java] com/sun/jini/test/spec/txnmanager/GetStateTest.td
[java] Test Passed: OK
[java]
[java] -----------------------------------------
[java] com/sun/jini/test/spec/txnmanager/JoinIdempotentTest.td
[java] Test Passed: OK
[java]
[java] -----------------------------------------
[java] com/sun/jini/test/spec/txnmanager/JoinWhileActiveTest.td
[java] Test Passed: OK
[java]
[java] -----------------------------------------
[java] com/sun/jini/test/spec/txnmanager/ManyParticipantsTest.td
[java] Test Passed: OK
[java]
[java] -----------------------------------------
[java] com/sun/jini/test/spec/txnmanager/PrepareTimeoutTest.td
[java] Test Passed: OK
[java]
[java] -----------------------------------------
[java] com/sun/jini/test/spec/txnmanager/RollBackErrorTest.td
[java] Test Passed: OK
[java]
[java] -----------------------------------------
[java] com/sun/jini/test/spec/txnmanager/RollForwardErrorTest.td
[java] Test Passed: OK
[java]
[java] -----------------------------------------
[java] com/sun/jini/test/spec/txnmanager/TwoPhaseTest.td
[java] Test Passed: OK
[java]
[java] -----------------------------------------
[java]
[java] # of tests started = 1412
[java] # of tests completed = 1412
[java] # of tests skipped = 46
[java] # of tests passed = 1408
[java] # of tests failed = 4
[java]
[java] -----------------------------------------
[java]
[java] Date finished:
[java] Mon Feb 25 21:46:21 GMT+00:00 2013
[java] Time elapsed:
[java] 78245 seconds
[java]
[java] Java Result: 1
collect-result:
[copy] Copying 1 file to /zonestorage/hudson_solaris/home/hudson/hudson-slave/workspace/river-qa-refactoring-solaris/trunk/qa/result
[copy] Copying 1 file to /zonestorage/hudson_solaris/home/hudson/hudson-slave/workspace/river-qa-refactoring-solaris/trunk/qa/result
[zip] Building zip: /zonestorage/hudson_solaris/home/hudson/hudson-slave/workspace/river-qa-refactoring-solaris/trunk/qa/result/qaresults-x86-SunOS-1.6.0_26.zip
BUILD FAILED
/zonestorage/hudson_solaris/home/hudson/hudson-slave/workspace/river-qa-refactoring-solaris/trunk/build.xml:2093: The following error occurred while executing this line:
/zonestorage/hudson_solaris/home/hudson/hudson-slave/workspace/river-qa-refactoring-solaris/trunk/qa/build.xml:406: The following error occurred while executing this line:
/zonestorage/hudson_solaris/home/hudson/hudson-slave/workspace/river-qa-refactoring-solaris/trunk/qa/build.xml:380: condition satisfied
Total time: 1319 minutes 6 seconds
Build step 'Invoke Ant' marked build as failure
Archiving artifacts
Build failed in Jenkins: river-qa-refactoring-solaris #26
Posted by Apache Jenkins Server <je...@builds.apache.org>.
See <https://builds.apache.org/job/river-qa-refactoring-solaris/26/changes>
Changes:
[peter_firmstone] Refactoring of PreferredClassProvider and PreferredClassLoader, fixed ClassServer freeze when SecurityException is thrown.
Fixed SetLocatorsReplaceSome test when it inadvertantly gets an IP host instead of a string, which breaks the test.
[peter_firmstone] Refactoring of PreferredClassProvider and PreferredClassLoader, fixed ClassServer freeze when SecurityException is thrown.
Fixed SetLocatorsReplaceSome test when it inadvertantly gets an IP host instead of a string, which breaks the test.
[peter_firmstone] Reduce unnecessary locking, in an attempt to avoid ClassLoader deadlock on Freebsd.
------------------------------------------
[...truncated 8824 lines...]
[java] Test Passed: OK
[java]
[java] -----------------------------------------
[java] com/sun/jini/test/spec/javaspace/conformance/snapshot/SnapshotTransactionTakeIfExistsTest.td
[java] Test Passed: OK
[java]
[java] -----------------------------------------
[java] com/sun/jini/test/spec/javaspace/conformance/snapshot/SnapshotTransactionTakeIfExistsWaitTest.td
[java] Test Passed: OK
[java]
[java] -----------------------------------------
[java] com/sun/jini/test/spec/javaspace/conformance/snapshot/SnapshotTransactionTakeNO_WAITTest.td
[java] Test Passed: OK
[java]
[java] -----------------------------------------
[java] com/sun/jini/test/spec/javaspace/conformance/snapshot/SnapshotTransactionTakeReadTest.td
[java] Test Passed: OK
[java]
[java] -----------------------------------------
[java] com/sun/jini/test/spec/javaspace/conformance/snapshot/SnapshotTransactionTakeTest.td
[java] Test Passed: OK
[java]
[java] -----------------------------------------
[java] com/sun/jini/test/spec/javaspace/conformance/snapshot/SnapshotTransactionTakeWaitTest.td
[java] Test Passed: OK
[java]
[java] -----------------------------------------
[java] com/sun/jini/test/spec/javaspace/conformance/snapshot/SnapshotTransactionWriteLeaseANYTest.td
[java] Test Passed: OK
[java]
[java] -----------------------------------------
[java] com/sun/jini/test/spec/javaspace/conformance/snapshot/SnapshotTransactionWriteLeaseFOREVERTest.td
[java] Test Passed: OK
[java]
[java] -----------------------------------------
[java] com/sun/jini/test/spec/javaspace/conformance/snapshot/SnapshotTransactionWriteNegativeLeaseTest.td
[java] Test Passed: OK
[java]
[java] -----------------------------------------
[java] com/sun/jini/test/spec/javaspace/conformance/snapshot/SnapshotTransactionWriteTakeIfExistsNotifyTest.td
[java] Test Passed: OK
[java]
[java] -----------------------------------------
[java] com/sun/jini/test/spec/javaspace/conformance/snapshot/SnapshotTransactionWriteTakeIfExistsTest.td
[java] Test Passed: OK
[java]
[java] -----------------------------------------
[java] com/sun/jini/test/spec/javaspace/conformance/snapshot/SnapshotTransactionWriteTakeNotifyTest.td
[java] Test Passed: OK
[java]
[java] -----------------------------------------
[java] com/sun/jini/test/spec/javaspace/conformance/snapshot/SnapshotTransactionWriteTakeTest.td
[java] Test Passed: OK
[java]
[java] -----------------------------------------
[java] com/sun/jini/test/spec/javaspace/conformance/snapshot/SnapshotTransactionWriteTest.td
[java] Test Passed: OK
[java]
[java] -----------------------------------------
[java] com/sun/jini/test/spec/javaspace/conformance/snapshot/SnapshotWriteLeaseANYTest.td
[java] Test Passed: OK
[java]
[java] -----------------------------------------
[java] com/sun/jini/test/spec/javaspace/conformance/snapshot/SnapshotWriteLeaseFOREVERTest.td
[java] Test Passed: OK
[java]
[java] -----------------------------------------
[java] com/sun/jini/test/spec/javaspace/conformance/snapshot/SnapshotWriteNegativeLeaseTest.td
[java] Test Passed: OK
[java]
[java] -----------------------------------------
[java] com/sun/jini/test/spec/javaspace/conformance/snapshot/SnapshotWriteTest.td
[java] Test Passed: OK
[java]
[java] -----------------------------------------
[java] com/sun/jini/test/impl/mahalo/AdminIFShutdownTest.td
[java] Test Passed: OK
[java]
[java] -----------------------------------------
[java] com/sun/jini/test/impl/mahalo/AdminIFTest.td
[java] Test Passed: OK
[java]
[java] -----------------------------------------
[java] com/sun/jini/test/impl/mahalo/LeaseExpireCancelTest.td
[java] Test Passed: OK
[java]
[java] -----------------------------------------
[java] com/sun/jini/test/impl/mahalo/LeaseExpireRenewTest.td
[java] Test Passed: OK
[java]
[java] -----------------------------------------
[java] com/sun/jini/test/impl/mahalo/LeaseMapTest.td
[java] Test Passed: OK
[java]
[java] -----------------------------------------
[java] com/sun/jini/test/impl/mahalo/LeaseTest.td
[java] Test Passed: OK
[java]
[java] -----------------------------------------
[java] com/sun/jini/test/impl/mahalo/MahaloCreateShutdownTest.td
[java] Test Passed: OK
[java]
[java] -----------------------------------------
[java] com/sun/jini/test/impl/mahalo/MahaloIFTest.td
[java] Test Passed: OK
[java]
[java] -----------------------------------------
[java] com/sun/jini/test/impl/mahalo/MahaloImplReadyStateTest.td
[java] Test Skipped: verifiers are: com.sun.jini.test.impl.mercury.ActivatableMercuryVerifier com.sun.jini.qa.harness.SkipConfigTestVerifier
[java] -----------------------------------------
[java] com/sun/jini/test/impl/mahalo/NestableServerTransactionCreatedToStringTest.td
[java] Test Passed: OK
[java]
[java] -----------------------------------------
[java] com/sun/jini/test/impl/mahalo/NestableTransactionCreatedToStringTest.td
[java] Test Passed: OK
[java]
[java] -----------------------------------------
[java] com/sun/jini/test/impl/mahalo/PrepareAndCommitExceptionTest.td
[java] Test Passed: OK
[java]
[java] -----------------------------------------
[java] com/sun/jini/test/impl/mahalo/PrepareAndCommitExceptionTest2.td
[java] Test Passed: OK
[java]
[java] -----------------------------------------
[java] com/sun/jini/test/impl/mahalo/PrepareAndCommitExceptionTest3.td
[java] Test Passed: OK
[java]
[java] -----------------------------------------
[java] com/sun/jini/test/impl/mahalo/PrepareAndCommitExceptionTest4.td
[java] Test Passed: OK
[java]
[java] -----------------------------------------
[java] com/sun/jini/test/impl/mahalo/PrepareAndCommitExceptionTest5.td
[java] Test Passed: OK
[java]
[java] -----------------------------------------
[java] com/sun/jini/test/impl/mahalo/RandomStressTest.td
[java] Test Passed: OK
[java]
[java] -----------------------------------------
[java] com/sun/jini/test/impl/mahalo/ServerTransactionEqualityTest.td
[java] Test Passed: OK
[java]
[java] -----------------------------------------
[java] com/sun/jini/test/impl/mahalo/ServerTransactionToStringTest.td
[java] Test Passed: OK
[java]
[java] -----------------------------------------
[java] com/sun/jini/test/impl/mahalo/TransactionCreatedToStringTest.td
[java] Test Passed: OK
[java]
[java] -----------------------------------------
[java] com/sun/jini/test/impl/mahalo/TransactionManagerCreatedToStringTest.td
[java] Test Passed: OK
[java]
[java] -----------------------------------------
[java] com/sun/jini/test/impl/mahalo/TxnMgrImplNullActivationConfigEntries.td
[java] Test Skipped: verifiers are: com.sun.jini.test.impl.mahalo.ActivatableMahaloVerifier
[java] -----------------------------------------
[java] com/sun/jini/test/impl/mahalo/TxnMgrImplNullConfigEntries.td
[java] Test Passed: OK
[java]
[java] -----------------------------------------
[java] com/sun/jini/test/impl/mahalo/TxnMgrImplNullRecoveredLocators.td
[java] Test Skipped: verifiers are: com.sun.jini.test.impl.mahalo.ActivatableMahaloVerifier
[java] -----------------------------------------
[java] com/sun/jini/test/impl/mahalo/TxnMgrProxyEqualityTest.td
[java] Test Passed: OK
[java]
[java] -----------------------------------------
[java] com/sun/jini/test/spec/txnmanager/AsynchAbortOnCommitTest.td
[java] Test Passed: OK
[java]
[java] -----------------------------------------
[java] com/sun/jini/test/spec/txnmanager/AsynchAbortOnPrepareTest.td
[java] Test Passed: OK
[java]
[java] -----------------------------------------
[java] com/sun/jini/test/spec/txnmanager/CommitExpiredTest.td
[java] Test Passed: OK
[java]
[java] -----------------------------------------
[java] com/sun/jini/test/spec/txnmanager/CommitTimeoutTest.td
[java] Test Passed: OK
[java]
[java] -----------------------------------------
[java] com/sun/jini/test/spec/txnmanager/GetStateTest.td
[java] Test Passed: OK
[java]
[java] -----------------------------------------
[java] com/sun/jini/test/spec/txnmanager/JoinIdempotentTest.td
[java] Test Passed: OK
[java]
[java] -----------------------------------------
[java] com/sun/jini/test/spec/txnmanager/JoinWhileActiveTest.td
[java] Test Passed: OK
[java]
[java] -----------------------------------------
[java] com/sun/jini/test/spec/txnmanager/ManyParticipantsTest.td
[java] Test Passed: OK
[java]
[java] -----------------------------------------
[java] com/sun/jini/test/spec/txnmanager/PrepareTimeoutTest.td
[java] Test Passed: OK
[java]
[java] -----------------------------------------
[java] com/sun/jini/test/spec/txnmanager/RollBackErrorTest.td
[java] Test Passed: OK
[java]
[java] -----------------------------------------
[java] com/sun/jini/test/spec/txnmanager/RollForwardErrorTest.td
[java] Test Passed: OK
[java]
[java] -----------------------------------------
[java] com/sun/jini/test/spec/txnmanager/TwoPhaseTest.td
[java] Test Passed: OK
[java]
[java] -----------------------------------------
[java]
[java] # of tests started = 1412
[java] # of tests completed = 1412
[java] # of tests skipped = 46
[java] # of tests passed = 1410
[java] # of tests failed = 2
[java]
[java] -----------------------------------------
[java]
[java] Date finished:
[java] Sat Feb 23 00:42:34 GMT+00:00 2013
[java] Time elapsed:
[java] 78143 seconds
[java]
[java] Java Result: 1
collect-result:
[copy] Copying 1 file to /zonestorage/hudson_solaris/home/hudson/hudson-slave/workspace/river-qa-refactoring-solaris/trunk/qa/result
[copy] Copying 1 file to /zonestorage/hudson_solaris/home/hudson/hudson-slave/workspace/river-qa-refactoring-solaris/trunk/qa/result
[zip] Building zip: /zonestorage/hudson_solaris/home/hudson/hudson-slave/workspace/river-qa-refactoring-solaris/trunk/qa/result/qaresults-x86-SunOS-1.6.0_26.zip
BUILD FAILED
/zonestorage/hudson_solaris/home/hudson/hudson-slave/workspace/river-qa-refactoring-solaris/trunk/build.xml:2093: The following error occurred while executing this line:
/zonestorage/hudson_solaris/home/hudson/hudson-slave/workspace/river-qa-refactoring-solaris/trunk/qa/build.xml:406: The following error occurred while executing this line:
/zonestorage/hudson_solaris/home/hudson/hudson-slave/workspace/river-qa-refactoring-solaris/trunk/qa/build.xml:380: condition satisfied
Total time: 1313 minutes 52 seconds
Build step 'Invoke Ant' marked build as failure
Archiving artifacts
Build failed in Jenkins: river-qa-refactoring-solaris #23
Posted by Apache Jenkins Server <je...@builds.apache.org>.
See <https://builds.apache.org/job/river-qa-refactoring-solaris/23/>
------------------------------------------
[...truncated 8811 lines...]
[java] Test Passed: OK
[java]
[java] -----------------------------------------
[java] com/sun/jini/test/spec/javaspace/conformance/snapshot/SnapshotTransactionTakeIfExistsTest.td
[java] Test Passed: OK
[java]
[java] -----------------------------------------
[java] com/sun/jini/test/spec/javaspace/conformance/snapshot/SnapshotTransactionTakeIfExistsWaitTest.td
[java] Test Passed: OK
[java]
[java] -----------------------------------------
[java] com/sun/jini/test/spec/javaspace/conformance/snapshot/SnapshotTransactionTakeNO_WAITTest.td
[java] Test Passed: OK
[java]
[java] -----------------------------------------
[java] com/sun/jini/test/spec/javaspace/conformance/snapshot/SnapshotTransactionTakeReadTest.td
[java] Test Passed: OK
[java]
[java] -----------------------------------------
[java] com/sun/jini/test/spec/javaspace/conformance/snapshot/SnapshotTransactionTakeTest.td
[java] Test Passed: OK
[java]
[java] -----------------------------------------
[java] com/sun/jini/test/spec/javaspace/conformance/snapshot/SnapshotTransactionTakeWaitTest.td
[java] Test Passed: OK
[java]
[java] -----------------------------------------
[java] com/sun/jini/test/spec/javaspace/conformance/snapshot/SnapshotTransactionWriteLeaseANYTest.td
[java] Test Passed: OK
[java]
[java] -----------------------------------------
[java] com/sun/jini/test/spec/javaspace/conformance/snapshot/SnapshotTransactionWriteLeaseFOREVERTest.td
[java] Test Passed: OK
[java]
[java] -----------------------------------------
[java] com/sun/jini/test/spec/javaspace/conformance/snapshot/SnapshotTransactionWriteNegativeLeaseTest.td
[java] Test Passed: OK
[java]
[java] -----------------------------------------
[java] com/sun/jini/test/spec/javaspace/conformance/snapshot/SnapshotTransactionWriteTakeIfExistsNotifyTest.td
[java] Test Passed: OK
[java]
[java] -----------------------------------------
[java] com/sun/jini/test/spec/javaspace/conformance/snapshot/SnapshotTransactionWriteTakeIfExistsTest.td
[java] Test Passed: OK
[java]
[java] -----------------------------------------
[java] com/sun/jini/test/spec/javaspace/conformance/snapshot/SnapshotTransactionWriteTakeNotifyTest.td
[java] Test Passed: OK
[java]
[java] -----------------------------------------
[java] com/sun/jini/test/spec/javaspace/conformance/snapshot/SnapshotTransactionWriteTakeTest.td
[java] Test Passed: OK
[java]
[java] -----------------------------------------
[java] com/sun/jini/test/spec/javaspace/conformance/snapshot/SnapshotTransactionWriteTest.td
[java] Test Passed: OK
[java]
[java] -----------------------------------------
[java] com/sun/jini/test/spec/javaspace/conformance/snapshot/SnapshotWriteLeaseANYTest.td
[java] Test Passed: OK
[java]
[java] -----------------------------------------
[java] com/sun/jini/test/spec/javaspace/conformance/snapshot/SnapshotWriteLeaseFOREVERTest.td
[java] Test Passed: OK
[java]
[java] -----------------------------------------
[java] com/sun/jini/test/spec/javaspace/conformance/snapshot/SnapshotWriteNegativeLeaseTest.td
[java] Test Passed: OK
[java]
[java] -----------------------------------------
[java] com/sun/jini/test/spec/javaspace/conformance/snapshot/SnapshotWriteTest.td
[java] Test Passed: OK
[java]
[java] -----------------------------------------
[java] com/sun/jini/test/impl/mahalo/AdminIFShutdownTest.td
[java] Test Passed: OK
[java]
[java] -----------------------------------------
[java] com/sun/jini/test/impl/mahalo/AdminIFTest.td
[java] Test Passed: OK
[java]
[java] -----------------------------------------
[java] com/sun/jini/test/impl/mahalo/LeaseExpireCancelTest.td
[java] Test Passed: OK
[java]
[java] -----------------------------------------
[java] com/sun/jini/test/impl/mahalo/LeaseExpireRenewTest.td
[java] Test Passed: OK
[java]
[java] -----------------------------------------
[java] com/sun/jini/test/impl/mahalo/LeaseMapTest.td
[java] Test Passed: OK
[java]
[java] -----------------------------------------
[java] com/sun/jini/test/impl/mahalo/LeaseTest.td
[java] Test Passed: OK
[java]
[java] -----------------------------------------
[java] com/sun/jini/test/impl/mahalo/MahaloCreateShutdownTest.td
[java] Test Passed: OK
[java]
[java] -----------------------------------------
[java] com/sun/jini/test/impl/mahalo/MahaloIFTest.td
[java] Test Passed: OK
[java]
[java] -----------------------------------------
[java] com/sun/jini/test/impl/mahalo/MahaloImplReadyStateTest.td
[java] Test Skipped: verifiers are: com.sun.jini.test.impl.mercury.ActivatableMercuryVerifier com.sun.jini.qa.harness.SkipConfigTestVerifier
[java] -----------------------------------------
[java] com/sun/jini/test/impl/mahalo/NestableServerTransactionCreatedToStringTest.td
[java] Test Passed: OK
[java]
[java] -----------------------------------------
[java] com/sun/jini/test/impl/mahalo/NestableTransactionCreatedToStringTest.td
[java] Test Passed: OK
[java]
[java] -----------------------------------------
[java] com/sun/jini/test/impl/mahalo/PrepareAndCommitExceptionTest.td
[java] Test Passed: OK
[java]
[java] -----------------------------------------
[java] com/sun/jini/test/impl/mahalo/PrepareAndCommitExceptionTest2.td
[java] Test Passed: OK
[java]
[java] -----------------------------------------
[java] com/sun/jini/test/impl/mahalo/PrepareAndCommitExceptionTest3.td
[java] Test Passed: OK
[java]
[java] -----------------------------------------
[java] com/sun/jini/test/impl/mahalo/PrepareAndCommitExceptionTest4.td
[java] Test Passed: OK
[java]
[java] -----------------------------------------
[java] com/sun/jini/test/impl/mahalo/PrepareAndCommitExceptionTest5.td
[java] Test Passed: OK
[java]
[java] -----------------------------------------
[java] com/sun/jini/test/impl/mahalo/RandomStressTest.td
[java] Test Passed: OK
[java]
[java] -----------------------------------------
[java] com/sun/jini/test/impl/mahalo/ServerTransactionEqualityTest.td
[java] Test Passed: OK
[java]
[java] -----------------------------------------
[java] com/sun/jini/test/impl/mahalo/ServerTransactionToStringTest.td
[java] Test Passed: OK
[java]
[java] -----------------------------------------
[java] com/sun/jini/test/impl/mahalo/TransactionCreatedToStringTest.td
[java] Test Passed: OK
[java]
[java] -----------------------------------------
[java] com/sun/jini/test/impl/mahalo/TransactionManagerCreatedToStringTest.td
[java] Test Passed: OK
[java]
[java] -----------------------------------------
[java] com/sun/jini/test/impl/mahalo/TxnMgrImplNullActivationConfigEntries.td
[java] Test Skipped: verifiers are: com.sun.jini.test.impl.mahalo.ActivatableMahaloVerifier
[java] -----------------------------------------
[java] com/sun/jini/test/impl/mahalo/TxnMgrImplNullConfigEntries.td
[java] Test Passed: OK
[java]
[java] -----------------------------------------
[java] com/sun/jini/test/impl/mahalo/TxnMgrImplNullRecoveredLocators.td
[java] Test Skipped: verifiers are: com.sun.jini.test.impl.mahalo.ActivatableMahaloVerifier
[java] -----------------------------------------
[java] com/sun/jini/test/impl/mahalo/TxnMgrProxyEqualityTest.td
[java] Test Passed: OK
[java]
[java] -----------------------------------------
[java] com/sun/jini/test/spec/txnmanager/AsynchAbortOnCommitTest.td
[java] Test Passed: OK
[java]
[java] -----------------------------------------
[java] com/sun/jini/test/spec/txnmanager/AsynchAbortOnPrepareTest.td
[java] Test Passed: OK
[java]
[java] -----------------------------------------
[java] com/sun/jini/test/spec/txnmanager/CommitExpiredTest.td
[java] Test Passed: OK
[java]
[java] -----------------------------------------
[java] com/sun/jini/test/spec/txnmanager/CommitTimeoutTest.td
[java] Test Passed: OK
[java]
[java] -----------------------------------------
[java] com/sun/jini/test/spec/txnmanager/GetStateTest.td
[java] Test Passed: OK
[java]
[java] -----------------------------------------
[java] com/sun/jini/test/spec/txnmanager/JoinIdempotentTest.td
[java] Test Passed: OK
[java]
[java] -----------------------------------------
[java] com/sun/jini/test/spec/txnmanager/JoinWhileActiveTest.td
[java] Test Passed: OK
[java]
[java] -----------------------------------------
[java] com/sun/jini/test/spec/txnmanager/ManyParticipantsTest.td
[java] Test Passed: OK
[java]
[java] -----------------------------------------
[java] com/sun/jini/test/spec/txnmanager/PrepareTimeoutTest.td
[java] Test Passed: OK
[java]
[java] -----------------------------------------
[java] com/sun/jini/test/spec/txnmanager/RollBackErrorTest.td
[java] Test Passed: OK
[java]
[java] -----------------------------------------
[java] com/sun/jini/test/spec/txnmanager/RollForwardErrorTest.td
[java] Test Passed: OK
[java]
[java] -----------------------------------------
[java] com/sun/jini/test/spec/txnmanager/TwoPhaseTest.td
[java] Test Passed: OK
[java]
[java] -----------------------------------------
[java]
[java] # of tests started = 1412
[java] # of tests completed = 1412
[java] # of tests skipped = 46
[java] # of tests passed = 1397
[java] # of tests failed = 15
[java]
[java] -----------------------------------------
[java]
[java] Date finished:
[java] Thu Feb 21 23:14:49 GMT+00:00 2013
[java] Time elapsed:
[java] 80186 seconds
[java]
[java] Java Result: 1
collect-result:
[copy] Copying 1 file to /zonestorage/hudson_solaris/home/hudson/hudson-slave/workspace/river-qa-refactoring-solaris/trunk/qa/result
[copy] Copying 1 file to /zonestorage/hudson_solaris/home/hudson/hudson-slave/workspace/river-qa-refactoring-solaris/trunk/qa/result
[zip] Building zip: /zonestorage/hudson_solaris/home/hudson/hudson-slave/workspace/river-qa-refactoring-solaris/trunk/qa/result/qaresults-x86-SunOS-1.6.0_26.zip
BUILD FAILED
/zonestorage/hudson_solaris/home/hudson/hudson-slave/workspace/river-qa-refactoring-solaris/trunk/build.xml:2093: The following error occurred while executing this line:
/zonestorage/hudson_solaris/home/hudson/hudson-slave/workspace/river-qa-refactoring-solaris/trunk/qa/build.xml:406: The following error occurred while executing this line:
/zonestorage/hudson_solaris/home/hudson/hudson-slave/workspace/river-qa-refactoring-solaris/trunk/qa/build.xml:380: condition satisfied
Total time: 1345 minutes 39 seconds
Build step 'Invoke Ant' marked build as failure
Archiving artifacts
Build failed in Jenkins: river-qa-refactoring-solaris #22
Posted by Apache Jenkins Server <je...@builds.apache.org>.
See <https://builds.apache.org/job/river-qa-refactoring-solaris/22/changes>
Changes:
[peter_firmstone] Fix NPE
[peter_firmstone] On some platforms an unknown domain doesn't cause an UnknownHostException to be thrown, check the domain exists before returning hostname.
------------------------------------------
[...truncated 948 lines...]
jsk-debug-policy.jar:
[jar] Building jar: /zonestorage/hudson_solaris/home/hudson/hudson-slave/workspace/river-qa-refactoring-solaris/trunk/lib-ext/jsk-debug-policy.jar
preferredlistgen.jar:
envcheck.jar:
[jar] Updating jar: /zonestorage/hudson_solaris/home/hudson/hudson-slave/workspace/river-qa-refactoring-solaris/trunk/lib/envcheck.jar
toolswrappers.jars:
destroy.jar:
[java] Warning: Class not found: au.net.zeus.collection.RC
[java] Warning: Class not found: au.net.zeus.collection.Ref
[jar] Building jar: /zonestorage/hudson_solaris/home/hudson/hudson-slave/workspace/river-qa-refactoring-solaris/trunk/lib/destroy.jar
fiddler.jar:
[jar] Building jar: /zonestorage/hudson_solaris/home/hudson/hudson-slave/workspace/river-qa-refactoring-solaris/trunk/lib/fiddler.jar
fiddler-dl.jar:
[jar] Building jar: /zonestorage/hudson_solaris/home/hudson/hudson-slave/workspace/river-qa-refactoring-solaris/trunk/lib-dl/fiddler-dl.jar
group.jar:
[jar] Building jar: /zonestorage/hudson_solaris/home/hudson/hudson-slave/workspace/river-qa-refactoring-solaris/trunk/lib/group.jar
group-dl.jar:
[jar] Building jar: /zonestorage/hudson_solaris/home/hudson/hudson-slave/workspace/river-qa-refactoring-solaris/trunk/lib-dl/group-dl.jar
[java] Warning: Nested class Transaction$Created has different preferred state than outer class Transaction
[java] Warning: Nested class LookupLocator$1 has different preferred state than outer class LookupLocator
mahalo.jar:
[jar] Building jar: /zonestorage/hudson_solaris/home/hudson/hudson-slave/workspace/river-qa-refactoring-solaris/trunk/lib/mahalo.jar
mahalo-dl.jar:
[jar] Building jar: /zonestorage/hudson_solaris/home/hudson/hudson-slave/workspace/river-qa-refactoring-solaris/trunk/lib-dl/mahalo-dl.jar
mercury.jar:
[jar] Building jar: /zonestorage/hudson_solaris/home/hudson/hudson-slave/workspace/river-qa-refactoring-solaris/trunk/lib/mercury.jar
mercury-dl.jar:
[jar] Building jar: /zonestorage/hudson_solaris/home/hudson/hudson-slave/workspace/river-qa-refactoring-solaris/trunk/lib-dl/mercury-dl.jar
norm.jar:
[jar] Building jar: /zonestorage/hudson_solaris/home/hudson/hudson-slave/workspace/river-qa-refactoring-solaris/trunk/lib/norm.jar
norm-dl.jar:
[jar] Building jar: /zonestorage/hudson_solaris/home/hudson/hudson-slave/workspace/river-qa-refactoring-solaris/trunk/lib-dl/norm-dl.jar
outrigger-snaplogstore.jar:
[jar] Building jar: /zonestorage/hudson_solaris/home/hudson/hudson-slave/workspace/river-qa-refactoring-solaris/trunk/lib/outrigger-snaplogstore.jar
outrigger.jar:
[jar] Building jar: /zonestorage/hudson_solaris/home/hudson/hudson-slave/workspace/river-qa-refactoring-solaris/trunk/lib/outrigger.jar
outrigger-dl.jar:
[jar] Building jar: /zonestorage/hudson_solaris/home/hudson/hudson-slave/workspace/river-qa-refactoring-solaris/trunk/lib-dl/outrigger-dl.jar
phoenix.jar:
[jar] Building jar: /zonestorage/hudson_solaris/home/hudson/hudson-slave/workspace/river-qa-refactoring-solaris/trunk/lib/phoenix.jar
phoenix-dl.jar:
[jar] Building jar: /zonestorage/hudson_solaris/home/hudson/hudson-slave/workspace/river-qa-refactoring-solaris/trunk/lib-dl/phoenix-dl.jar
phoenix-group.jar:
[jar] Building jar: /zonestorage/hudson_solaris/home/hudson/hudson-slave/workspace/river-qa-refactoring-solaris/trunk/lib/phoenix-group.jar
phoenix-init.jar:
[jar] Building jar: /zonestorage/hudson_solaris/home/hudson/hudson-slave/workspace/river-qa-refactoring-solaris/trunk/lib/phoenix-init.jar
reggie.jar:
[jar] Building jar: /zonestorage/hudson_solaris/home/hudson/hudson-slave/workspace/river-qa-refactoring-solaris/trunk/lib/reggie.jar
reggie-dl.jar:
[jar] Building jar: /zonestorage/hudson_solaris/home/hudson/hudson-slave/workspace/river-qa-refactoring-solaris/trunk/lib-dl/reggie-dl.jar
serviceui.jar:
[jar] Building jar: /zonestorage/hudson_solaris/home/hudson/hudson-slave/workspace/river-qa-refactoring-solaris/trunk/lib/serviceui.jar
sharedvm.jar:
[java] Warning: Class not found: au.net.zeus.collection.RC
[java] Warning: Class not found: au.net.zeus.collection.Ref
[jar] Building jar: /zonestorage/hudson_solaris/home/hudson/hudson-slave/workspace/river-qa-refactoring-solaris/trunk/lib/sharedvm.jar
start.jar:
[java] Warning: Class not found: au.net.zeus.collection.RC
[java] Warning: Class not found: au.net.zeus.collection.Ref
[jar] Building jar: /zonestorage/hudson_solaris/home/hudson/hudson-slave/workspace/river-qa-refactoring-solaris/trunk/lib/start.jar
services.jars:
extra.jar:
[jar] Building jar: /zonestorage/hudson_solaris/home/hudson/hudson-slave/workspace/river-qa-refactoring-solaris/trunk/lib/extra.jar
browser.jar:
[jar] Building jar: /zonestorage/hudson_solaris/home/hudson/hudson-slave/workspace/river-qa-refactoring-solaris/trunk/lib/browser.jar
browser-dl.jar:
[jar] Building jar: /zonestorage/hudson_solaris/home/hudson/hudson-slave/workspace/river-qa-refactoring-solaris/trunk/lib-dl/browser-dl.jar
[java] Warning: Nested class LookupLocator$1 has different preferred state than outer class LookupLocator
[java] Warning: Nested class Transaction$Created has different preferred state than outer class Transaction
browser.jars:
jars:
river-runtime:
[touch] Creating /zonestorage/hudson_solaris/home/hudson/hudson-slave/workspace/river-qa-refactoring-solaris/trunk/qa/riverruntimelastbuild
prep:
[mkdir] Created dir: /zonestorage/hudson_solaris/home/hudson/hudson-slave/workspace/river-qa-refactoring-solaris/trunk/qa/build
[mkdir] Created dir: /zonestorage/hudson_solaris/home/hudson/hudson-slave/workspace/river-qa-refactoring-solaris/trunk/qa/build/classes
[mkdir] Created dir: /zonestorage/hudson_solaris/home/hudson/hudson-slave/workspace/river-qa-refactoring-solaris/trunk/qa/build/deps
[mkdir] Created dir: /zonestorage/hudson_solaris/home/hudson/hudson-slave/workspace/river-qa-refactoring-solaris/trunk/qa/lib
[mkdir] Created dir: /zonestorage/hudson_solaris/home/hudson/hudson-slave/workspace/river-qa-refactoring-solaris/trunk/qa/lib-ext
copy-resources:
[copy] Copying 1806 files to /zonestorage/hudson_solaris/home/hudson/hudson-slave/workspace/river-qa-refactoring-solaris/trunk/qa/build/classes
compile:
[javac] Compiling 2003 source files to /zonestorage/hudson_solaris/home/hudson/hudson-slave/workspace/river-qa-refactoring-solaris/trunk/qa/build/classes
[javac] /zonestorage/hudson_solaris/home/hudson/hudson-slave/workspace/river-qa-refactoring-solaris/trunk/qa/src/com/sun/jini/test/impl/reggie/NameServiceDescriptorImpl.java:20: warning: sun.net.spi.nameservice.NameService is Sun proprietary API and may be removed in a future release
[javac] import sun.net.spi.nameservice.NameService;
[javac] ^
[javac] /zonestorage/hudson_solaris/home/hudson/hudson-slave/workspace/river-qa-refactoring-solaris/trunk/qa/src/com/sun/jini/test/impl/reggie/NameServiceDescriptorImpl.java:21: warning: sun.net.spi.nameservice.NameServiceDescriptor is Sun proprietary API and may be removed in a future release
[javac] import sun.net.spi.nameservice.NameServiceDescriptor;
[javac] ^
[javac] /zonestorage/hudson_solaris/home/hudson/hudson-slave/workspace/river-qa-refactoring-solaris/trunk/qa/src/com/sun/jini/test/impl/reggie/NameServiceDescriptorImpl.java:23: warning: sun.net.spi.nameservice.NameServiceDescriptor is Sun proprietary API and may be removed in a future release
[javac] public class NameServiceDescriptorImpl implements NameServiceDescriptor {
[javac] ^
[javac] /zonestorage/hudson_solaris/home/hudson/hudson-slave/workspace/river-qa-refactoring-solaris/trunk/qa/src/com/sun/jini/test/impl/reggie/NameServiceDescriptorImpl.java:24: warning: sun.net.spi.nameservice.NameService is Sun proprietary API and may be removed in a future release
[javac] public NameService createNameService() {return new NameServiceImpl(); }
[javac] ^
[javac] /zonestorage/hudson_solaris/home/hudson/hudson-slave/workspace/river-qa-refactoring-solaris/trunk/qa/src/com/sun/jini/test/impl/reggie/NameServiceImpl.java:22: warning: sun.net.spi.nameservice.NameService is Sun proprietary API and may be removed in a future release
[javac] import sun.net.spi.nameservice.NameService;
[javac] ^
[javac] /zonestorage/hudson_solaris/home/hudson/hudson-slave/workspace/river-qa-refactoring-solaris/trunk/qa/src/com/sun/jini/test/impl/reggie/NameServiceImpl.java:29: warning: sun.net.spi.nameservice.NameService is Sun proprietary API and may be removed in a future release
[javac] public class NameServiceImpl implements NameService {
[javac] ^
[javac] /zonestorage/hudson_solaris/home/hudson/hudson-slave/workspace/river-qa-refactoring-solaris/trunk/qa/src/com/sun/jini/test/impl/start/SharedActivationGroupDescriptorTest2.java:32: warning: sun.security.action.GetIntegerAction is Sun proprietary API and may be removed in a future release
[javac] import sun.security.action.GetIntegerAction;
[javac] ^
[javac] /zonestorage/hudson_solaris/home/hudson/hudson-slave/workspace/river-qa-refactoring-solaris/trunk/qa/src/com/sun/jini/test/spec/activation/activationgroup/Constructor_AccessorTest.java:30: warning: sun.rmi.server.UnicastServerRef is Sun proprietary API and may be removed in a future release
[javac] import sun.rmi.server.UnicastServerRef;
[javac] ^
[javac] /zonestorage/hudson_solaris/home/hudson/hudson-slave/workspace/river-qa-refactoring-solaris/trunk/qa/src/com/sun/jini/test/impl/start/SharedActivationGroupDescriptorTest2.java:156: warning: sun.security.action.GetIntegerAction is Sun proprietary API and may be removed in a future release
[javac] new GetIntegerAction("java.rmi.activation.port",
[javac] ^
[javac] /zonestorage/hudson_solaris/home/hudson/hudson-slave/workspace/river-qa-refactoring-solaris/trunk/qa/src/com/sun/jini/test/spec/activation/activationgroup/Constructor_AccessorTest.java:69: warning: sun.rmi.server.UnicastServerRef is Sun proprietary API and may be removed in a future release
[javac] assertion(ref instanceof UnicastServerRef,
[javac] ^
[javac] Note: Some input files use or override a deprecated API.
[javac] Note: Recompile with -Xlint:deprecation for details.
[javac] Note: Some input files use unchecked or unsafe operations.
[javac] Note: Recompile with -Xlint:unchecked for details.
[javac] 10 warnings
harness-killer.stubs:
[rmic] RMI Compiling 1 class to /zonestorage/hudson_solaris/home/hudson/hudson-slave/workspace/river-qa-refactoring-solaris/trunk/qa/build/classes
nonactivatablegroup.stubs:
[rmic] RMI Compiling 1 class to /zonestorage/hudson_solaris/home/hudson/hudson-slave/workspace/river-qa-refactoring-solaris/trunk/qa/build/classes
qa1-fiddler.stubs:
[rmic] RMI Compiling 2 classes to /zonestorage/hudson_solaris/home/hudson/hudson-slave/workspace/river-qa-refactoring-solaris/trunk/qa/build/classes
qa1-joinmanager.stubs:
[rmic] RMI Compiling 1 class to /zonestorage/hudson_solaris/home/hudson/hudson-slave/workspace/river-qa-refactoring-solaris/trunk/qa/build/classes
qa1-mercury.stubs:
[rmic] RMI Compiling 5 classes to /zonestorage/hudson_solaris/home/hudson/hudson-slave/workspace/river-qa-refactoring-solaris/trunk/qa/build/classes
qa1-norm.stubs:
[rmic] RMI Compiling 2 classes to /zonestorage/hudson_solaris/home/hudson/hudson-slave/workspace/river-qa-refactoring-solaris/trunk/qa/build/classes
qa1-outrigger.stubs:
[rmic] RMI Compiling 6 classes to /zonestorage/hudson_solaris/home/hudson/hudson-slave/workspace/river-qa-refactoring-solaris/trunk/qa/build/classes
qa1-start.stubs:
[rmic] RMI Compiling 3 classes to /zonestorage/hudson_solaris/home/hudson/hudson-slave/workspace/river-qa-refactoring-solaris/trunk/qa/build/classes
qa1-lookup-simulator.stubs:
[rmic] RMI Compiling 1 class to /zonestorage/hudson_solaris/home/hudson/hudson-slave/workspace/river-qa-refactoring-solaris/trunk/qa/build/classes
qa1-share.stubs:
[rmic] RMI Compiling 5 classes to /zonestorage/hudson_solaris/home/hudson/hudson-slave/workspace/river-qa-refactoring-solaris/trunk/qa/build/classes
qa1-discoveryservice.stubs:
[rmic] RMI Compiling 1 class to /zonestorage/hudson_solaris/home/hudson/hudson-slave/workspace/river-qa-refactoring-solaris/trunk/qa/build/classes
qa1-javaspace.stubs:
[rmic] RMI Compiling 3 classes to /zonestorage/hudson_solaris/home/hudson/hudson-slave/workspace/river-qa-refactoring-solaris/trunk/qa/build/classes
qa1-lookupservice.stubs:
[rmic] RMI Compiling 26 classes to /zonestorage/hudson_solaris/home/hudson/hudson-slave/workspace/river-qa-refactoring-solaris/trunk/qa/build/classes
qa1-renewalservice.stubs:
[rmic] RMI Compiling 1 class to /zonestorage/hudson_solaris/home/hudson/hudson-slave/workspace/river-qa-refactoring-solaris/trunk/qa/build/classes
jrmp.stubs:
[rmic] RMI Compiling 1 class to /zonestorage/hudson_solaris/home/hudson/hudson-slave/workspace/river-qa-refactoring-solaris/trunk/qa/build/classes
[rmic] IIOP has been turned on.
iiop.stubs:
[rmic] RMI Compiling 1 class to /zonestorage/hudson_solaris/home/hudson/hudson-slave/workspace/river-qa-refactoring-solaris/trunk/qa/build/classes
[rmic] IIOP has been turned on.
stubs:
are-keystores-available:
keystores:
[echo] creating keystores
[genkey] Generating Key for tester
[exec] Certificate stored in file </zonestorage/hudson_solaris/home/hudson/hudson-slave/workspace/river-qa-refactoring-solaris/trunk/qa/harness/trust/tester.cert>
[genkey] Generating Key for reggie
[exec] Certificate stored in file </zonestorage/hudson_solaris/home/hudson/hudson-slave/workspace/river-qa-refactoring-solaris/trunk/qa/harness/trust/reggie.cert>
[genkey] Generating Key for phoenix
[exec] Certificate stored in file </zonestorage/hudson_solaris/home/hudson/hudson-slave/workspace/river-qa-refactoring-solaris/trunk/qa/harness/trust/phoenix.cert>
[genkey] Generating Key for mercury
[exec] Certificate stored in file </zonestorage/hudson_solaris/home/hudson/hudson-slave/workspace/river-qa-refactoring-solaris/trunk/qa/harness/trust/mercury.cert>
[genkey] Generating Key for norm
[exec] Certificate stored in file </zonestorage/hudson_solaris/home/hudson/hudson-slave/workspace/river-qa-refactoring-solaris/trunk/qa/harness/trust/norm.cert>
[genkey] Generating Key for outrigger
[exec] Certificate stored in file </zonestorage/hudson_solaris/home/hudson/hudson-slave/workspace/river-qa-refactoring-solaris/trunk/qa/harness/trust/outrigger.cert>
[genkey] Generating Key for mahalo
[exec] Certificate stored in file </zonestorage/hudson_solaris/home/hudson/hudson-slave/workspace/river-qa-refactoring-solaris/trunk/qa/harness/trust/mahalo.cert>
[genkey] Generating Key for fiddler
[exec] Certificate stored in file </zonestorage/hudson_solaris/home/hudson/hudson-slave/workspace/river-qa-refactoring-solaris/trunk/qa/harness/trust/fiddler.cert>
[genkey] Generating Key for group
[exec] Certificate stored in file </zonestorage/hudson_solaris/home/hudson/hudson-slave/workspace/river-qa-refactoring-solaris/trunk/qa/harness/trust/group.cert>
are-passwords-available:
password:
[echo] creating passwords
truststore:
[exec] Certificate was added to keystore
[exec] Certificate was added to keystore
[exec] Certificate was added to keystore
[exec] keytool error: java.security.SignatureException: Signature does not match.
BUILD FAILED
/zonestorage/hudson_solaris/home/hudson/hudson-slave/workspace/river-qa-refactoring-solaris/trunk/build.xml:2093: The following error occurred while executing this line:
/zonestorage/hudson_solaris/home/hudson/hudson-slave/workspace/river-qa-refactoring-solaris/trunk/qa/build.xml:2185: The following error occurred while executing this line:
/zonestorage/hudson_solaris/home/hudson/hudson-slave/workspace/river-qa-refactoring-solaris/trunk/common.xml:272: exec returned: 1
Total time: 3 minutes 41 seconds
Build step 'Invoke Ant' marked build as failure
Archiving artifacts
Build failed in Jenkins: river-qa-refactoring-solaris #21
Posted by Apache Jenkins Server <je...@builds.apache.org>.
See <https://builds.apache.org/job/river-qa-refactoring-solaris/21/changes>
Changes:
[peter_firmstone] Minor refactoring
------------------------------------------
[...truncated 8817 lines...]
[java] Test Passed: OK
[java]
[java] -----------------------------------------
[java] com/sun/jini/test/spec/javaspace/conformance/snapshot/SnapshotTransactionTakeIfExistsTest.td
[java] Test Passed: OK
[java]
[java] -----------------------------------------
[java] com/sun/jini/test/spec/javaspace/conformance/snapshot/SnapshotTransactionTakeIfExistsWaitTest.td
[java] Test Passed: OK
[java]
[java] -----------------------------------------
[java] com/sun/jini/test/spec/javaspace/conformance/snapshot/SnapshotTransactionTakeNO_WAITTest.td
[java] Test Passed: OK
[java]
[java] -----------------------------------------
[java] com/sun/jini/test/spec/javaspace/conformance/snapshot/SnapshotTransactionTakeReadTest.td
[java] Test Passed: OK
[java]
[java] -----------------------------------------
[java] com/sun/jini/test/spec/javaspace/conformance/snapshot/SnapshotTransactionTakeTest.td
[java] Test Passed: OK
[java]
[java] -----------------------------------------
[java] com/sun/jini/test/spec/javaspace/conformance/snapshot/SnapshotTransactionTakeWaitTest.td
[java] Test Passed: OK
[java]
[java] -----------------------------------------
[java] com/sun/jini/test/spec/javaspace/conformance/snapshot/SnapshotTransactionWriteLeaseANYTest.td
[java] Test Passed: OK
[java]
[java] -----------------------------------------
[java] com/sun/jini/test/spec/javaspace/conformance/snapshot/SnapshotTransactionWriteLeaseFOREVERTest.td
[java] Test Passed: OK
[java]
[java] -----------------------------------------
[java] com/sun/jini/test/spec/javaspace/conformance/snapshot/SnapshotTransactionWriteNegativeLeaseTest.td
[java] Test Passed: OK
[java]
[java] -----------------------------------------
[java] com/sun/jini/test/spec/javaspace/conformance/snapshot/SnapshotTransactionWriteTakeIfExistsNotifyTest.td
[java] Test Passed: OK
[java]
[java] -----------------------------------------
[java] com/sun/jini/test/spec/javaspace/conformance/snapshot/SnapshotTransactionWriteTakeIfExistsTest.td
[java] Test Passed: OK
[java]
[java] -----------------------------------------
[java] com/sun/jini/test/spec/javaspace/conformance/snapshot/SnapshotTransactionWriteTakeNotifyTest.td
[java] Test Passed: OK
[java]
[java] -----------------------------------------
[java] com/sun/jini/test/spec/javaspace/conformance/snapshot/SnapshotTransactionWriteTakeTest.td
[java] Test Passed: OK
[java]
[java] -----------------------------------------
[java] com/sun/jini/test/spec/javaspace/conformance/snapshot/SnapshotTransactionWriteTest.td
[java] Test Passed: OK
[java]
[java] -----------------------------------------
[java] com/sun/jini/test/spec/javaspace/conformance/snapshot/SnapshotWriteLeaseANYTest.td
[java] Test Passed: OK
[java]
[java] -----------------------------------------
[java] com/sun/jini/test/spec/javaspace/conformance/snapshot/SnapshotWriteLeaseFOREVERTest.td
[java] Test Passed: OK
[java]
[java] -----------------------------------------
[java] com/sun/jini/test/spec/javaspace/conformance/snapshot/SnapshotWriteNegativeLeaseTest.td
[java] Test Passed: OK
[java]
[java] -----------------------------------------
[java] com/sun/jini/test/spec/javaspace/conformance/snapshot/SnapshotWriteTest.td
[java] Test Passed: OK
[java]
[java] -----------------------------------------
[java] com/sun/jini/test/impl/mahalo/AdminIFShutdownTest.td
[java] Test Passed: OK
[java]
[java] -----------------------------------------
[java] com/sun/jini/test/impl/mahalo/AdminIFTest.td
[java] Test Passed: OK
[java]
[java] -----------------------------------------
[java] com/sun/jini/test/impl/mahalo/LeaseExpireCancelTest.td
[java] Test Passed: OK
[java]
[java] -----------------------------------------
[java] com/sun/jini/test/impl/mahalo/LeaseExpireRenewTest.td
[java] Test Passed: OK
[java]
[java] -----------------------------------------
[java] com/sun/jini/test/impl/mahalo/LeaseMapTest.td
[java] Test Passed: OK
[java]
[java] -----------------------------------------
[java] com/sun/jini/test/impl/mahalo/LeaseTest.td
[java] Test Passed: OK
[java]
[java] -----------------------------------------
[java] com/sun/jini/test/impl/mahalo/MahaloCreateShutdownTest.td
[java] Test Passed: OK
[java]
[java] -----------------------------------------
[java] com/sun/jini/test/impl/mahalo/MahaloIFTest.td
[java] Test Passed: OK
[java]
[java] -----------------------------------------
[java] com/sun/jini/test/impl/mahalo/MahaloImplReadyStateTest.td
[java] Test Skipped: verifiers are: com.sun.jini.test.impl.mercury.ActivatableMercuryVerifier com.sun.jini.qa.harness.SkipConfigTestVerifier
[java] -----------------------------------------
[java] com/sun/jini/test/impl/mahalo/NestableServerTransactionCreatedToStringTest.td
[java] Test Passed: OK
[java]
[java] -----------------------------------------
[java] com/sun/jini/test/impl/mahalo/NestableTransactionCreatedToStringTest.td
[java] Test Passed: OK
[java]
[java] -----------------------------------------
[java] com/sun/jini/test/impl/mahalo/PrepareAndCommitExceptionTest.td
[java] Test Passed: OK
[java]
[java] -----------------------------------------
[java] com/sun/jini/test/impl/mahalo/PrepareAndCommitExceptionTest2.td
[java] Test Passed: OK
[java]
[java] -----------------------------------------
[java] com/sun/jini/test/impl/mahalo/PrepareAndCommitExceptionTest3.td
[java] Test Passed: OK
[java]
[java] -----------------------------------------
[java] com/sun/jini/test/impl/mahalo/PrepareAndCommitExceptionTest4.td
[java] Test Passed: OK
[java]
[java] -----------------------------------------
[java] com/sun/jini/test/impl/mahalo/PrepareAndCommitExceptionTest5.td
[java] Test Passed: OK
[java]
[java] -----------------------------------------
[java] com/sun/jini/test/impl/mahalo/RandomStressTest.td
[java] Test Passed: OK
[java]
[java] -----------------------------------------
[java] com/sun/jini/test/impl/mahalo/ServerTransactionEqualityTest.td
[java] Test Passed: OK
[java]
[java] -----------------------------------------
[java] com/sun/jini/test/impl/mahalo/ServerTransactionToStringTest.td
[java] Test Passed: OK
[java]
[java] -----------------------------------------
[java] com/sun/jini/test/impl/mahalo/TransactionCreatedToStringTest.td
[java] Test Passed: OK
[java]
[java] -----------------------------------------
[java] com/sun/jini/test/impl/mahalo/TransactionManagerCreatedToStringTest.td
[java] Test Passed: OK
[java]
[java] -----------------------------------------
[java] com/sun/jini/test/impl/mahalo/TxnMgrImplNullActivationConfigEntries.td
[java] Test Skipped: verifiers are: com.sun.jini.test.impl.mahalo.ActivatableMahaloVerifier
[java] -----------------------------------------
[java] com/sun/jini/test/impl/mahalo/TxnMgrImplNullConfigEntries.td
[java] Test Passed: OK
[java]
[java] -----------------------------------------
[java] com/sun/jini/test/impl/mahalo/TxnMgrImplNullRecoveredLocators.td
[java] Test Skipped: verifiers are: com.sun.jini.test.impl.mahalo.ActivatableMahaloVerifier
[java] -----------------------------------------
[java] com/sun/jini/test/impl/mahalo/TxnMgrProxyEqualityTest.td
[java] Test Passed: OK
[java]
[java] -----------------------------------------
[java] com/sun/jini/test/spec/txnmanager/AsynchAbortOnCommitTest.td
[java] Test Passed: OK
[java]
[java] -----------------------------------------
[java] com/sun/jini/test/spec/txnmanager/AsynchAbortOnPrepareTest.td
[java] Test Passed: OK
[java]
[java] -----------------------------------------
[java] com/sun/jini/test/spec/txnmanager/CommitExpiredTest.td
[java] Test Passed: OK
[java]
[java] -----------------------------------------
[java] com/sun/jini/test/spec/txnmanager/CommitTimeoutTest.td
[java] Test Passed: OK
[java]
[java] -----------------------------------------
[java] com/sun/jini/test/spec/txnmanager/GetStateTest.td
[java] Test Passed: OK
[java]
[java] -----------------------------------------
[java] com/sun/jini/test/spec/txnmanager/JoinIdempotentTest.td
[java] Test Passed: OK
[java]
[java] -----------------------------------------
[java] com/sun/jini/test/spec/txnmanager/JoinWhileActiveTest.td
[java] Test Passed: OK
[java]
[java] -----------------------------------------
[java] com/sun/jini/test/spec/txnmanager/ManyParticipantsTest.td
[java] Test Passed: OK
[java]
[java] -----------------------------------------
[java] com/sun/jini/test/spec/txnmanager/PrepareTimeoutTest.td
[java] Test Passed: OK
[java]
[java] -----------------------------------------
[java] com/sun/jini/test/spec/txnmanager/RollBackErrorTest.td
[java] Test Passed: OK
[java]
[java] -----------------------------------------
[java] com/sun/jini/test/spec/txnmanager/RollForwardErrorTest.td
[java] Test Passed: OK
[java]
[java] -----------------------------------------
[java] com/sun/jini/test/spec/txnmanager/TwoPhaseTest.td
[java] Test Passed: OK
[java]
[java] -----------------------------------------
[java]
[java] # of tests started = 1412
[java] # of tests completed = 1412
[java] # of tests skipped = 46
[java] # of tests passed = 1410
[java] # of tests failed = 2
[java]
[java] -----------------------------------------
[java]
[java] Date finished:
[java] Wed Feb 20 08:57:34 GMT+00:00 2013
[java] Time elapsed:
[java] 72822 seconds
[java]
[java] Java Result: 1
collect-result:
[copy] Copying 1 file to /zonestorage/hudson_solaris/home/hudson/hudson-slave/workspace/river-qa-refactoring-solaris/trunk/qa/result
[copy] Copying 1 file to /zonestorage/hudson_solaris/home/hudson/hudson-slave/workspace/river-qa-refactoring-solaris/trunk/qa/result
[zip] Building zip: /zonestorage/hudson_solaris/home/hudson/hudson-slave/workspace/river-qa-refactoring-solaris/trunk/qa/result/qaresults-x86-SunOS-1.6.0_26.zip
BUILD FAILED
/zonestorage/hudson_solaris/home/hudson/hudson-slave/workspace/river-qa-refactoring-solaris/trunk/build.xml:2093: The following error occurred while executing this line:
/zonestorage/hudson_solaris/home/hudson/hudson-slave/workspace/river-qa-refactoring-solaris/trunk/qa/build.xml:406: The following error occurred while executing this line:
/zonestorage/hudson_solaris/home/hudson/hudson-slave/workspace/river-qa-refactoring-solaris/trunk/qa/build.xml:380: condition satisfied
Total time: 1221 minutes 12 seconds
Build step 'Invoke Ant' marked build as failure
Archiving artifacts
Build failed in Jenkins: river-qa-refactoring-solaris #20
Posted by Apache Jenkins Server <je...@builds.apache.org>.
See <https://builds.apache.org/job/river-qa-refactoring-solaris/20/changes>
Changes:
[peter_firmstone] Minor refactor to BaseQATest.
Removed TaskManager from LookupDiscoveryLocator and replaced with ExecutorService, added configuration option for users.
Made breaking changes to subclasses for some classes, by changing object fields from protected, to private final, to make these objects immutable.
Fix JvmLifeSupport case where assertion is ignored to avoid NullPointerException.
[peter_firmstone] Minor refactor to BaseQATest.
Removed TaskManager from LookupDiscoveryLocator and replaced with ExecutorService, added configuration option for users.
------------------------------------------
[...truncated 8851 lines...]
[java] Test Passed: OK
[java]
[java] -----------------------------------------
[java] com/sun/jini/test/spec/javaspace/conformance/snapshot/SnapshotTransactionTakeIfExistsTest.td
[java] Test Passed: OK
[java]
[java] -----------------------------------------
[java] com/sun/jini/test/spec/javaspace/conformance/snapshot/SnapshotTransactionTakeIfExistsWaitTest.td
[java] Test Passed: OK
[java]
[java] -----------------------------------------
[java] com/sun/jini/test/spec/javaspace/conformance/snapshot/SnapshotTransactionTakeNO_WAITTest.td
[java] Test Passed: OK
[java]
[java] -----------------------------------------
[java] com/sun/jini/test/spec/javaspace/conformance/snapshot/SnapshotTransactionTakeReadTest.td
[java] Test Passed: OK
[java]
[java] -----------------------------------------
[java] com/sun/jini/test/spec/javaspace/conformance/snapshot/SnapshotTransactionTakeTest.td
[java] Test Passed: OK
[java]
[java] -----------------------------------------
[java] com/sun/jini/test/spec/javaspace/conformance/snapshot/SnapshotTransactionTakeWaitTest.td
[java] Test Passed: OK
[java]
[java] -----------------------------------------
[java] com/sun/jini/test/spec/javaspace/conformance/snapshot/SnapshotTransactionWriteLeaseANYTest.td
[java] Test Passed: OK
[java]
[java] -----------------------------------------
[java] com/sun/jini/test/spec/javaspace/conformance/snapshot/SnapshotTransactionWriteLeaseFOREVERTest.td
[java] Test Passed: OK
[java]
[java] -----------------------------------------
[java] com/sun/jini/test/spec/javaspace/conformance/snapshot/SnapshotTransactionWriteNegativeLeaseTest.td
[java] Test Passed: OK
[java]
[java] -----------------------------------------
[java] com/sun/jini/test/spec/javaspace/conformance/snapshot/SnapshotTransactionWriteTakeIfExistsNotifyTest.td
[java] Test Passed: OK
[java]
[java] -----------------------------------------
[java] com/sun/jini/test/spec/javaspace/conformance/snapshot/SnapshotTransactionWriteTakeIfExistsTest.td
[java] Test Passed: OK
[java]
[java] -----------------------------------------
[java] com/sun/jini/test/spec/javaspace/conformance/snapshot/SnapshotTransactionWriteTakeNotifyTest.td
[java] Test Passed: OK
[java]
[java] -----------------------------------------
[java] com/sun/jini/test/spec/javaspace/conformance/snapshot/SnapshotTransactionWriteTakeTest.td
[java] Test Passed: OK
[java]
[java] -----------------------------------------
[java] com/sun/jini/test/spec/javaspace/conformance/snapshot/SnapshotTransactionWriteTest.td
[java] Test Passed: OK
[java]
[java] -----------------------------------------
[java] com/sun/jini/test/spec/javaspace/conformance/snapshot/SnapshotWriteLeaseANYTest.td
[java] Test Passed: OK
[java]
[java] -----------------------------------------
[java] com/sun/jini/test/spec/javaspace/conformance/snapshot/SnapshotWriteLeaseFOREVERTest.td
[java] Test Passed: OK
[java]
[java] -----------------------------------------
[java] com/sun/jini/test/spec/javaspace/conformance/snapshot/SnapshotWriteNegativeLeaseTest.td
[java] Test Passed: OK
[java]
[java] -----------------------------------------
[java] com/sun/jini/test/spec/javaspace/conformance/snapshot/SnapshotWriteTest.td
[java] Test Passed: OK
[java]
[java] -----------------------------------------
[java] com/sun/jini/test/impl/mahalo/AdminIFShutdownTest.td
[java] Test Passed: OK
[java]
[java] -----------------------------------------
[java] com/sun/jini/test/impl/mahalo/AdminIFTest.td
[java] Test Passed: OK
[java]
[java] -----------------------------------------
[java] com/sun/jini/test/impl/mahalo/LeaseExpireCancelTest.td
[java] Test Passed: OK
[java]
[java] -----------------------------------------
[java] com/sun/jini/test/impl/mahalo/LeaseExpireRenewTest.td
[java] Test Passed: OK
[java]
[java] -----------------------------------------
[java] com/sun/jini/test/impl/mahalo/LeaseMapTest.td
[java] Test Passed: OK
[java]
[java] -----------------------------------------
[java] com/sun/jini/test/impl/mahalo/LeaseTest.td
[java] Test Passed: OK
[java]
[java] -----------------------------------------
[java] com/sun/jini/test/impl/mahalo/MahaloCreateShutdownTest.td
[java] Test Passed: OK
[java]
[java] -----------------------------------------
[java] com/sun/jini/test/impl/mahalo/MahaloIFTest.td
[java] Test Passed: OK
[java]
[java] -----------------------------------------
[java] com/sun/jini/test/impl/mahalo/MahaloImplReadyStateTest.td
[java] Test Skipped: verifiers are: com.sun.jini.test.impl.mercury.ActivatableMercuryVerifier com.sun.jini.qa.harness.SkipConfigTestVerifier
[java] -----------------------------------------
[java] com/sun/jini/test/impl/mahalo/NestableServerTransactionCreatedToStringTest.td
[java] Test Passed: OK
[java]
[java] -----------------------------------------
[java] com/sun/jini/test/impl/mahalo/NestableTransactionCreatedToStringTest.td
[java] Test Passed: OK
[java]
[java] -----------------------------------------
[java] com/sun/jini/test/impl/mahalo/PrepareAndCommitExceptionTest.td
[java] Test Passed: OK
[java]
[java] -----------------------------------------
[java] com/sun/jini/test/impl/mahalo/PrepareAndCommitExceptionTest2.td
[java] Test Passed: OK
[java]
[java] -----------------------------------------
[java] com/sun/jini/test/impl/mahalo/PrepareAndCommitExceptionTest3.td
[java] Test Passed: OK
[java]
[java] -----------------------------------------
[java] com/sun/jini/test/impl/mahalo/PrepareAndCommitExceptionTest4.td
[java] Test Passed: OK
[java]
[java] -----------------------------------------
[java] com/sun/jini/test/impl/mahalo/PrepareAndCommitExceptionTest5.td
[java] Test Passed: OK
[java]
[java] -----------------------------------------
[java] com/sun/jini/test/impl/mahalo/RandomStressTest.td
[java] Test Passed: OK
[java]
[java] -----------------------------------------
[java] com/sun/jini/test/impl/mahalo/ServerTransactionEqualityTest.td
[java] Test Passed: OK
[java]
[java] -----------------------------------------
[java] com/sun/jini/test/impl/mahalo/ServerTransactionToStringTest.td
[java] Test Passed: OK
[java]
[java] -----------------------------------------
[java] com/sun/jini/test/impl/mahalo/TransactionCreatedToStringTest.td
[java] Test Passed: OK
[java]
[java] -----------------------------------------
[java] com/sun/jini/test/impl/mahalo/TransactionManagerCreatedToStringTest.td
[java] Test Passed: OK
[java]
[java] -----------------------------------------
[java] com/sun/jini/test/impl/mahalo/TxnMgrImplNullActivationConfigEntries.td
[java] Test Skipped: verifiers are: com.sun.jini.test.impl.mahalo.ActivatableMahaloVerifier
[java] -----------------------------------------
[java] com/sun/jini/test/impl/mahalo/TxnMgrImplNullConfigEntries.td
[java] Test Passed: OK
[java]
[java] -----------------------------------------
[java] com/sun/jini/test/impl/mahalo/TxnMgrImplNullRecoveredLocators.td
[java] Test Skipped: verifiers are: com.sun.jini.test.impl.mahalo.ActivatableMahaloVerifier
[java] -----------------------------------------
[java] com/sun/jini/test/impl/mahalo/TxnMgrProxyEqualityTest.td
[java] Test Passed: OK
[java]
[java] -----------------------------------------
[java] com/sun/jini/test/spec/txnmanager/AsynchAbortOnCommitTest.td
[java] Test Passed: OK
[java]
[java] -----------------------------------------
[java] com/sun/jini/test/spec/txnmanager/AsynchAbortOnPrepareTest.td
[java] Test Passed: OK
[java]
[java] -----------------------------------------
[java] com/sun/jini/test/spec/txnmanager/CommitExpiredTest.td
[java] Test Passed: OK
[java]
[java] -----------------------------------------
[java] com/sun/jini/test/spec/txnmanager/CommitTimeoutTest.td
[java] Test Passed: OK
[java]
[java] -----------------------------------------
[java] com/sun/jini/test/spec/txnmanager/GetStateTest.td
[java] Test Passed: OK
[java]
[java] -----------------------------------------
[java] com/sun/jini/test/spec/txnmanager/JoinIdempotentTest.td
[java] Test Passed: OK
[java]
[java] -----------------------------------------
[java] com/sun/jini/test/spec/txnmanager/JoinWhileActiveTest.td
[java] Test Passed: OK
[java]
[java] -----------------------------------------
[java] com/sun/jini/test/spec/txnmanager/ManyParticipantsTest.td
[java] Test Passed: OK
[java]
[java] -----------------------------------------
[java] com/sun/jini/test/spec/txnmanager/PrepareTimeoutTest.td
[java] Test Passed: OK
[java]
[java] -----------------------------------------
[java] com/sun/jini/test/spec/txnmanager/RollBackErrorTest.td
[java] Test Passed: OK
[java]
[java] -----------------------------------------
[java] com/sun/jini/test/spec/txnmanager/RollForwardErrorTest.td
[java] Test Passed: OK
[java]
[java] -----------------------------------------
[java] com/sun/jini/test/spec/txnmanager/TwoPhaseTest.td
[java] Test Passed: OK
[java]
[java] -----------------------------------------
[java]
[java] # of tests started = 1412
[java] # of tests completed = 1412
[java] # of tests skipped = 46
[java] # of tests passed = 1396
[java] # of tests failed = 16
[java]
[java] -----------------------------------------
[java]
[java] Date finished:
[java] Tue Feb 12 12:48:49 GMT+00:00 2013
[java] Time elapsed:
[java] 78491 seconds
[java]
[java] Java Result: 1
collect-result:
[copy] Copying 1 file to /zonestorage/hudson_solaris/home/hudson/hudson-slave/workspace/river-qa-refactoring-solaris/trunk/qa/result
[copy] Copying 1 file to /zonestorage/hudson_solaris/home/hudson/hudson-slave/workspace/river-qa-refactoring-solaris/trunk/qa/result
[zip] Building zip: /zonestorage/hudson_solaris/home/hudson/hudson-slave/workspace/river-qa-refactoring-solaris/trunk/qa/result/qaresults-x86-SunOS-1.6.0_26.zip
BUILD FAILED
/zonestorage/hudson_solaris/home/hudson/hudson-slave/workspace/river-qa-refactoring-solaris/trunk/build.xml:2093: The following error occurred while executing this line:
/zonestorage/hudson_solaris/home/hudson/hudson-slave/workspace/river-qa-refactoring-solaris/trunk/qa/build.xml:406: The following error occurred while executing this line:
/zonestorage/hudson_solaris/home/hudson/hudson-slave/workspace/river-qa-refactoring-solaris/trunk/qa/build.xml:380: condition satisfied
Total time: 1316 minutes 32 seconds
Build step 'Invoke Ant' marked build as failure
Archiving artifacts