You are viewing a plain text version of this content. The canonical link for it is here.
Posted to dev@lucene.apache.org by Apache Jenkins Server <je...@builds.apache.org> on 2016/01/06 09:08:55 UTC
[JENKINS] Lucene-Solr-SmokeRelease-5.x - Build # 429 - Failure
Build: https://builds.apache.org/job/Lucene-Solr-SmokeRelease-5.x/429/
No tests ran.
Build Log:
[...truncated 53134 lines...]
prepare-release-no-sign:
[mkdir] Created dir: /x1/jenkins/jenkins-slave/workspace/Lucene-Solr-SmokeRelease-5.x/lucene/build/smokeTestRelease/dist
[copy] Copying 461 files to /x1/jenkins/jenkins-slave/workspace/Lucene-Solr-SmokeRelease-5.x/lucene/build/smokeTestRelease/dist/lucene
[copy] Copying 245 files to /x1/jenkins/jenkins-slave/workspace/Lucene-Solr-SmokeRelease-5.x/lucene/build/smokeTestRelease/dist/solr
[smoker] Java 1.7 JAVA_HOME=/home/jenkins/jenkins-slave/tools/hudson.model.JDK/latest1.7
[smoker] Java 1.8 JAVA_HOME=/home/jenkins/jenkins-slave/tools/hudson.model.JDK/latest1.8
[smoker] NOTE: output encoding is UTF-8
[smoker]
[smoker] Load release URL "file:/x1/jenkins/jenkins-slave/workspace/Lucene-Solr-SmokeRelease-5.x/lucene/build/smokeTestRelease/dist/"...
[smoker]
[smoker] Test Lucene...
[smoker] test basics...
[smoker] get KEYS
[smoker] 0.2 MB in 0.04 sec (3.6 MB/sec)
[smoker] check changes HTML...
[smoker] download lucene-5.5.0-src.tgz...
[smoker] 28.7 MB in 0.04 sec (704.3 MB/sec)
[smoker] verify md5/sha1 digests
[smoker] download lucene-5.5.0.tgz...
[smoker] 63.4 MB in 0.10 sec (637.2 MB/sec)
[smoker] verify md5/sha1 digests
[smoker] download lucene-5.5.0.zip...
[smoker] 73.8 MB in 0.12 sec (632.0 MB/sec)
[smoker] verify md5/sha1 digests
[smoker] unpack lucene-5.5.0.tgz...
[smoker] verify JAR metadata/identity/no javax.* or java.* classes...
[smoker] test demo with 1.7...
[smoker] got 6174 hits for query "lucene"
[smoker] checkindex with 1.7...
[smoker] test demo with 1.8...
[smoker] got 6174 hits for query "lucene"
[smoker] checkindex with 1.8...
[smoker] check Lucene's javadoc JAR
[smoker] unpack lucene-5.5.0.zip...
[smoker] verify JAR metadata/identity/no javax.* or java.* classes...
[smoker] test demo with 1.7...
[smoker] got 6174 hits for query "lucene"
[smoker] checkindex with 1.7...
[smoker] test demo with 1.8...
[smoker] got 6174 hits for query "lucene"
[smoker] checkindex with 1.8...
[smoker] check Lucene's javadoc JAR
[smoker] unpack lucene-5.5.0-src.tgz...
[smoker] make sure no JARs/WARs in src dist...
[smoker] run "ant validate"
[smoker] run tests w/ Java 7 and testArgs='-Dtests.slow=false'...
[smoker] test demo with 1.7...
[smoker] got 214 hits for query "lucene"
[smoker] checkindex with 1.7...
[smoker] generate javadocs w/ Java 7...
[smoker]
[smoker] Crawl/parse...
[smoker]
[smoker] Verify...
[smoker] run tests w/ Java 8 and testArgs='-Dtests.slow=false'...
[smoker] test demo with 1.8...
[smoker] got 214 hits for query "lucene"
[smoker] checkindex with 1.8...
[smoker] generate javadocs w/ Java 8...
[smoker]
[smoker] Crawl/parse...
[smoker]
[smoker] Verify...
[smoker] confirm all releases have coverage in TestBackwardsCompatibility
[smoker] find all past Lucene releases...
[smoker] run TestBackwardsCompatibility..
[smoker] success!
[smoker]
[smoker] Test Solr...
[smoker] test basics...
[smoker] get KEYS
[smoker] 0.2 MB in 0.01 sec (21.4 MB/sec)
[smoker] check changes HTML...
[smoker] download solr-5.5.0-src.tgz...
[smoker] 37.5 MB in 0.05 sec (694.2 MB/sec)
[smoker] verify md5/sha1 digests
[smoker] download solr-5.5.0.tgz...
[smoker] 130.2 MB in 0.17 sec (747.2 MB/sec)
[smoker] verify md5/sha1 digests
[smoker] download solr-5.5.0.zip...
[smoker] 138.0 MB in 0.22 sec (634.4 MB/sec)
[smoker] verify md5/sha1 digests
[smoker] unpack solr-5.5.0.tgz...
[smoker] verify JAR metadata/identity/no javax.* or java.* classes...
[smoker] unpack lucene-5.5.0.tgz...
[smoker] **WARNING**: skipping check of /x1/jenkins/jenkins-slave/workspace/Lucene-Solr-SmokeRelease-5.x/lucene/build/smokeTestRelease/tmp/unpack/solr-5.5.0/contrib/dataimporthandler-extras/lib/javax.mail-1.5.1.jar: it has javax.* classes
[smoker] **WARNING**: skipping check of /x1/jenkins/jenkins-slave/workspace/Lucene-Solr-SmokeRelease-5.x/lucene/build/smokeTestRelease/tmp/unpack/solr-5.5.0/contrib/dataimporthandler-extras/lib/activation-1.1.1.jar: it has javax.* classes
[smoker] copying unpacked distribution for Java 7 ...
[smoker] test solr example w/ Java 7...
[smoker] start Solr instance (log=/x1/jenkins/jenkins-slave/workspace/Lucene-Solr-SmokeRelease-5.x/lucene/build/smokeTestRelease/tmp/unpack/solr-5.5.0-java7/solr-example.log)...
[smoker] No process found for Solr node running on port 8983
[smoker] Running techproducts example on port 8983 from /x1/jenkins/jenkins-slave/workspace/Lucene-Solr-SmokeRelease-5.x/lucene/build/smokeTestRelease/tmp/unpack/solr-5.5.0-java7
[smoker] Creating Solr home directory /x1/jenkins/jenkins-slave/workspace/Lucene-Solr-SmokeRelease-5.x/lucene/build/smokeTestRelease/tmp/unpack/solr-5.5.0-java7/example/techproducts/solr
[smoker]
[smoker] Starting up Solr on port 8983 using command:
[smoker] bin/solr start -p 8983 -s "example/techproducts/solr"
[smoker]
[smoker] Waiting up to 30 seconds to see Solr running on port 8983 [|] [/] [-] [\] [|] [/] [-] [\] [|] [/] [-]
[smoker] Started Solr server on port 8983 (pid=26211). Happy searching!
[smoker]
[smoker]
[smoker] Copying configuration to new core instance directory:
[smoker] /x1/jenkins/jenkins-slave/workspace/Lucene-Solr-SmokeRelease-5.x/lucene/build/smokeTestRelease/tmp/unpack/solr-5.5.0-java7/example/techproducts/solr/techproducts
[smoker]
[smoker] Creating new core 'techproducts' using command:
[smoker] http://localhost:8983/solr/admin/cores?action=CREATE&name=techproducts&instanceDir=techproducts
[smoker]
[smoker] {
[smoker] "responseHeader":{
[smoker] "status":0,
[smoker] "QTime":2592},
[smoker] "core":"techproducts"}
[smoker]
[smoker]
[smoker] Indexing tech product example docs from /x1/jenkins/jenkins-slave/workspace/Lucene-Solr-SmokeRelease-5.x/lucene/build/smokeTestRelease/tmp/unpack/solr-5.5.0-java7/example/exampledocs
[smoker] SimplePostTool version 5.0.0
[smoker] Posting files to [base] url http://localhost:8983/solr/techproducts/update using content-type application/xml...
[smoker] POSTing file money.xml to [base]
[smoker] POSTing file mem.xml to [base]
[smoker] POSTing file vidcard.xml to [base]
[smoker] POSTing file ipod_video.xml to [base]
[smoker] POSTing file sd500.xml to [base]
[smoker] POSTing file gb18030-example.xml to [base]
[smoker] POSTing file mp500.xml to [base]
[smoker] POSTing file monitor2.xml to [base]
[smoker] POSTing file utf8-example.xml to [base]
[smoker] POSTing file manufacturers.xml to [base]
[smoker] POSTing file hd.xml to [base]
[smoker] POSTing file solr.xml to [base]
[smoker] POSTing file monitor.xml to [base]
[smoker] POSTing file ipod_other.xml to [base]
[smoker] 14 files indexed.
[smoker] COMMITting Solr index changes to http://localhost:8983/solr/techproducts/update...
[smoker] Time spent: 0:00:00.637
[smoker]
[smoker] Solr techproducts example launched successfully. Direct your Web browser to http://localhost:8983/solr to visit the Solr Admin UI
[smoker] test utf8...
[smoker] run query...
[smoker] stop server using: bin/solr stop -p 8983
[smoker] Sending stop command to Solr running on port 8983 ... waiting 5 seconds to allow Jetty process 26211 to stop gracefully.
[smoker] [|] [/] [-] [\] [|] [/] [-] [\] [|] [/] copying unpacked distribution for Java 8 ...
[smoker] test solr example w/ Java 8...
[smoker] start Solr instance (log=/x1/jenkins/jenkins-slave/workspace/Lucene-Solr-SmokeRelease-5.x/lucene/build/smokeTestRelease/tmp/unpack/solr-5.5.0-java8/solr-example.log)...
[smoker] No process found for Solr node running on port 8983
[smoker] Running techproducts example on port 8983 from /x1/jenkins/jenkins-slave/workspace/Lucene-Solr-SmokeRelease-5.x/lucene/build/smokeTestRelease/tmp/unpack/solr-5.5.0-java8
[smoker] Creating Solr home directory /x1/jenkins/jenkins-slave/workspace/Lucene-Solr-SmokeRelease-5.x/lucene/build/smokeTestRelease/tmp/unpack/solr-5.5.0-java8/example/techproducts/solr
[smoker]
[smoker] Starting up Solr on port 8983 using command:
[smoker] bin/solr start -p 8983 -s "example/techproducts/solr"
[smoker]
[smoker] Waiting up to 30 seconds to see Solr running on port 8983 [|] [/] [-] [\] [|] [/] [-] [\] [|] [/] [-]
[smoker] Started Solr server on port 8983 (pid=26742). Happy searching!
[smoker]
[smoker]
[smoker] Copying configuration to new core instance directory:
[smoker] /x1/jenkins/jenkins-slave/workspace/Lucene-Solr-SmokeRelease-5.x/lucene/build/smokeTestRelease/tmp/unpack/solr-5.5.0-java8/example/techproducts/solr/techproducts
[smoker]
[smoker] Creating new core 'techproducts' using command:
[smoker] http://localhost:8983/solr/admin/cores?action=CREATE&name=techproducts&instanceDir=techproducts
[smoker]
[smoker] {
[smoker] "responseHeader":{
[smoker] "status":0,
[smoker] "QTime":2500},
[smoker] "core":"techproducts"}
[smoker]
[smoker]
[smoker] Indexing tech product example docs from /x1/jenkins/jenkins-slave/workspace/Lucene-Solr-SmokeRelease-5.x/lucene/build/smokeTestRelease/tmp/unpack/solr-5.5.0-java8/example/exampledocs
[smoker] SimplePostTool version 5.0.0
[smoker] Posting files to [base] url http://localhost:8983/solr/techproducts/update using content-type application/xml...
[smoker] POSTing file money.xml to [base]
[smoker] POSTing file mem.xml to [base]
[smoker] POSTing file vidcard.xml to [base]
[smoker] POSTing file ipod_video.xml to [base]
[smoker] POSTing file sd500.xml to [base]
[smoker] POSTing file gb18030-example.xml to [base]
[smoker] POSTing file mp500.xml to [base]
[smoker] POSTing file monitor2.xml to [base]
[smoker] POSTing file utf8-example.xml to [base]
[smoker] POSTing file manufacturers.xml to [base]
[smoker] POSTing file hd.xml to [base]
[smoker] POSTing file solr.xml to [base]
[smoker] POSTing file monitor.xml to [base]
[smoker] POSTing file ipod_other.xml to [base]
[smoker] 14 files indexed.
[smoker] COMMITting Solr index changes to http://localhost:8983/solr/techproducts/update...
[smoker] Time spent: 0:00:00.484
[smoker]
[smoker] Solr techproducts example launched successfully. Direct your Web browser to http://localhost:8983/solr to visit the Solr Admin UI
[smoker] test utf8...
[smoker] run query...
[smoker] stop server using: bin/solr stop -p 8983
[smoker] Sending stop command to Solr running on port 8983 ... waiting 5 seconds to allow Jetty process 26742 to stop gracefully.
[smoker] [|] [/] [-] [\] [|] [/] [-] [\] [|] [/] unpack solr-5.5.0.zip...
[smoker] verify JAR metadata/identity/no javax.* or java.* classes...
[smoker] unpack lucene-5.5.0.tgz...
[smoker] **WARNING**: skipping check of /x1/jenkins/jenkins-slave/workspace/Lucene-Solr-SmokeRelease-5.x/lucene/build/smokeTestRelease/tmp/unpack/solr-5.5.0/contrib/dataimporthandler-extras/lib/javax.mail-1.5.1.jar: it has javax.* classes
[smoker] **WARNING**: skipping check of /x1/jenkins/jenkins-slave/workspace/Lucene-Solr-SmokeRelease-5.x/lucene/build/smokeTestRelease/tmp/unpack/solr-5.5.0/contrib/dataimporthandler-extras/lib/activation-1.1.1.jar: it has javax.* classes
[smoker] copying unpacked distribution for Java 7 ...
[smoker] test solr example w/ Java 7...
[smoker] start Solr instance (log=/x1/jenkins/jenkins-slave/workspace/Lucene-Solr-SmokeRelease-5.x/lucene/build/smokeTestRelease/tmp/unpack/solr-5.5.0-java7/solr-example.log)...
[smoker] No process found for Solr node running on port 8983
[smoker] Running techproducts example on port 8983 from /x1/jenkins/jenkins-slave/workspace/Lucene-Solr-SmokeRelease-5.x/lucene/build/smokeTestRelease/tmp/unpack/solr-5.5.0-java7
[smoker] Creating Solr home directory /x1/jenkins/jenkins-slave/workspace/Lucene-Solr-SmokeRelease-5.x/lucene/build/smokeTestRelease/tmp/unpack/solr-5.5.0-java7/example/techproducts/solr
[smoker]
[smoker] Starting up Solr on port 8983 using command:
[smoker] bin/solr start -p 8983 -s "example/techproducts/solr"
[smoker]
[smoker] Waiting up to 30 seconds to see Solr running on port 8983 [|] [/] [-] [\] [|] [/] [-] [\] [|] [/] [-]
[smoker] Started Solr server on port 8983 (pid=27128). Happy searching!
[smoker]
[smoker]
[smoker] Copying configuration to new core instance directory:
[smoker] /x1/jenkins/jenkins-slave/workspace/Lucene-Solr-SmokeRelease-5.x/lucene/build/smokeTestRelease/tmp/unpack/solr-5.5.0-java7/example/techproducts/solr/techproducts
[smoker]
[smoker] Creating new core 'techproducts' using command:
[smoker] http://localhost:8983/solr/admin/cores?action=CREATE&name=techproducts&instanceDir=techproducts
[smoker]
[smoker] {
[smoker] "responseHeader":{
[smoker] "status":0,
[smoker] "QTime":2531},
[smoker] "core":"techproducts"}
[smoker]
[smoker]
[smoker] Indexing tech product example docs from /x1/jenkins/jenkins-slave/workspace/Lucene-Solr-SmokeRelease-5.x/lucene/build/smokeTestRelease/tmp/unpack/solr-5.5.0-java7/example/exampledocs
[smoker] SimplePostTool version 5.0.0
[smoker] Posting files to [base] url http://localhost:8983/solr/techproducts/update using content-type application/xml...
[smoker] POSTing file money.xml to [base]
[smoker] POSTing file mem.xml to [base]
[smoker] POSTing file vidcard.xml to [base]
[smoker] POSTing file ipod_video.xml to [base]
[smoker] POSTing file sd500.xml to [base]
[smoker] POSTing file gb18030-example.xml to [base]
[smoker] POSTing file mp500.xml to [base]
[smoker] POSTing file monitor2.xml to [base]
[smoker] POSTing file utf8-example.xml to [base]
[smoker] POSTing file manufacturers.xml to [base]
[smoker] POSTing file hd.xml to [base]
[smoker] POSTing file solr.xml to [base]
[smoker] POSTing file monitor.xml to [base]
[smoker] POSTing file ipod_other.xml to [base]
[smoker] 14 files indexed.
[smoker] COMMITting Solr index changes to http://localhost:8983/solr/techproducts/update...
[smoker] Time spent: 0:00:00.509
[smoker]
[smoker] Solr techproducts example launched successfully. Direct your Web browser to http://localhost:8983/solr to visit the Solr Admin UI
[smoker] test utf8...
[smoker] run query...
[smoker] stop server using: bin/solr stop -p 8983
[smoker] Sending stop command to Solr running on port 8983 ... waiting 5 seconds to allow Jetty process 27128 to stop gracefully.
[smoker] [|] [/] [-] [\] [|] [/] [-] [\] [|] [/] copying unpacked distribution for Java 8 ...
[smoker] test solr example w/ Java 8...
[smoker] start Solr instance (log=/x1/jenkins/jenkins-slave/workspace/Lucene-Solr-SmokeRelease-5.x/lucene/build/smokeTestRelease/tmp/unpack/solr-5.5.0-java8/solr-example.log)...
[smoker] No process found for Solr node running on port 8983
[smoker] Running techproducts example on port 8983 from /x1/jenkins/jenkins-slave/workspace/Lucene-Solr-SmokeRelease-5.x/lucene/build/smokeTestRelease/tmp/unpack/solr-5.5.0-java8
[smoker] Creating Solr home directory /x1/jenkins/jenkins-slave/workspace/Lucene-Solr-SmokeRelease-5.x/lucene/build/smokeTestRelease/tmp/unpack/solr-5.5.0-java8/example/techproducts/solr
[smoker]
[smoker] Starting up Solr on port 8983 using command:
[smoker] bin/solr start -p 8983 -s "example/techproducts/solr"
[smoker]
[smoker] Waiting up to 30 seconds to see Solr running on port 8983 [|] [/] [-] [\] [|] [/] [-] [\] [|] [/] [-]
[smoker] Started Solr server on port 8983 (pid=27508). Happy searching!
[smoker]
[smoker]
[smoker] Copying configuration to new core instance directory:
[smoker] /x1/jenkins/jenkins-slave/workspace/Lucene-Solr-SmokeRelease-5.x/lucene/build/smokeTestRelease/tmp/unpack/solr-5.5.0-java8/example/techproducts/solr/techproducts
[smoker]
[smoker] Creating new core 'techproducts' using command:
[smoker] http://localhost:8983/solr/admin/cores?action=CREATE&name=techproducts&instanceDir=techproducts
[smoker]
[smoker] {
[smoker] "responseHeader":{
[smoker] "status":0,
[smoker] "QTime":2873},
[smoker] "core":"techproducts"}
[smoker]
[smoker]
[smoker] Indexing tech product example docs from /x1/jenkins/jenkins-slave/workspace/Lucene-Solr-SmokeRelease-5.x/lucene/build/smokeTestRelease/tmp/unpack/solr-5.5.0-java8/example/exampledocs
[smoker] SimplePostTool version 5.0.0
[smoker] Posting files to [base] url http://localhost:8983/solr/techproducts/update using content-type application/xml...
[smoker] POSTing file money.xml to [base]
[smoker] POSTing file mem.xml to [base]
[smoker] POSTing file vidcard.xml to [base]
[smoker] POSTing file ipod_video.xml to [base]
[smoker] POSTing file sd500.xml to [base]
[smoker] POSTing file gb18030-example.xml to [base]
[smoker] POSTing file mp500.xml to [base]
[smoker] POSTing file monitor2.xml to [base]
[smoker] POSTing file utf8-example.xml to [base]
[smoker] POSTing file manufacturers.xml to [base]
[smoker] POSTing file hd.xml to [base]
[smoker] POSTing file solr.xml to [base]
[smoker] POSTing file monitor.xml to [base]
[smoker] POSTing file ipod_other.xml to [base]
[smoker] 14 files indexed.
[smoker] COMMITting Solr index changes to http://localhost:8983/solr/techproducts/update...
[smoker] Time spent: 0:00:00.555
[smoker]
[smoker] Solr techproducts example launched successfully. Direct your Web browser to http://localhost:8983/solr to visit the Solr Admin UI
[smoker] test utf8...
[smoker] run query...
[smoker] stop server using: bin/solr stop -p 8983
[smoker] Sending stop command to Solr running on port 8983 ... waiting 5 seconds to allow Jetty process 27508 to stop gracefully.
[smoker] [|] [/] [-] [\] [|] [/] [-] [\] [|] [/] unpack solr-5.5.0-src.tgz...
[smoker] make sure no JARs/WARs in src dist...
[smoker] run "ant validate"
[smoker]
[smoker] command "export JAVA_HOME="/home/jenkins/jenkins-slave/tools/hudson.model.JDK/latest1.7" PATH="/home/jenkins/jenkins-slave/tools/hudson.model.JDK/latest1.7/bin:$PATH" JAVACMD="/home/jenkins/jenkins-slave/tools/hudson.model.JDK/latest1.7/bin/java"; ant validate" failed:
[smoker] Buildfile: /x1/jenkins/jenkins-slave/workspace/Lucene-Solr-SmokeRelease-5.x/lucene/build/smokeTestRelease/tmp/unpack/solr-5.5.0/build.xml
[smoker]
[smoker] ivy-availability-check:
[smoker]
[smoker] ivy-fail:
[smoker]
[smoker] ivy-configure:
[smoker] [ivy:configure] :: Apache Ivy 2.3.0 - 20130110142753 :: http://ant.apache.org/ivy/ ::
[smoker] [ivy:configure] :: loading settings :: file = /x1/jenkins/jenkins-slave/workspace/Lucene-Solr-SmokeRelease-5.x/lucene/build/smokeTestRelease/tmp/unpack/solr-5.5.0/lucene/ivy-settings.xml
[smoker]
[smoker] resolve-groovy:
[smoker] [ivy:cachepath] :: resolving dependencies :: org.codehaus.groovy#groovy-all-caller;working
[smoker] [ivy:cachepath] confs: [default]
[smoker] [ivy:cachepath] found org.codehaus.groovy#groovy-all;2.4.4 in public
[smoker] [ivy:cachepath] :: resolution report :: resolve 257ms :: artifacts dl 3ms
[smoker] ---------------------------------------------------------------------
[smoker] | | modules || artifacts |
[smoker] | conf | number| search|dwnlded|evicted|| number|dwnlded|
[smoker] ---------------------------------------------------------------------
[smoker] | default | 1 | 0 | 0 | 0 || 1 | 0 |
[smoker] ---------------------------------------------------------------------
[smoker]
[smoker] rat-sources-typedef:
[smoker] [ivy:cachepath] :: resolving dependencies :: org.apache.rat#apache-rat-caller;working [not transitive]
[smoker] [ivy:cachepath] confs: [master]
[smoker] [ivy:cachepath] found org.apache.rat#apache-rat;0.11 in public
[smoker] [ivy:cachepath] :: resolution report :: resolve 36ms :: artifacts dl 1ms
[smoker] ---------------------------------------------------------------------
[smoker] | | modules || artifacts |
[smoker] | conf | number| search|dwnlded|evicted|| number|dwnlded|
[smoker] ---------------------------------------------------------------------
[smoker] | master | 1 | 0 | 0 | 0 || 1 | 0 |
[smoker] ---------------------------------------------------------------------
[smoker]
[smoker] -validate-source-patterns:
[smoker]
[smoker] -install-forbidden-apis:
[smoker] [ivy:cachepath] :: resolving dependencies :: de.thetaphi#forbiddenapis-caller;working
[smoker] [ivy:cachepath] confs: [default]
[smoker] [ivy:cachepath] found de.thetaphi#forbiddenapis;2.0 in public
[smoker] [ivy:cachepath] :: resolution report :: resolve 24ms :: artifacts dl 1ms
[smoker] ---------------------------------------------------------------------
[smoker] | | modules || artifacts |
[smoker] | conf | number| search|dwnlded|evicted|| number|dwnlded|
[smoker] ---------------------------------------------------------------------
[smoker] | default | 1 | 0 | 0 | 0 || 1 | 0 |
[smoker] ---------------------------------------------------------------------
[smoker]
[smoker] validate:
[smoker]
[smoker] common.compile-tools:
[smoker]
[smoker] ivy-availability-check:
[smoker]
[smoker] ivy-fail:
[smoker]
[smoker] ivy-configure:
[smoker] [ivy:configure] :: loading settings :: file = /x1/jenkins/jenkins-slave/workspace/Lucene-Solr-SmokeRelease-5.x/lucene/build/smokeTestRelease/tmp/unpack/solr-5.5.0/lucene/ivy-settings.xml
[smoker]
[smoker] resolve:
[smoker]
[smoker] init:
[smoker]
[smoker] compile-core:
[smoker] [mkdir] Created dir: /x1/jenkins/jenkins-slave/workspace/Lucene-Solr-SmokeRelease-5.x/lucene/build/smokeTestRelease/tmp/unpack/solr-5.5.0/lucene/build/tools/classes/java
[smoker] [javac] Compiling 7 source files to /x1/jenkins/jenkins-slave/workspace/Lucene-Solr-SmokeRelease-5.x/lucene/build/smokeTestRelease/tmp/unpack/solr-5.5.0/lucene/build/tools/classes/java
[smoker] [copy] Copying 1 file to /x1/jenkins/jenkins-slave/workspace/Lucene-Solr-SmokeRelease-5.x/lucene/build/smokeTestRelease/tmp/unpack/solr-5.5.0/lucene/build/tools/classes/java
[smoker]
[smoker] compile-tools:
[smoker]
[smoker] compile-tools:
[smoker]
[smoker] common.compile-tools:
[smoker]
[smoker] ivy-availability-check:
[smoker]
[smoker] ivy-fail:
[smoker]
[smoker] ivy-configure:
[smoker] [ivy:configure] :: loading settings :: file = /x1/jenkins/jenkins-slave/workspace/Lucene-Solr-SmokeRelease-5.x/lucene/build/smokeTestRelease/tmp/unpack/solr-5.5.0/lucene/ivy-settings.xml
[smoker]
[smoker] resolve:
[smoker]
[smoker] init:
[smoker]
[smoker] compile-core:
[smoker]
[smoker] compile-tools:
[smoker] [mkdir] Created dir: /x1/jenkins/jenkins-slave/workspace/Lucene-Solr-SmokeRelease-5.x/lucene/build/smokeTestRelease/tmp/unpack/solr-5.5.0/lucene/build/analysis/common/classes/tools
[smoker] [javac] Compiling 1 source file to /x1/jenkins/jenkins-slave/workspace/Lucene-Solr-SmokeRelease-5.x/lucene/build/smokeTestRelease/tmp/unpack/solr-5.5.0/lucene/build/analysis/common/classes/tools
[smoker]
[smoker] ivy-availability-check:
[smoker]
[smoker] ivy-fail:
[smoker]
[smoker] ivy-configure:
[smoker] [ivy:configure] :: loading settings :: file = /x1/jenkins/jenkins-slave/workspace/Lucene-Solr-SmokeRelease-5.x/lucene/build/smokeTestRelease/tmp/unpack/solr-5.5.0/lucene/ivy-settings.xml
[smoker]
[smoker] resolve:
[smoker]
[smoker] common.init:
[smoker]
[smoker] compile-lucene-core:
[smoker]
[smoker] ivy-availability-check:
[smoker]
[smoker] ivy-fail:
[smoker]
[smoker] ivy-configure:
[smoker] [ivy:configure] :: loading settings :: file = /x1/jenkins/jenkins-slave/workspace/Lucene-Solr-SmokeRelease-5.x/lucene/build/smokeTestRelease/tmp/unpack/solr-5.5.0/lucene/ivy-settings.xml
[smoker]
[smoker] resolve:
[smoker]
[smoker] init:
[smoker]
[smoker] -clover.disable:
[smoker]
[smoker] -clover.load:
[smoker]
[smoker] -clover.classpath:
[smoker]
[smoker] -clover.setup:
[smoker]
[smoker] clover:
[smoker]
[smoker] compile-core:
[smoker] [mkdir] Created dir: /x1/jenkins/jenkins-slave/workspace/Lucene-Solr-SmokeRelease-5.x/lucene/build/smokeTestRelease/tmp/unpack/solr-5.5.0/lucene/build/core/classes/java
[smoker] [javac] Compiling 733 source files to /x1/jenkins/jenkins-slave/workspace/Lucene-Solr-SmokeRelease-5.x/lucene/build/smokeTestRelease/tmp/unpack/solr-5.5.0/lucene/build/core/classes/java
[smoker] [javac] Note: Some input files use or override a deprecated API.
[smoker] [javac] Note: Recompile with -Xlint:deprecation for details.
[smoker] [javac] Creating empty /x1/jenkins/jenkins-slave/workspace/Lucene-Solr-SmokeRelease-5.x/lucene/build/smokeTestRelease/tmp/unpack/solr-5.5.0/lucene/build/core/classes/java/org/apache/lucene/codecs/blocktree/package-info.class
[smoker] [javac] Creating empty /x1/jenkins/jenkins-slave/workspace/Lucene-Solr-SmokeRelease-5.x/lucene/build/smokeTestRelease/tmp/unpack/solr-5.5.0/lucene/build/core/classes/java/org/apache/lucene/codecs/lucene54/package-info.class
[smoker] [javac] Creating empty /x1/jenkins/jenkins-slave/workspace/Lucene-Solr-SmokeRelease-5.x/lucene/build/smokeTestRelease/tmp/unpack/solr-5.5.0/lucene/build/core/classes/java/org/apache/lucene/util/packed/package-info.class
[smoker] [javac] Creating empty /x1/jenkins/jenkins-slave/workspace/Lucene-Solr-SmokeRelease-5.x/lucene/build/smokeTestRelease/tmp/unpack/solr-5.5.0/lucene/build/core/classes/java/org/apache/lucene/analysis/package-info.class
[smoker] [javac] Creating empty /x1/jenkins/jenkins-slave/workspace/Lucene-Solr-SmokeRelease-5.x/lucene/build/smokeTestRelease/tmp/unpack/solr-5.5.0/lucene/build/core/classes/java/org/apache/lucene/document/package-info.class
[smoker] [javac] Creating empty /x1/jenkins/jenkins-slave/workspace/Lucene-Solr-SmokeRelease-5.x/lucene/build/smokeTestRelease/tmp/unpack/solr-5.5.0/lucene/build/core/classes/java/org/apache/lucene/util/package-info.class
[smoker] [javac] Creating empty /x1/jenkins/jenkins-slave/workspace/Lucene-Solr-SmokeRelease-5.x/lucene/build/smokeTestRelease/tmp/unpack/solr-5.5.0/lucene/build/core/classes/java/org/apache/lucene/analysis/tokenattributes/package-info.class
[smoker] [javac] Creating empty /x1/jenkins/jenkins-slave/workspace/Lucene-Solr-SmokeRelease-5.x/lucene/build/smokeTestRelease/tmp/unpack/solr-5.5.0/lucene/build/core/classes/java/org/apache/lucene/codecs/lucene50/package-info.class
[smoker] [javac] Creating empty /x1/jenkins/jenkins-slave/workspace/Lucene-Solr-SmokeRelease-5.x/lucene/build/smokeTestRelease/tmp/unpack/solr-5.5.0/lucene/build/core/classes/java/org/apache/lucene/index/package-info.class
[smoker] [javac] Creating empty /x1/jenkins/jenkins-slave/workspace/Lucene-Solr-SmokeRelease-5.x/lucene/build/smokeTestRelease/tmp/unpack/solr-5.5.0/lucene/build/core/classes/java/org/apache/lucene/codecs/compressing/package-info.class
[smoker] [javac] Creating empty /x1/jenkins/jenkins-slave/workspace/Lucene-Solr-SmokeRelease-5.x/lucene/build/smokeTestRelease/tmp/unpack/solr-5.5.0/lucene/build/core/classes/java/org/apache/lucene/codecs/lucene53/package-info.class
[smoker] [javac] Creating empty /x1/jenkins/jenkins-slave/workspace/Lucene-Solr-SmokeRelease-5.x/lucene/build/smokeTestRelease/tmp/unpack/solr-5.5.0/lucene/build/core/classes/java/org/apache/lucene/util/automaton/package-info.class
[smoker] [javac] Creating empty /x1/jenkins/jenkins-slave/workspace/Lucene-Solr-SmokeRelease-5.x/lucene/build/smokeTestRelease/tmp/unpack/solr-5.5.0/lucene/build/core/classes/java/org/apache/lucene/util/fst/package-info.class
[smoker] [javac] Creating empty /x1/jenkins/jenkins-slave/workspace/Lucene-Solr-SmokeRelease-5.x/lucene/build/smokeTestRelease/tmp/unpack/solr-5.5.0/lucene/build/core/classes/java/org/apache/lucene/util/mutable/package-info.class
[smoker] [javac] Creating empty /x1/jenkins/jenkins-slave/workspace/Lucene-Solr-SmokeRelease-5.x/lucene/build/smokeTestRelease/tmp/unpack/solr-5.5.0/lucene/build/core/classes/java/org/apache/lucene/search/similarities/package-info.class
[smoker] [javac] Creating empty /x1/jenkins/jenkins-slave/workspace/Lucene-Solr-SmokeRelease-5.x/lucene/build/smokeTestRelease/tmp/unpack/solr-5.5.0/lucene/build/core/classes/java/org/apache/lucene/codecs/perfield/package-info.class
[smoker] [javac] Creating empty /x1/jenkins/jenkins-slave/workspace/Lucene-Solr-SmokeRelease-5.x/lucene/build/smokeTestRelease/tmp/unpack/solr-5.5.0/lucene/build/core/classes/java/org/apache/lucene/store/package-info.class
[smoker] [javac] Creating empty /x1/jenkins/jenkins-slave/workspace/Lucene-Solr-SmokeRelease-5.x/lucene/build/smokeTestRelease/tmp/unpack/solr-5.5.0/lucene/build/core/classes/java/org/apache/lucene/package-info.class
[smoker] [javac] Creating empty /x1/jenkins/jenkins-slave/workspace/Lucene-Solr-SmokeRelease-5.x/lucene/build/smokeTestRelease/tmp/unpack/solr-5.5.0/lucene/build/core/classes/java/org/apache/lucene/search/package-info.class
[smoker] [javac] Creating empty /x1/jenkins/jenkins-slave/workspace/Lucene-Solr-SmokeRelease-5.x/lucene/build/smokeTestRelease/tmp/unpack/solr-5.5.0/lucene/build/core/classes/java/org/apache/lucene/codecs/package-info.class
[smoker] [javac] Creating empty /x1/jenkins/jenkins-slave/workspace/Lucene-Solr-SmokeRelease-5.x/lucene/build/smokeTestRelease/tmp/unpack/solr-5.5.0/lucene/build/core/classes/java/org/apache/lucene/search/spans/package-info.class
[smoker] [copy] Copying 3 files to /x1/jenkins/jenkins-slave/workspace/Lucene-Solr-SmokeRelease-5.x/lucene/build/smokeTestRelease/tmp/unpack/solr-5.5.0/lucene/build/core/classes/java
[smoker]
[smoker] init:
[smoker]
[smoker] common.compile-tools:
[smoker]
[smoker] ivy-availability-check:
[smoker]
[smoker] ivy-fail:
[smoker]
[smoker] ivy-configure:
[smoker] [ivy:configure] :: loading settings :: file = /x1/jenkins/jenkins-slave/workspace/Lucene-Solr-SmokeRelease-5.x/lucene/build/smokeTestRelease/tmp/unpack/solr-5.5.0/lucene/ivy-settings.xml
[smoker]
[smoker] resolve:
[smoker]
[smoker] init:
[smoker]
[smoker] compile-core:
[smoker]
[smoker] compile-tools:
[smoker] [mkdir] Created dir: /x1/jenkins/jenkins-slave/workspace/Lucene-Solr-SmokeRelease-5.x/lucene/build/smokeTestRelease/tmp/unpack/solr-5.5.0/lucene/build/analysis/icu/classes/tools
[smoker] [javac] Compiling 2 source files to /x1/jenkins/jenkins-slave/workspace/Lucene-Solr-SmokeRelease-5.x/lucene/build/smokeTestRelease/tmp/unpack/solr-5.5.0/lucene/build/analysis/icu/classes/tools
[smoker]
[smoker] resolve-icu:
[smoker]
[smoker] ivy-availability-check:
[smoker]
[smoker] ivy-fail:
[smoker]
[smoker] ivy-configure:
[smoker] [ivy:configure] :: loading settings :: file = /x1/jenkins/jenkins-slave/workspace/Lucene-Solr-SmokeRelease-5.x/lucene/build/smokeTestRelease/tmp/unpack/solr-5.5.0/lucene/ivy-settings.xml
[smoker]
[smoker] resolve:
[smoker]
[smoker] check-analyzers-common-uptodate:
[smoker]
[smoker] jar-analyzers-common:
[smoker]
[smoker] ivy-availability-check:
[smoker]
[smoker] ivy-fail:
[smoker]
[smoker] ivy-configure:
[smoker] [ivy:configure] :: loading settings :: file = /x1/jenkins/jenkins-slave/workspace/Lucene-Solr-SmokeRelease-5.x/lucene/build/smokeTestRelease/tmp/unpack/solr-5.5.0/lucene/ivy-settings.xml
[smoker]
[smoker] resolve:
[smoker]
[smoker] common.init:
[smoker]
[smoker] compile-lucene-core:
[smoker]
[smoker] ivy-availability-check:
[smoker]
[smoker] ivy-fail:
[smoker]
[smoker] ivy-configure:
[smoker] [ivy:configure] :: loading settings :: file = /x1/jenkins/jenkins-slave/workspace/Lucene-Solr-SmokeRelease-5.x/lucene/build/smokeTestRelease/tmp/unpack/solr-5.5.0/lucene/ivy-settings.xml
[smoker]
[smoker] resolve:
[smoker]
[smoker] init:
[smoker]
[smoker] -clover.disable:
[smoker]
[smoker] -clover.load:
[smoker]
[smoker] -clover.classpath:
[smoker]
[smoker] -clover.setup:
[smoker]
[smoker] clover:
[smoker]
[smoker] compile-core:
[smoker]
[smoker] init:
[smoker]
[smoker] -clover.disable:
[smoker]
[smoker] -clover.load:
[smoker]
[smoker] -clover.classpath:
[smoker]
[smoker] -clover.setup:
[smoker]
[smoker] clover:
[smoker]
[smoker] compile-core:
[smoker] [mkdir] Created dir: /x1/jenkins/jenkins-slave/workspace/Lucene-Solr-SmokeRelease-5.x/lucene/build/smokeTestRelease/tmp/unpack/solr-5.5.0/lucene/build/analysis/common/classes/java
[smoker] [javac] Compiling 474 source files to /x1/jenkins/jenkins-slave/workspace/Lucene-Solr-SmokeRelease-5.x/lucene/build/smokeTestRelease/tmp/unpack/solr-5.5.0/lucene/build/analysis/common/classes/java
[smoker] [javac] /x1/jenkins/jenkins-slave/workspace/Lucene-Solr-SmokeRelease-5.x/lucene/build/smokeTestRelease/tmp/unpack/solr-5.5.0/lucene/analysis/common/src/java/org/apache/lucene/analysis/standard/std40/StandardTokenizerImpl40.java:35: warning: [dep-ann] deprecated item is not annotated with @Deprecated
[smoker] [javac] public static final int YYEOF = -1;
[smoker] [javac] ^
[smoker] [javac] /x1/jenkins/jenkins-slave/workspace/Lucene-Solr-SmokeRelease-5.x/lucene/build/smokeTestRelease/tmp/unpack/solr-5.5.0/lucene/analysis/common/src/java/org/apache/lucene/analysis/standard/std40/UAX29URLEmailTokenizerImpl40.java:34: warning: [dep-ann] deprecated item is not annotated with @Deprecated
[smoker] [javac] public static final int YYEOF = -1;
[smoker] [javac] ^
[smoker] [javac] Note: Some input files use or override a deprecated API.
[smoker] [javac] Note: Recompile with -Xlint:deprecation for details.
[smoker] [javac] 2 warnings
[smoker] [javac] Creating empty /x1/jenkins/jenkins-slave/workspace/Lucene-Solr-SmokeRelease-5.x/lucene/build/smokeTestRelease/tmp/unpack/solr-5.5.0/lucene/build/analysis/common/classes/java/org/apache/lucene/analysis/ga/package-info.class
[smoker] [javac] Creating empty /x1/jenkins/jenkins-slave/workspace/Lucene-Solr-SmokeRelease-5.x/lucene/build/smokeTestRelease/tmp/unpack/solr-5.5.0/lucene/build/analysis/common/classes/java/org/apache/lucene/analysis/compound/hyphenation/package-info.class
[smoker] [javac] Creating empty /x1/jenkins/jenkins-slave/workspace/Lucene-Solr-SmokeRelease-5.x/lucene/build/smokeTestRelease/tmp/unpack/solr-5.5.0/lucene/build/analysis/common/classes/java/org/apache/lucene/analysis/ca/package-info.class
[smoker] [javac] Creating empty /x1/jenkins/jenkins-slave/workspace/Lucene-Solr-SmokeRelease-5.x/lucene/build/smokeTestRelease/tmp/unpack/solr-5.5.0/lucene/build/analysis/common/classes/java/org/apache/lucene/analysis/tr/package-info.class
[smoker] [javac] Creating empty /x1/jenkins/jenkins-slave/workspace/Lucene-Solr-SmokeRelease-5.x/lucene/build/smokeTestRelease/tmp/unpack/solr-5.5.0/lucene/build/analysis/common/classes/java/org/apache/lucene/analysis/synonym/package-info.class
[smoker] [javac] Creating empty /x1/jenkins/jenkins-slave/workspace/Lucene-Solr-SmokeRelease-5.x/lucene/build/smokeTestRelease/tmp/unpack/solr-5.5.0/lucene/build/analysis/common/classes/java/org/apache/lucene/analysis/gl/package-info.class
[smoker] [javac] Creating empty /x1/jenkins/jenkins-slave/workspace/Lucene-Solr-SmokeRelease-5.x/lucene/build/smokeTestRelease/tmp/unpack/solr-5.5.0/lucene/build/analysis/common/classes/java/org/apache/lucene/analysis/th/package-info.class
[smoker] [javac] Creating empty /x1/jenkins/jenkins-slave/workspace/Lucene-Solr-SmokeRelease-5.x/lucene/build/smokeTestRelease/tmp/unpack/solr-5.5.0/lucene/build/analysis/common/classes/java/org/apache/lucene/analysis/reverse/package-info.class
[smoker] [javac] Creating empty /x1/jenkins/jenkins-slave/workspace/Lucene-Solr-SmokeRelease-5.x/lucene/build/smokeTestRelease/tmp/unpack/solr-5.5.0/lucene/build/analysis/common/classes/java/org/apache/lucene/collation/package-info.class
[smoker] [javac] Creating empty /x1/jenkins/jenkins-slave/workspace/Lucene-Solr-SmokeRelease-5.x/lucene/build/smokeTestRelease/tmp/unpack/solr-5.5.0/lucene/build/analysis/common/classes/java/org/apache/lucene/analysis/br/package-info.class
[smoker] [javac] Creating empty /x1/jenkins/jenkins-slave/workspace/Lucene-Solr-SmokeRelease-5.x/lucene/build/smokeTestRelease/tmp/unpack/solr-5.5.0/lucene/build/analysis/common/classes/java/org/apache/lucene/analysis/payloads/package-info.class
[smoker] [javac] Creating empty /x1/jenkins/jenkins-slave/workspace/Lucene-Solr-SmokeRelease-5.x/lucene/build/smokeTestRelease/tmp/unpack/solr-5.5.0/lucene/build/analysis/common/classes/java/org/apache/lucene/analysis/hi/package-info.class
[smoker] [javac] Creating empty /x1/jenkins/jenkins-slave/workspace/Lucene-Solr-SmokeRelease-5.x/lucene/build/smokeTestRelease/tmp/unpack/solr-5.5.0/lucene/build/analysis/common/classes/java/org/apache/lucene/analysis/snowball/package-info.class
[smoker] [javac] Creating empty /x1/jenkins/jenkins-slave/workspace/Lucene-Solr-SmokeRelease-5.x/lucene/build/smokeTestRelease/tmp/unpack/solr-5.5.0/lucene/build/analysis/common/classes/java/org/apache/lucene/analysis/fr/package-info.class
[smoker] [javac] Creating empty /x1/jenkins/jenkins-slave/workspace/Lucene-Solr-SmokeRelease-5.x/lucene/build/smokeTestRelease/tmp/unpack/solr-5.5.0/lucene/build/analysis/common/classes/java/org/apache/lucene/analysis/bg/package-info.class
[smoker] [javac] Creating empty /x1/jenkins/jenkins-slave/workspace/Lucene-Solr-SmokeRelease-5.x/lucene/build/smokeTestRelease/tmp/unpack/solr-5.5.0/lucene/build/analysis/common/classes/java/org/apache/lucene/analysis/fa/package-info.class
[smoker] [javac] Creating empty /x1/jenkins/jenkins-slave/workspace/Lucene-Solr-SmokeRelease-5.x/lucene/build/smokeTestRelease/tmp/unpack/solr-5.5.0/lucene/build/analysis/common/classes/java/org/apache/lucene/analysis/hy/package-info.class
[smoker] [javac] Creating empty /x1/jenkins/jenkins-slave/workspace/Lucene-Solr-SmokeRelease-5.x/lucene/build/smokeTestRelease/tmp/unpack/solr-5.5.0/lucene/build/analysis/common/classes/java/org/apache/lucene/analysis/lt/package-info.class
[smoker] [javac] Creating empty /x1/jenkins/jenkins-slave/workspace/Lucene-Solr-SmokeRelease-5.x/lucene/build/smokeTestRelease/tmp/unpack/solr-5.5.0/lucene/build/analysis/common/classes/java/org/apache/lucene/analysis/fi/package-info.class
[smoker] [javac] Creating empty /x1/jenkins/jenkins-slave/workspace/Lucene-Solr-SmokeRelease-5.x/lucene/build/smokeTestRelease/tmp/unpack/solr-5.5.0/lucene/build/analysis/common/classes/java/org/apache/lucene/analysis/lv/package-info.class
[smoker] [javac] Creating empty /x1/jenkins/jenkins-slave/workspace/Lucene-Solr-SmokeRelease-5.x/lucene/build/smokeTestRelease/tmp/unpack/solr-5.5.0/lucene/build/analysis/common/classes/java/org/apache/lucene/analysis/pattern/package-info.class
[smoker] [javac] Creating empty /x1/jenkins/jenkins-slave/workspace/Lucene-Solr-SmokeRelease-5.x/lucene/build/smokeTestRelease/tmp/unpack/solr-5.5.0/lucene/build/analysis/common/classes/java/org/apache/lucene/analysis/hu/package-info.class
[smoker] [javac] Creating empty /x1/jenkins/jenkins-slave/workspace/Lucene-Solr-SmokeRelease-5.x/lucene/build/smokeTestRelease/tmp/unpack/solr-5.5.0/lucene/build/analysis/common/classes/java/org/apache/lucene/analysis/core/package-info.class
[smoker] [javac] Creating empty /x1/jenkins/jenkins-slave/workspace/Lucene-Solr-SmokeRelease-5.x/lucene/build/smokeTestRelease/tmp/unpack/solr-5.5.0/lucene/build/analysis/common/classes/java/org/apache/lucene/analysis/en/package-info.class
[smoker] [javac] Creating empty /x1/jenkins/jenkins-slave/workspace/Lucene-Solr-SmokeRelease-5.x/lucene/build/smokeTestRelease/tmp/unpack/solr-5.5.0/lucene/build/analysis/common/classes/java/org/apache/lucene/analysis/ar/package-info.class
[smoker] [javac] Creating empty /x1/jenkins/jenkins-slave/workspace/Lucene-Solr-SmokeRelease-5.x/lucene/build/smokeTestRelease/tmp/unpack/solr-5.5.0/lucene/build/analysis/common/classes/java/org/apache/lucene/analysis/id/package-info.class
[smoker] [javac] Creating empty /x1/jenkins/jenkins-slave/workspace/Lucene-Solr-SmokeRelease-5.x/lucene/build/smokeTestRelease/tmp/unpack/solr-5.5.0/lucene/build/analysis/common/classes/java/org/apache/lucene/analysis/wikipedia/package-info.class
[smoker] [javac] Creating empty /x1/jenkins/jenkins-slave/workspace/Lucene-Solr-SmokeRelease-5.x/lucene/build/smokeTestRelease/tmp/unpack/solr-5.5.0/lucene/build/analysis/common/classes/java/org/apache/lucene/analysis/standard/package-info.class
[smoker] [javac] Creating empty /x1/jenkins/jenkins-slave/workspace/Lucene-Solr-SmokeRelease-5.x/lucene/build/smokeTestRelease/tmp/unpack/solr-5.5.0/lucene/build/analysis/common/classes/java/org/apache/lucene/analysis/el/package-info.class
[smoker] [javac] Creating empty /x1/jenkins/jenkins-slave/workspace/Lucene-Solr-SmokeRelease-5.x/lucene/build/smokeTestRelease/tmp/unpack/solr-5.5.0/lucene/build/analysis/common/classes/java/org/apache/lucene/analysis/pt/package-info.class
[smoker] [javac] Creating empty /x1/jenkins/jenkins-slave/workspace/Lucene-Solr-SmokeRelease-5.x/lucene/build/smokeTestRelease/tmp/unpack/solr-5.5.0/lucene/build/analysis/common/classes/java/org/apache/lucene/analysis/query/package-info.class
[smoker] [javac] Creating empty /x1/jenkins/jenkins-slave/workspace/Lucene-Solr-SmokeRelease-5.x/lucene/build/smokeTestRelease/tmp/unpack/solr-5.5.0/lucene/build/analysis/common/classes/java/org/apache/lucene/analysis/eu/package-info.class
[smoker] [javac] Creating empty /x1/jenkins/jenkins-slave/workspace/Lucene-Solr-SmokeRelease-5.x/lucene/build/smokeTestRelease/tmp/unpack/solr-5.5.0/lucene/build/analysis/common/classes/java/org/apache/lucene/analysis/es/package-info.class
[smoker] [javac] Creating empty /x1/jenkins/jenkins-slave/workspace/Lucene-Solr-SmokeRelease-5.x/lucene/build/smokeTestRelease/tmp/unpack/solr-5.5.0/lucene/build/analysis/common/classes/java/org/tartarus/snowball/ext/package-info.class
[smoker] [javac] Creating empty /x1/jenkins/jenkins-slave/workspace/Lucene-Solr-SmokeRelease-5.x/lucene/build/smokeTestRelease/tmp/unpack/solr-5.5.0/lucene/build/analysis/common/classes/java/org/apache/lucene/analysis/custom/package-info.class
[smoker] [javac] Creating empty /x1/jenkins/jenkins-slave/workspace/Lucene-Solr-SmokeRelease-5.x/lucene/build/smokeTestRelease/tmp/unpack/solr-5.5.0/lucene/build/analysis/common/classes/java/org/apache/lucene/analysis/in/package-info.class
[smoker] [javac] Creating empty /x1/jenkins/jenkins-slave/workspace/Lucene-Solr-SmokeRelease-5.x/lucene/build/smokeTestRelease/tmp/unpack/solr-5.5.0/lucene/build/analysis/common/classes/java/org/apache/lucene/analysis/ngram/package-info.class
[smoker] [javac] Creating empty /x1/jenkins/jenkins-slave/workspace/Lucene-Solr-SmokeRelease-5.x/lucene/build/smokeTestRelease/tmp/unpack/solr-5.5.0/lucene/build/analysis/common/classes/java/org/apache/lucene/analysis/path/package-info.class
[smoker] [javac] Creating empty /x1/jenkins/jenkins-slave/workspace/Lucene-Solr-SmokeRelease-5.x/lucene/build/smokeTestRelease/tmp/unpack/solr-5.5.0/lucene/build/analysis/common/classes/java/org/apache/lucene/analysis/sinks/package-info.class
[smoker] [javac] Creating empty /x1/jenkins/jenkins-slave/workspace/Lucene-Solr-SmokeRelease-5.x/lucene/build/smokeTestRelease/tmp/unpack/solr-5.5.0/lucene/build/analysis/common/classes/java/org/apache/lucene/analysis/it/package-info.class
[smoker] [javac] Creating empty /x1/jenkins/jenkins-slave/workspace/Lucene-Solr-SmokeRelease-5.x/lucene/build/smokeTestRelease/tmp/unpack/solr-5.5.0/lucene/build/analysis/common/classes/java/org/tartarus/snowball/package-info.class
[smoker] [javac] Creating empty /x1/jenkins/jenkins-slave/workspace/Lucene-Solr-SmokeRelease-5.x/lucene/build/smokeTestRelease/tmp/unpack/solr-5.5.0/lucene/build/analysis/common/classes/java/org/apache/lucene/analysis/cjk/package-info.class
[smoker] [javac] Creating empty /x1/jenkins/jenkins-slave/workspace/Lucene-Solr-SmokeRelease-5.x/lucene/build/smokeTestRelease/tmp/unpack/solr-5.5.0/lucene/build/analysis/common/classes/java/org/apache/lucene/analysis/commongrams/package-info.class
[smoker] [javac] Creating empty /x1/jenkins/jenkins-slave/workspace/Lucene-Solr-SmokeRelease-5.x/lucene/build/smokeTestRelease/tmp/unpack/solr-5.5.0/lucene/build/analysis/common/classes/java/org/apache/lucene/analysis/hunspell/package-info.class
[smoker] [javac] Creating empty /x1/jenkins/jenkins-slave/workspace/Lucene-Solr-SmokeRelease-5.x/lucene/build/smokeTestRelease/tmp/unpack/solr-5.5.0/lucene/build/analysis/common/classes/java/org/apache/lucene/analysis/ro/package-info.class
[smoker] [javac] Creating empty /x1/jenkins/jenkins-slave/workspace/Lucene-Solr-SmokeRelease-5.x/lucene/build/smokeTestRelease/tmp/unpack/solr-5.5.0/lucene/build/analysis/common/classes/java/org/apache/lucene/analysis/ru/package-info.class
[smoker] [javac] Creating empty /x1/jenkins/jenkins-slave/workspace/Lucene-Solr-SmokeRelease-5.x/lucene/build/smokeTestRelease/tmp/unpack/solr-5.5.0/lucene/build/analysis/common/classes/java/org/apache/lucene/analysis/nl/package-info.class
[smoker] [javac] Creating empty /x1/jenkins/jenkins-slave/workspace/Lucene-Solr-SmokeRelease-5.x/lucene/build/smokeTestRelease/tmp/unpack/solr-5.5.0/lucene/build/analysis/common/classes/java/org/apache/lucene/analysis/ckb/package-info.class
[smoker] [javac] Creating empty /x1/jenkins/jenkins-slave/workspace/Lucene-Solr-SmokeRelease-5.x/lucene/build/smokeTestRelease/tmp/unpack/solr-5.5.0/lucene/build/analysis/common/classes/java/org/apache/lucene/analysis/no/package-info.class
[smoker] [javac] Creating empty /x1/jenkins/jenkins-slave/workspace/Lucene-Solr-SmokeRelease-5.x/lucene/build/smokeTestRelease/tmp/unpack/solr-5.5.0/lucene/build/analysis/common/classes/java/org/apache/lucene/analysis/shingle/package-info.class
[smoker] [javac] Creating empty /x1/jenkins/jenkins-slave/workspace/Lucene-Solr-SmokeRelease-5.x/lucene/build/smokeTestRelease/tmp/unpack/solr-5.5.0/lucene/build/analysis/common/classes/java/org/apache/lucene/analysis/compound/package-info.class
[smoker] [javac] Creating empty /x1/jenkins/jenkins-slave/workspace/Lucene-Solr-SmokeRelease-5.x/lucene/build/smokeTestRelease/tmp/unpack/solr-5.5.0/lucene/build/analysis/common/classes/java/org/apache/lucene/analysis/cz/package-info.class
[smoker] [javac] Creating empty /x1/jenkins/jenkins-slave/workspace/Lucene-Solr-SmokeRelease-5.x/lucene/build/smokeTestRelease/tmp/unpack/solr-5.5.0/lucene/build/analysis/common/classes/java/org/apache/lucene/collation/tokenattributes/package-info.class
[smoker] [javac] Creating empty /x1/jenkins/jenkins-slave/workspace/Lucene-Solr-SmokeRelease-5.x/lucene/build/smokeTestRelease/tmp/unpack/solr-5.5.0/lucene/build/analysis/common/classes/java/org/apache/lucene/analysis/sr/package-info.class
[smoker] [javac] Creating empty /x1/jenkins/jenkins-slave/workspace/Lucene-Solr-SmokeRelease-5.x/lucene/build/smokeTestRelease/tmp/unpack/solr-5.5.0/lucene/build/analysis/common/classes/java/org/apache/lucene/analysis/charfilter/package-info.class
[smoker] [javac] Creating empty /x1/jenkins/jenkins-slave/workspace/Lucene-Solr-SmokeRelease-5.x/lucene/build/smokeTestRelease/tmp/unpack/solr-5.5.0/lucene/build/analysis/common/classes/java/org/apache/lucene/analysis/miscellaneous/package-info.class
[smoker] [javac] Creating empty /x1/jenkins/jenkins-slave/workspace/Lucene-Solr-SmokeRelease-5.x/lucene/build/smokeTestRelease/tmp/unpack/solr-5.5.0/lucene/build/analysis/common/classes/java/org/apache/lucene/analysis/da/package-info.class
[smoker] [javac] Creating empty /x1/jenkins/jenkins-slave/workspace/Lucene-Solr-SmokeRelease-5.x/lucene/build/smokeTestRelease/tmp/unpack/solr-5.5.0/lucene/build/analysis/common/classes/java/org/apache/lucene/analysis/util/package-info.class
[smoker] [javac] Creating empty /x1/jenkins/jenkins-slave/workspace/Lucene-Solr-SmokeRelease-5.x/lucene/build/smokeTestRelease/tmp/unpack/solr-5.5.0/lucene/build/analysis/common/classes/java/org/apache/lucene/analysis/sv/package-info.class
[smoker] [javac] Creating empty /x1/jenkins/jenkins-slave/workspace/Lucene-Solr-SmokeRelease-5.x/lucene/build/smokeTestRelease/tmp/unpack/solr-5.5.0/lucene/build/analysis/common/classes/java/org/apache/lucene/analysis/de/package-info.class
[smoker] [copy] Copying 39 files to /x1/jenkins/jenkins-slave/workspace/Lucene-Solr-SmokeRelease-5.x/lucene/build/smokeTestRelease/tmp/unpack/solr-5.5.0/lucene/build/analysis/common/classes/java
[smoker]
[smoker] jar-core:
[smoker] [jar] Building jar: /x1/jenkins/jenkins-slave/workspace/Lucene-Solr-SmokeRelease-5.x/lucene/build/smokeTestRelease/tmp/unpack/solr-5.5.0/lucene/build/analysis/common/lucene-analyzers-common-5.5.0-SNAPSHOT.jar
[smoker]
[smoker] ivy-availability-check:
[smoker]
[smoker] ivy-fail:
[smoker]
[smoker] ivy-configure:
[smoker] [ivy:configure] :: loading settings :: file = /x1/jenkins/jenkins-slave/workspace/Lucene-Solr-SmokeRelease-5.x/lucene/build/smokeTestRelease/tmp/unpack/solr-5.5.0/lucene/ivy-settings.xml
[smoker]
[smoker] resolve:
[smoker]
[smoker] common.init:
[smoker]
[smoker] compile-lucene-core:
[smoker]
[smoker] ivy-availability-check:
[smoker]
[smoker] ivy-fail:
[smoker]
[smoker] ivy-configure:
[smoker] [ivy:configure] :: loading settings :: file = /x1/jenkins/jenkins-slave/workspace/Lucene-Solr-SmokeRelease-5.x/lucene/build/smokeTestRelease/tmp/unpack/solr-5.5.0/lucene/ivy-settings.xml
[smoker]
[smoker] resolve:
[smoker]
[smoker] init:
[smoker]
[smoker] -clover.disable:
[smoker]
[smoker] -clover.load:
[smoker]
[smoker] -clover.classpath:
[smoker]
[smoker] -clover.setup:
[smoker]
[smoker] clover:
[smoker]
[smoker] compile-core:
[smoker]
[smoker] init:
[smoker]
[smoker] -clover.disable:
[smoker]
[smoker] -clover.load:
[smoker]
[smoker] -clover.classpath:
[smoker]
[smoker] -clover.setup:
[smoker]
[smoker] clover:
[smoker]
[smoker] common.compile-core:
[smoker] [mkdir] Created dir: /x1/jenkins/jenkins-slave/workspace/Lucene-Solr-SmokeRelease-5.x/lucene/build/smokeTestRelease/tmp/unpack/solr-5.5.0/lucene/build/analysis/kuromoji/classes/java
[smoker] [javac] Compiling 38 source files to /x1/jenkins/jenkins-slave/workspace/Lucene-Solr-SmokeRelease-5.x/lucene/build/smokeTestRelease/tmp/unpack/solr-5.5.0/lucene/build/analysis/kuromoji/classes/java
[smoker] [javac] Note: Some input files use or override a deprecated API.
[smoker] [javac] Note: Recompile with -Xlint:deprecation for details.
[smoker] [javac] Creating empty /x1/jenkins/jenkins-slave/workspace/Lucene-Solr-SmokeRelease-5.x/lucene/build/smokeTestRelease/tmp/unpack/solr-5.5.0/lucene/build/analysis/kuromoji/classes/java/org/apache/lucene/analysis/ja/package-info.class
[smoker] [javac] Creating empty /x1/jenkins/jenkins-slave/workspace/Lucene-Solr-SmokeRelease-5.x/lucene/build/smokeTestRelease/tmp/unpack/solr-5.5.0/lucene/build/analysis/kuromoji/classes/java/org/apache/lucene/analysis/ja/dict/package-info.class
[smoker] [javac] Creating empty /x1/jenkins/jenkins-slave/workspace/Lucene-Solr-SmokeRelease-5.x/lucene/build/smokeTestRelease/tmp/unpack/solr-5.5.0/lucene/build/analysis/kuromoji/classes/java/org/apache/lucene/analysis/ja/tokenattributes/package-info.class
[smoker] [javac] Creating empty /x1/jenkins/jenkins-slave/workspace/Lucene-Solr-SmokeRelease-5.x/lucene/build/smokeTestRelease/tmp/unpack/solr-5.5.0/lucene/build/analysis/kuromoji/classes/java/org/apache/lucene/analysis/ja/util/package-info.class
[smoker] [copy] Copying 14 files to /x1/jenkins/jenkins-slave/workspace/Lucene-Solr-SmokeRelease-5.x/lucene/build/smokeTestRelease/tmp/unpack/solr-5.5.0/lucene/build/analysis/kuromoji/classes/java
[smoker]
[smoker] compile-core:
[smoker]
[smoker] common.compile-tools:
[smoker]
[smoker] ivy-availability-check:
[smoker]
[smoker] ivy-fail:
[smoker]
[smoker] ivy-configure:
[smoker] [ivy:configure] :: loading settings :: file = /x1/jenkins/jenkins-slave/workspace/Lucene-Solr-SmokeRelease-5.x/lucene/build/smokeTestRelease/tmp/unpack/solr-5.5.0/lucene/ivy-settings.xml
[smoker]
[smoker] resolve:
[smoker]
[smoker] init:
[smoker]
[smoker] compile-core:
[smoker]
[smoker] compile-tools:
[smoker] [mkdir] Created dir: /x1/jenkins/jenkins-slave/workspace/Lucene-Solr-SmokeRelease-5.x/lucene/build/smokeTestRelease/tmp/unpack/solr-5.5.0/lucene/build/analysis/kuromoji/classes/tools
[smoker] [javac] Compiling 9 source files to /x1/jenkins/jenkins-slave/workspace/Lucene-Solr-SmokeRelease-5.x/lucene/build/smokeTestRelease/tmp/unpack/solr-5.5.0/lucene/build/analysis/kuromoji/classes/tools
[smoker]
[smoker] compile-tools:
[smoker]
[smoker] ivy-availability-check:
[smoker]
[smoker] ivy-fail:
[smoker]
[smoker] ivy-configure:
[smoker] [ivy:configure] :: loading settings :: file = /x1/jenkins/jenkins-slave/workspace/Lucene-Solr-SmokeRelease-5.x/lucene/build/smokeTestRelease/tmp/unpack/solr-5.5.0/lucene/ivy-settings.xml
[smoker]
[smoker] resolve:
[smoker]
[smoker] init:
[smoker]
[smoker] compile-core:
[smoker]
[smoker] compile-tools:
[smoker]
[smoker] ivy-availability-check:
[smoker]
[smoker] ivy-fail:
[smoker]
[smoker] ivy-configure:
[smoker] [ivy:configure] :: loading settings :: file = /x1/jenkins/jenkins-slave/workspace/Lucene-Solr-SmokeRelease-5.x/lucene/build/smokeTestRelease/tmp/unpack/solr-5.5.0/lucene/ivy-settings.xml
[smoker]
[smoker] resolve:
[smoker]
[smoker] init:
[smoker]
[smoker] compile-core:
[smoker]
[smoker] compile-tools:
[smoker]
[smoker] ivy-availability-check:
[smoker]
[smoker] ivy-fail:
[smoker]
[smoker] ivy-configure:
[smoker] [ivy:configure] :: loading settings :: file = /x1/jenkins/jenkins-slave/workspace/Lucene-Solr-SmokeRelease-5.x/lucene/build/smokeTestRelease/tmp/unpack/solr-5.5.0/lucene/ivy-settings.xml
[smoker]
[smoker] resolve:
[smoker]
[smoker] init:
[smoker]
[smoker] compile-core:
[smoker]
[smoker] compile-tools:
[smoker]
[smoker] ivy-availability-check:
[smoker]
[smoker] ivy-fail:
[smoker]
[smoker] ivy-configure:
[smoker] [ivy:configure] :: loading settings :: file = /x1/jenkins/jenkins-slave/workspace/Lucene-Solr-SmokeRelease-5.x/lucene/build/smokeTestRelease/tmp/unpack/solr-5.5.0/lucene/ivy-settings.xml
[smoker]
[smoker] resolve:
[smoker]
[smoker] init:
[smoker]
[smoker] compile-core:
[smoker]
[smoker] compile-tools:
[smoker]
[smoker] ivy-availability-check:
[smoker]
[smoker] ivy-fail:
[smoker]
[smoker] ivy-configure:
[smoker] [ivy:configure] :: loading settings :: file = /x1/jenkins/jenkins-slave/workspace/Lucene-Solr-SmokeRelease-5.x/lucene/build/smokeTestRelease/tmp/unpack/solr-5.5.0/lucene/ivy-settings.xml
[smoker]
[smoker] resolve:
[smoker]
[smoker] init:
[smoker]
[smoker] compile-core:
[smoker]
[smoker] compile-tools:
[smoker]
[smoker] ivy-availability-check:
[smoker]
[smoker] ivy-fail:
[smoker]
[smoker] ivy-configure:
[smoker] [ivy:configure] :: loading settings :: file = /x1/jenkins/jenkins-slave/workspace/Lucene-Solr-SmokeRelease-5.x/lucene/build/smokeTestRelease/tmp/unpack/solr-5.5.0/lucene/ivy-settings.xml
[smoker]
[smoker] resolve:
[smoker]
[smoker] init:
[smoker]
[smoker] compile-core:
[smoker]
[smoker] compile-tools:
[smoker]
[smoker] ivy-availability-check:
[smoker]
[smoker] ivy-fail:
[smoker]
[smoker] ivy-configure:
[smoker] [ivy:configure] :: loading settings :: file = /x1/jenkins/jenkins-slave/workspace/Lucene-Solr-SmokeRelease-5.x/lucene/build/smokeTestRelease/tmp/unpack/solr-5.5.0/lucene/ivy-settings.xml
[smoker]
[smoker] resolve:
[smoker]
[smoker] init:
[smoker]
[smoker] compile-core:
[smoker]
[smoker] compile-tools:
[smoker]
[smoker] ivy-availability-check:
[smoker]
[smoker] ivy-fail:
[smoker]
[smoker] ivy-configure:
[smoker] [ivy:configure] :: loading settings :: file = /x1/jenkins/jenkins-slave/workspace/Lucene-Solr-SmokeRelease-5.x/lucene/build/smokeTestRelease/tmp/unpack/solr-5.5.0/lucene/ivy-settings.xml
[smoker]
[smoker] resolve:
[smoker]
[smoker] init:
[smoker]
[smoker] compile-core:
[smoker]
[smoker] compile-tools:
[smoker]
[smoker] ivy-availability-check:
[smoker]
[smoker] ivy-fail:
[smoker]
[smoker] ivy-configure:
[smoker] [ivy:configure] :: loading settings :: file = /x1/jenkins/jenkins-slave/workspace/Lucene-Solr-SmokeRelease-5.x/lucene/build/smokeTestRelease/tmp/unpack/solr-5.5.0/lucene/ivy-settings.xml
[smoker]
[smoker] resolve:
[smoker]
[smoker] init:
[smoker]
[smoker] compile-core:
[smoker]
[smoker] compile-tools:
[smoker]
[smoker] ivy-availability-check:
[smoker]
[smoker] ivy-fail:
[smoker]
[smoker] ivy-configure:
[smoker] [ivy:configure] :: loading settings :: file = /x1/jenkins/jenkins-slave/workspace/Lucene-Solr-SmokeRelease-5.x/lucene/build/smokeTestRelease/tmp/unpack/solr-5.5.0/lucene/ivy-settings.xml
[smoker]
[smoker] resolve:
[smoker]
[smoker] init:
[smoker]
[smoker] compile-core:
[smoker]
[smoker] compile-tools:
[smoker]
[smoker] ivy-availability-check:
[smoker]
[smoker] ivy-fail:
[smoker]
[smoker] ivy-configure:
[smoker] [ivy:configure] :: loading settings :: file = /x1/jenkins/jenkins-slave/workspace/Lucene-Solr-SmokeRelease-5.x/lucene/build/smokeTestRelease/tmp/unpack/solr-5.5.0/lucene/ivy-settings.xml
[smoker]
[smoker] resolve:
[smoker]
[smoker] init:
[smoker]
[smoker] compile-core:
[smoker]
[smoker] compile-tools:
[smoker]
[smoker] ivy-availability-check:
[smoker]
[smoker] ivy-fail:
[smoker]
[smoker] ivy-configure:
[smoker] [ivy:configure] :: loading settings :: file = /x1/jenkins/jenkins-slave/workspace/Lucene-Solr-SmokeRelease-5.x/lucene/build/smokeTestRelease/tmp/unpack/solr-5.5.0/lucene/ivy-settings.xml
[smoker]
[smoker] resolve:
[smoker]
[smoker] init:
[smoker]
[smoker] compile-core:
[smoker]
[smoker] compile-tools:
[smoker]
[smoker] ivy-availability-check:
[smoker]
[smoker] ivy-fail:
[smoker]
[smoker] ivy-configure:
[smoker] [ivy:configure] :: loading settings :: file = /x1/jenkins/jenkins-slave/workspace/Lucene-Solr-SmokeRelease-5.x/lucene/build/smokeTestRelease/tmp/unpack/solr-5.5.0/lucene/ivy-settings.xml
[smoker]
[smoker] resolve:
[smoker]
[smoker] init:
[smoker]
[smoker] compile-core:
[smoker]
[smoker] compile-tools:
[smoker]
[smoker] ivy-availability-check:
[smoker]
[smoker] ivy-fail:
[smoker]
[smoker] ivy-configure:
[smoker] [ivy:configure] :: loading settings :: file = /x1/jenkins/jenkins-slave/workspace/Lucene-Solr-SmokeRelease-5.x/lucene/build/smokeTestRelease/tmp/unpack/solr-5.5.0/lucene/ivy-settings.xml
[smoker]
[smoker] resolve:
[smoker]
[smoker] init:
[smoker]
[smoker] compile-core:
[smoker]
[smoker] compile-tools:
[smoker]
[smoker] ivy-availability-check:
[smoker]
[smoker] ivy-fail:
[smoker]
[smoker] ivy-configure:
[smoker] [ivy:configure] :: loading settings :: file = /x1/jenkins/jenkins-slave/workspace/Lucene-Solr-SmokeRelease-5.x/lucene/build/smokeTestRelease/tmp/unpack/solr-5.5.0/lucene/ivy-settings.xml
[smoker]
[smoker] resolve:
[smoker]
[smoker] init:
[smoker]
[smoker] compile-core:
[smoker]
[smoker] compile-tools:
[smoker]
[smoker] ivy-availability-check:
[smoker]
[smoker] ivy-fail:
[smoker]
[smoker] ivy-configure:
[smoker] [ivy:configure] :: loading settings :: file = /x1/jenkins/jenkins-slave/workspace/Lucene-Solr-SmokeRelease-5.x/lucene/build/smokeTestRelease/tmp/unpack/solr-5.5.0/lucene/ivy-settings.xml
[smoker]
[smoker] resolve:
[smoker]
[smoker] init:
[smoker]
[smoker] compile-core:
[smoker]
[smoker] compile-tools:
[smoker]
[smoker] ivy-availability-check:
[smoker]
[smoker] ivy-fail:
[smoker]
[smoker] ivy-configure:
[smoker] [ivy:configure] :: loading settings :: file = /x1/jenkins/jenkins-slave/workspace/Lucene-Solr-SmokeRelease-5.x/lucene/build/smokeTestRelease/tmp/unpack/solr-5.5.0/lucene/ivy-settings.xml
[smoker]
[smoker] resolve:
[smoker]
[smoker] init:
[smoker]
[smoker] compile-core:
[smoker]
[smoker] compile-tools:
[smoker]
[smoker] ivy-availability-check:
[smoker]
[smoker] ivy-fail:
[smoker]
[smoker] ivy-configure:
[smoker] [ivy:configure] :: loading settings :: file = /x1/jenkins/jenkins-slave/workspace/Lucene-Solr-SmokeRelease-5.x/lucene/build/smokeTestRelease/tmp/unpack/solr-5.5.0/lucene/ivy-settings.xml
[smoker]
[smoker] resolve:
[smoker]
[smoker] init:
[smoker]
[smoker] compile-core:
[smoker]
[smoker] compile-tools:
[smoker]
[smoker] ivy-availability-check:
[smoker]
[smoker] ivy-fail:
[smoker]
[smoker] ivy-configure:
[smoker] [ivy:configure] :: loading settings :: file = /x1/jenkins/jenkins-slave/workspace/Lucene-Solr-SmokeRelease-5.x/lucene/build/smokeTestRelease/tmp/unpack/solr-5.5.0/lucene/ivy-settings.xml
[smoker]
[smoker] resolve:
[smoker]
[smoker] init:
[smoker]
[smoker] compile-core:
[smoker]
[smoker] compile-tools:
[smoker]
[smoker] ivy-availability-check:
[smoker]
[smoker] ivy-fail:
[smoker]
[smoker] ivy-configure:
[smoker] [ivy:configure] :: loading settings :: file = /x1/jenkins/jenkins-slave/workspace/Lucene-Solr-SmokeRelease-5.x/lucene/build/smokeTestRelease/tmp/unpack/solr-5.5.0/lucene/ivy-settings.xml
[smoker]
[smoker] resolve:
[smoker]
[smoker] init:
[smoker]
[smoker] compile-core:
[smoker]
[smoker] compile-tools:
[smoker]
[smoker] ivy-availability-check:
[smoker]
[smoker] ivy-fail:
[smoker]
[smoker] ivy-configure:
[smoker] [ivy:configure] :: loading settings :: file = /x1/jenkins/jenkins-slave/workspace/Lucene-Solr-SmokeRelease-5.x/lucene/build/smokeTestRelease/tmp/unpack/solr-5.5.0/lucene/ivy-settings.xml
[smoker]
[smoker] resolve:
[smoker]
[smoker] init:
[smoker]
[smoker] compile-core:
[smoker]
[smoker] compile-tools:
[smoker]
[smoker] ivy-availability-check:
[smoker]
[smoker] ivy-fail:
[smoker]
[smoker] ivy-configure:
[smoker] [ivy:configure] :: loading settings :: file = /x1/jenkins/jenkins-slave/workspace/Lucene-Solr-SmokeRelease-5.x/lucene/build/smokeTestRelease/tmp/unpack/solr-5.5.0/lucene/ivy-settings.xml
[smoker]
[smoker] resolve:
[smoker]
[smoker] init:
[smoker]
[smoker] compile-core:
[smoker]
[smoker] compile-tools:
[smoker]
[smoker] ivy-availability-check:
[smoker]
[smoker] ivy-fail:
[smoker]
[smoker] ivy-configure:
[smoker] [ivy:configure] :: loading settings :: file = /x1/jenkins/jenkins-slave/workspace/Lucene-Solr-SmokeRelease-5.x/lucene/build/smokeTestRelease/tmp/unpack/solr-5.5.0/lucene/ivy-settings.xml
[smoker]
[smoker] resolve:
[smoker]
[smoker] init:
[smoker]
[smoker] compile-core:
[smoker]
[smoker] compile-tools:
[smoker]
[smoker] ivy-availability-check:
[smoker]
[smoker] ivy-fail:
[smoker]
[smoker] ivy-configure:
[smoker] [ivy:configure] :: loading settings :: file = /x1/jenkins/jenkins-slave/workspace/Lucene-Solr-SmokeRelease-5.x/lucene/build/smokeTestRelease/tmp/unpack/solr-5.5.0/lucene/ivy-settings.xml
[smoker]
[smoker] resolve:
[smoker]
[smoker] init:
[smoker]
[smoker] compile-core:
[smoker]
[smoker] resolve:
[smoker]
[smoker] ivy-availability-check:
[smoker]
[smoker] ivy-fail:
[smoker]
[smoker] ivy-configure:
[smoker] [ivy:configure] :: loading settings :: file = /x1/jenkins/jenkins-slave/workspace/Lucene-Solr-SmokeRelease-5.x/lucene/build/smokeTestRelease/tmp/unpack/solr-5.5.0/lucene/ivy-settings.xml
[smoker]
[smoker] resolve:
[smoker]
[smoker] ivy-availability-check:
[smoker]
[smoker] ivy-fail:
[smoker]
[smoker] ivy-configure:
[smoker] [ivy:configure] :: loading settings :: file = /x1/jenkins/jenkins-slave/workspace/Lucene-Solr-SmokeRelease-5.x/lucene/build/smokeTestRelease/tmp/unpack/solr-5.5.0/lucene/ivy-settings.xml
[smoker]
[smoker] resolve:
[smoker]
[smoker] resolve:
[smoker]
[smoker] ivy-availability-check:
[smoker]
[smoker] ivy-fail:
[smoker]
[smoker] ivy-configure:
[smoker] [ivy:configure] :: loading settings :: file = /x1/jenkins/jenkins-slave/workspace/Lucene-Solr-SmokeRelease-5.x/lucene/build/smokeTestRelease/tmp/unpack/solr-5.5.0/lucene/ivy-settings.xml
[smoker]
[smoker] resolve:
[smoker]
[smoker] ivy-availability-check:
[smoker]
[smoker] ivy-fail:
[smoker]
[smoker] ivy-configure:
[smoker] [ivy:configure] :: loading settings :: file = /x1/jenkins/jenkins-slave/workspace/Lucene-Solr-SmokeRelease-5.x/lucene/build/smokeTestRelease/tmp/unpack/solr-5.5.0/lucene/ivy-settings.xml
[smoker]
[smoker] resolve:
[smoker]
[smoker] ivy-availability-check:
[smoker]
[smoker] ivy-fail:
[smoker]
[smoker] ivy-configure:
[smoker] [ivy:configure] :: loading settings :: file = /x1/jenkins/jenkins-slave/workspace/Lucene-Solr-SmokeRelease-5.x/lucene/build/smokeTestRelease/tmp/unpack/solr-5.5.0/lucene/ivy-settings.xml
[smoker]
[smoker] resolve:
[smoker]
[smoker] ivy-availability-check:
[smoker]
[smoker] ivy-fail:
[smoker]
[smoker] ivy-configure:
[smoker] [ivy:configure] :: loading settings :: file = /x1/jenkins/jenkins-slave/workspace/Lucene-Solr-SmokeRelease-5.x/lucene/build/smokeTestRelease/tmp/unpack/solr-5.5.0/lucene/ivy-settings.xml
[smoker]
[smoker] resolve:
[smoker]
[smoker] ivy-availability-check:
[smoker]
[smoker] ivy-fail:
[smoker]
[smoker] ivy-configure:
[smoker] [ivy:configure] :: loading settings :: file = /x1/jenkins/jenkins-slave/workspace/Lucene-Solr-SmokeRelease-5.x/lucene/build/smokeTestRelease/tmp/unpack/solr-5.5.0/lucene/ivy-settings.xml
[smoker]
[smoker] resolve:
[smoker]
[smoker] ivy-availability-check:
[smoker]
[smoker] ivy-fail:
[smoker]
[smoker] ivy-configure:
[smoker] [ivy:configure] :: loading settings :: file = /x1/jenkins/jenkins-slave/workspace/Lucene-Solr-SmokeRelease-5.x/lucene/build/smokeTestRelease/tmp/unpack/solr-5.5.0/lucene/ivy-settings.xml
[smoker]
[smoker] resolve:
[smoker]
[smoker] ivy-availability-check:
[smoker]
[smoker] ivy-fail:
[smoker]
[smoker] ivy-configure:
[smoker] [ivy:configure] :: loading settings :: file = /x1/jenkins/jenkins-slave/workspace/Lucene-Solr-SmokeRelease-5.x/lucene/build/smokeTestRelease/tmp/unpack/solr-5.5.0/lucene/ivy-settings.xml
[smoker]
[smoker] resolve:
[smoker]
[smoker] ivy-availability-check:
[smoker]
[smoker] ivy-fail:
[smoker]
[smoker] ivy-configure:
[smoker] [ivy:configure] :: loading settings :: file = /x1/jenkins/jenkins-slave/workspace/Lucene-Solr-SmokeRelease-5.x/lucene/build/smokeTestRelease/tmp/unpack/solr-5.5.0/lucene/ivy-settings.xml
[smoker]
[smoker] resolve:
[smoker]
[smoker] ivy-availability-check:
[smoker]
[smoker] ivy-fail:
[smoker]
[smoker] ivy-configure:
[smoker] [ivy:configure] :: loading settings :: file = /x1/jenkins/jenkins-slave/workspace/Lucene-Solr-SmokeRelease-5.x/lucene/build/smokeTestRelease/tmp/unpack/solr-5.5.0/lucene/ivy-settings.xml
[smoker]
[smoker] resolve:
[smoker]
[smoker] ivy-availability-check:
[smoker]
[smoker] ivy-fail:
[smoker]
[smoker] ivy-configure:
[smoker] [ivy:configure] :: loading settings :: file = /x1/jenkins/jenkins-slave/workspace/Lucene-Solr-SmokeRelease-5.x/lucene/build/smokeTestRelease/tmp/unpack/solr-5.5.0/lucene/ivy-settings.xml
[smoker]
[smoker] resolve:
[smoker]
[smoker] ivy-availability-check:
[smoker]
[smoker] ivy-fail:
[smoker]
[smoker] ivy-configure:
[smoker] [ivy:configure] :: loading settings :: file = /x1/jenkins/jenkins-slave/workspace/Lucene-Solr-SmokeRelease-5.x/lucene/build/smokeTestRelease/tmp/unpack/solr-5.5.0/lucene/ivy-settings.xml
[smoker]
[smoker] resolve:
[smoker]
[smoker] ivy-availability-check:
[smoker]
[smoker] ivy-fail:
[smoker]
[smoker] ivy-configure:
[smoker] [ivy:configure] :: loading settings :: file = /x1/jenkins/jenkins-slave/workspace/Lucene-Solr-SmokeRelease-5.x/lucene/build/smokeTestRelease/tmp/unpack/solr-5.5.0/lucene/ivy-settings.xml
[smoker]
[smoker] resolve:
[smoker]
[smoker] ivy-availability-check:
[smoker]
[smoker] ivy-fail:
[smoker]
[smoker] ivy-configure:
[smoker] [ivy:configure] :: loading settings :: file = /x1/jenkins/jenkins-slave/workspace/Lucene-Solr-SmokeRelease-5.x/lucene/build/smokeTestRelease/tmp/unpack/solr-5.5.0/lucene/ivy-settings.xml
[smoker]
[smoker] resolve:
[smoker]
[smoker] ivy-availability-check:
[smoker]
[smoker] ivy-fail:
[smoker]
[smoker] ivy-configure:
[smoker] [ivy:configure] :: loading settings :: file = /x1/jenkins/jenkins-slave/workspace/Lucene-Solr-SmokeRelease-5.x/lucene/build/smokeTestRelease/tmp/unpack/solr-5.5.0/lucene/ivy-settings.xml
[smoker]
[smoker] resolve:
[smoker]
[smoker] ivy-availability-check:
[smoker]
[smoker] ivy-fail:
[smoker]
[smoker] ivy-configure:
[smoker] [ivy:configure] :: loading settings :: file = /x1/jenkins/jenkins-slave/workspace/Lucene-Solr-SmokeRelease-5.x/lucene/build/smokeTestRelease/tmp/unpack/solr-5.5.0/lucene/ivy-settings.xml
[smoker]
[smoker] resolve:
[smoker]
[smoker] ivy-availability-check:
[smoker]
[smoker] ivy-fail:
[smoker]
[smoker] ivy-configure:
[smoker] [ivy:configure] :: loading settings :: file = /x1/jenkins/jenkins-slave/workspace/Lucene-Solr-SmokeRelease-5.x/lucene/build/smokeTestRelease/tmp/unpack/solr-5.5.0/lucene/ivy-settings.xml
[smoker]
[smoker] resolve:
[smoker]
[smoker] ivy-availability-check:
[smoker]
[smoker] ivy-fail:
[smoker]
[smoker] ivy-configure:
[smoker] [ivy:configure] :: loading settings :: file = /x1/jenkins/jenkins-slave/workspace/Lucene-Solr-SmokeRelease-5.x/lucene/build/smokeTestRelease/tmp/unpack/solr-5.5.0/lucene/ivy-settings.xml
[smoker]
[smoker] resolve:
[smoker]
[smoker] ivy-availability-check:
[smoker]
[smoker] ivy-fail:
[smoker]
[smoker] ivy-configure:
[smoker] [ivy:configure] :: loading settings :: file = /x1/jenkins/jenkins-slave/workspace/Lucene-Solr-SmokeRelease-5.x/lucene/build/smokeTestRelease/tmp/unpack/solr-5.5.0/lucene/ivy-settings.xml
[smoker]
[smoker] resolve:
[smoker]
[smoker] ivy-availability-check:
[smoker]
[smoker] ivy-fail:
[smoker]
[smoker] ivy-configure:
[smoker] [ivy:configure] :: loading settings :: file = /x1/jenkins/jenkins-slave/workspace/Lucene-Solr-SmokeRelease-5.x/lucene/build/smokeTestRelease/tmp/unpack/solr-5.5.0/lucene/ivy-settings.xml
[smoker]
[smoker] resolve:
[smoker]
[smoker] ivy-availability-check:
[smoker]
[smoker] ivy-fail:
[smoker]
[smoker] ivy-configure:
[smoker] [ivy:configure] :: loading settings :: file = /x1/jenkins/jenkins-slave/workspace/Lucene-Solr-SmokeRelease-5.x/lucene/build/smokeTestRelease/tmp/unpack/solr-5.5.0/lucene/ivy-settings.xml
[smoker]
[smoker] resolve:
[smoker]
[smoker] ivy-availability-check:
[smoker]
[smoker] ivy-fail:
[smoker]
[smoker] ivy-configure:
[smoker] [ivy:configure] :: loading settings :: file = /x1/jenkins/jenkins-slave/workspace/Lucene-Solr-SmokeRelease-5.x/lucene/build/smokeTestRelease/tmp/unpack/solr-5.5.0/lucene/ivy-settings.xml
[smoker]
[smoker] resolve:
[smoker]
[smoker] ivy-availability-check:
[smoker]
[smoker] ivy-fail:
[smoker]
[smoker] ivy-configure:
[smoker] [ivy:configure] :: loading settings :: file = /x1/jenkins/jenkins-slave/workspace/Lucene-Solr-SmokeRelease-5.x/lucene/build/smokeTestRelease/tmp/unpack/solr-5.5.0/lucene/ivy-settings.xml
[smoker]
[smoker] resolve:
[smoker]
[smoker] ivy-availability-check:
[smoker]
[smoker] ivy-fail:
[smoker]
[smoker] ivy-configure:
[smoker] [ivy:configure] :: loading settings :: file = /x1/jenkins/jenkins-slave/workspace/Lucene-Solr-SmokeRelease-5.x/lucene/build/smokeTestRelease/tmp/unpack/solr-5.5.0/lucene/ivy-settings.xml
[smoker]
[smoker] common.resolve:
[smoker]
[smoker] resolve:
[smoker]
[smoker] ivy-availability-check:
[smoker]
[smoker] ivy-fail:
[smoker]
[smoker] ivy-configure:
[smoker] [ivy:configure] :: loading settings :: file = /x1/jenkins/jenkins-slave/workspace/Lucene-Solr-SmokeRelease-5.x/lucene/build/smokeTestRelease/tmp/unpack/solr-5.5.0/lucene/ivy-settings.xml
[smoker]
[smoker] resolve:
[smoker]
[smoker] ivy-availability-check:
[smoker]
[smoker] ivy-fail:
[smoker]
[smoker] ivy-configure:
[smoker] [ivy:configure] :: loading settings :: file = /x1/jenkins/jenkins-slave/workspace/Lucene-Solr-SmokeRelease-5.x/lucene/build/smokeTestRelease/tmp/unpack/solr-5.5.0/lucene/ivy-settings.xml
[smoker]
[smoker] resolve:
[smoker]
[smoker] ivy-availability-check:
[smoker]
[smoker] ivy-fail:
[smoker]
[smoker] ivy-configure:
[smoker] [ivy:configure] :: loading settings :: file = /x1/jenkins/jenkins-slave/workspace/Lucene-Solr-SmokeRelease-5.x/lucene/build/smokeTestRelease/tmp/unpack/solr-5.5.0/lucene/ivy-settings.xml
[smoker]
[smoker] resolve:
[smoker]
[smoker] ivy-availability-check:
[smoker]
[smoker] ivy-fail:
[smoker]
[smoker] ivy-configure:
[smoker] [ivy:configure] :: loading settings :: file = /x1/jenkins/jenkins-slave/workspace/Lucene-Solr-SmokeRelease-5.x/lucene/build/smokeTestRelease/tmp/unpack/solr-5.5.0/lucene/ivy-settings.xml
[smoker]
[smoker] resolve:
[smoker]
[smoker] load-custom-tasks:
[smoker]
[smoker] check-licenses:
[smoker] [echo] License check under: /x1/jenkins/jenkins-slave/workspace/Lucene-Solr-SmokeRelease-5.x/lucene/build/smokeTestRelease/tmp/unpack/solr-5.5.0/lucene
[smoker] [licenses] Scanned 35 JAR file(s) for licenses (in 0.56s.), 0 error(s).
[smoker]
[smoker] ivy-availability-check:
[smoker]
[smoker] ivy-fail:
[smoker]
[smoker] ivy-configure:
[smoker] [ivy:configure] :: loading settings :: file = /x1/jenkins/jenkins-slave/workspace/Lucene-Solr-SmokeRelease-5.x/lucene/build/smokeTestRelease/tmp/unpack/solr-5.5.0/lucene/ivy-settings.xml
[smoker]
[smoker] rat-sources-typedef:
[smoker]
[smoker] common.rat-sources:
[smoker] [rat:report] Warning: org.apache.xerces.jaxp.SAXParserImpl$JAXPSAXParser: Property 'http://www.oracle.com/xml/jaxp/properties/entityExpansionLimit' is not recognized.
[smoker] [rat:report] Compiler warnings:
[smoker] [rat:report] WARNING: 'org.apache.xerces.jaxp.SAXParserImpl: Property 'http://javax.xml.XMLConstants/property/accessExternalDTD' is not recognized.'
[smoker] [rat:report] Warning: org.apache.xerces.parsers.SAXParser: Feature 'http://javax.xml.XMLConstants/feature/secure-processing' is not recognized.
[smoker] [rat:report] Warning: org.apache.xerces.parsers.SAXParser: Property 'http://javax.xml.XMLConstants/property/accessExternalDTD' is not recognized.
[smoker] [rat:report] Warning: org.apache.xerces.parsers.SAXParser: Property 'http://www.oracle.com/xml/jaxp/properties/entityExpansionLimit' is not recognized.
[smoker] [rat]
[smoker] [rat] *****************************************************
[smoker] [rat] Summary
[smoker] [rat] -------
[smoker] [rat] Generated at: 2016-01-06T08:07:33+00:00
[smoker] [rat] Notes: 0
[smoker] [rat] Binaries: 0
[smoker] [rat] Archives: 0
[smoker] [rat] Standards: 4
[smoker] [rat]
[smoker] [rat] Apache Licensed: 4
[smoker] [rat] Generated Documents: 0
[smoker] [rat]
[smoker] [rat] JavaDocs are generated and so license header is optional
[smoker] [rat] Generated files do not required license headers
[smoker] [rat]
[smoker] [rat] 0 Unknown Licenses
[smoker] [rat]
[smoker] [rat] *******************************
[smoker] [rat]
[smoker] [rat] Unapproved licenses:
[smoker] [rat]
[smoker] [rat]
[smoker] [rat] *******************************
[smoker] [rat]
[smoker] [rat] Archives:
[smoker] [rat]
[smoker] [rat] *****************************************************
[smoker] [rat] Files with Apache License headers will be marked AL
[smoker] [rat] Binary files (which do not require AL headers) will be marked B
[smoker] [rat] Compressed archives will be marked A
[smoker] [rat] Notices, licenses etc will be marked N
[smoker] [rat] AL /x1/jenkins/jenkins-slave/workspace/Lucene-Solr-SmokeRelease-5.x/lucene/build/smokeTestRelease/tmp/unpack/solr-5.5.0/lucene/build.xml
[smoker] [rat] AL /x1/jenkins/jenkins-slave/workspace/Lucene-Solr-SmokeRelease-5.x/lucene/build/smokeTestRelease/tmp/unpack/solr-5.5.0/lucene/common-build.xml
[smoker] [rat] AL /x1/jenkins/jenkins-slave/workspace/Lucene-Solr-SmokeRelease-5.x/lucene/build/smokeTestRelease/tmp/unpack/solr-5.5.0/lucene/ivy-settings.xml
[smoker] [rat] AL /x1/jenkins/jenkins-slave/workspace/Lucene-Solr-SmokeRelease-5.x/lucene/build/smokeTestRelease/tmp/unpack/solr-5.5.0/lucene/module-build.xml
[smoker] [rat]
[smoker] [rat] *****************************************************
[smoker] [rat] Printing headers for files without AL header...
[smoker] [rat]
[smoker] [rat]
[smoker]
[smoker] rat-sources:
[smoker]
[smoker] ivy-availability-check:
[smoker]
[smoker] ivy-fail:
[smoker]
[smoker] ivy-configure:
[smoker] [ivy:configure] :: loading settings :: file = /x1/jenkins/jenkins-slave/workspace/Lucene-Solr-SmokeRelease-5.x/lucene/build/smokeTestRelease/tmp/unpack/solr-5.5.0/lucene/ivy-settings.xml
[smoker]
[smoker] rat-sources-typedef:
[smoker]
[smoker] rat-sources:
[smoker] [rat:report] Warning: org.apache.xerces.jaxp.SAXParserImpl$JAXPSAXParser: Property 'http://www.oracle.com/xml/jaxp/properties/entityExpansionLimit' is not recognized.
[smoker] [rat:report] Compiler warnings:
[smoker] [rat:report] WARNING: 'org.apache.xerces.jaxp.SAXParserImpl: Property 'http://javax.xml.XMLConstants/property/accessExternalDTD' is not recognized.'
[smoker] [rat:report] Warning: org.apache.xerces.parsers.SAXParser: Feature 'http://javax.xml.XMLConstants/feature/secure-processing' is not recognized.
[smoker] [rat:report] Warning: org.apache.xerces.parsers.SAXParser: Property 'http://javax.xml.XMLConstants/property/accessExternalDTD' is not recognized.
[smoker] [rat:report] Warning: org.apache.xerces.parsers.SAXParser: Property 'http://www.oracle.com/xml/jaxp/properties/entityExpansionLimit' is not recognized.
[smoker] [rat]
[smoker] [rat] *****************************************************
[smoker] [rat] Summary
[smoker] [rat] -------
[smoker] [rat] Generated at: 2016-01-06T08:07:33+00:00
[smoker] [rat] Notes: 0
[smoker] [rat] Binaries: 2
[smoker] [rat] Archives: 0
[smoker] [rat] Standards: 1169
[smoker] [rat]
[smoker] [rat] Apache Licensed: 1161
[smoker] [rat] Generated Documents: 0
[smoker] [rat]
[smoker] [rat] JavaDocs are generated and so license header is optional
[smoker] [rat] Generated files do not required license headers
[smoker] [rat]
[smoker] [rat] 0 Unknown Licenses
[smoker] [rat]
[smoker] [rat] *******************************
[smoker] [rat]
[smoker] [rat] Unapproved licenses:
[smoker] [rat]
[smoker] [rat]
[smoker] [rat] *******************************
[smoker] [rat]
[smoker] [rat] Archives:
[smoker] [rat]
[smoker] [rat] *****************************************************
[smoker] [rat] Files with Apache License headers will be marked AL
[smoker] [rat] Binary files (which do not require AL headers) will be marked B
[smoker] [rat] Compressed archives will be marked A
[smoker] [rat] Notices, licenses etc will be marked N
[smoker] [rat] AL /x1/jenkins/jenkins-slave/workspace/Lucene-Solr-SmokeRelease-5.x/lucene/build/smokeTestRelease/tmp/unpack/solr-5.5.0/lucene/core/build.xml
[smoker] [rat] AL /x1/jenkins/jenkins-slave/workspace/Lucene-Solr-SmokeRelease-5.x/lucene/build/smokeTestRelease/tmp/unpack/solr-5.5.0/lucene/core/ivy.xml
[smoker] [rat] AL /x1/jenkins/jenkins-slave/workspace/Lucene-Solr-SmokeRelease-5.x/lucene/build/smokeTestRelease/tmp/unpack/solr-5.5.0/lucene/core/src/java/org/apache/lucene/LucenePackage.java
[smoker] [rat] AL /x1/jenkins/jenkins-slave/workspace/Lucene-Solr-SmokeRelease-5.x/lucene/build/smokeTestRelease/tmp/unpack/solr-5.5.0/lucene/core/src/java/org/apache/lucene/analysis/Analyzer.java
[smoker] [rat] AL /x1/jenkins/jenkins-slave/workspace/Lucene-Solr-SmokeRelease-5.x/lucene/build/smokeTestRelease/tmp/unpack/solr-5.5.0/lucene/core/src/java/org/apache/lucene/analysis/AnalyzerWrapper.java
[smoker] [rat] AL /x1/jenkins/jenkins-slave/workspace/Lucene-Solr-SmokeRelease-5.x/lucene/build/smokeTestRelease/tmp/unpack/solr-5.5.0/lucene/core/src/java/org/apache/lucene/analysis/CachingTokenFilter.java
[smoker] [rat] AL /x1/jenkins/jenkins-slave/workspace/Lucene-Solr-SmokeRelease-5.x/lucene/build/smokeTestRelease/tmp/unpack/solr-5.5.0/lucene/core/src/java/org/apache/lucene/analysis/CharFilter.java
[smoker] [rat] AL /x1/jenkins/jenkins-slave/workspace/Lucene-Solr-SmokeRelease-5.x/lucene/build/smokeTestRelease/tmp/unpack/solr-5.5.0/lucene/core/src/java/org/apache/lucene/analysis/DelegatingAnalyzerWrapper.java
[smoker] [rat] AL /x1/jenkins/jenkins-slave/workspace/Lucene-Solr-SmokeRelease-5.x/lucene/build/smokeTestRelease/tmp/unpack/solr-5.5.0/lucene/core/src/java/org/apache/lucene/analysis/NumericTokenStream.java
[smoker] [rat] AL /x1/jenkins/jenkins-slave/workspace/Lucene-Solr-SmokeRelease-5.x/lucene/build/smokeTestRelease/tmp/unpack/solr-5.5.0/lucene/core/src/java/org/apache/lucene/analysis/ReusableStringReader.java
[smoker] [rat] AL /x1/jenkins/jenkins-slave/workspace/Lucene-Solr-SmokeRelease-5.x/lucene/build/smokeTestRelease/tmp/unpack/solr-5.5.0/lucene/core/src/java/org/apache/lucene/analysis/Token.java
[smoker] [rat] AL /x1/jenkins/jenkins-slave/workspace/Lucene-Solr-SmokeRelease-5.x/lucene/build/smokeTestRelease/tmp/unpack/solr-5.5.0/lucene/core/src/java/org/apache/lucene/analysis/TokenFilter.java
[smoker] [rat] AL /x1/jenkins/jenkins-slave/workspace/Lucene-Solr-SmokeRelease-5.x/lucene/build/smokeTestRelease/tmp/unpack/solr-5.5.0/lucene/core/src/java/org/apache/lucene/analysis/TokenStream.java
[smoker] [rat] AL /x1/jenkins/jenkins-slave/workspace/Lucene-Solr-SmokeRelease-5.x/lucene/build/smokeTestRelease/tmp/unpack/solr-5.5.0/lucene/core/src/java/org/apache/lucene/analysis/TokenStreamToAutomaton.java
[smoker] [rat] AL /x1/jenkins/jenkins-slave/workspace/Lucene-Solr-SmokeRelease-5.x/lucene/build/smokeTestRelease/tmp/unpack/solr-5.5.0/lucene/core/src/java/org/apache/lucene/analysis/Tokenizer.java
[smoker] [rat] AL /x1/jenkins/jenkins-slave/workspace/Lucene-Solr-SmokeRelease-5.x/lucene/build/smokeTestRelease/tmp/unpack/solr-5.5.0/lucene/core/src/java/org/apache/lucene/analysis/package-info.java
[smoker] [rat] AL /x1/jenkins/jenkins-slave/workspace/Lucene-Solr-SmokeRelease-5.x/lucene/build/smokeTestRelease/tmp/unpack/solr-5.5.0/lucene/core/src/java/org/apache/lucene/analysis/tokenattributes/BytesTermAttribute.java
[smoker] [rat] AL /x1/jenkins/jenkins-slave/workspace/Lucene-Solr-SmokeRelease-5.x/lucene/build/smokeTestRelease/tmp/unpack/solr-5.5.0/lucene/core/src/java/org/apache/lucene/analysis/tokenattributes/BytesTermAttributeImpl.java
[smoker] [rat] AL /x1/jenkins/jenkins-slave/workspace/Lucene-Solr-SmokeRelease-5.x/lucene/build/smokeTestRelease/tmp/unpack/solr-5.5.0/lucene/core/src/java/org/apache/lucene/analysis/tokenattributes/CharTermAttribute.java
[smoker] [rat] AL /x1/jenkins/jenkins-slave/workspace/Lucene-Solr-SmokeRelease-5.x/lucene/build/smokeTestRelease/tmp/unpack/solr-5.5.0/lucene/core/src/java/org/apache/lucene/analysis/tokenattributes/CharTermAttributeImpl.java
[smoker] [rat] AL /x1/jenkins/jenkins-slave/workspace/Lucene-Solr-SmokeRelease-5.x/lucene/build/smokeTestRelease/tmp/unpack/solr-5.5.0/lucene/core/src/java/org/apache/lucene/analysis/tokenattributes/FlagsAttribute.java
[smoker] [rat] AL /x1/jenkins/jenkins-slave/workspace/Lucene-Solr-SmokeRelease-5.x/lucene/build/smokeTestRelease/tmp/unpack/solr-5.5.0/lucene/core/src/java/org/apache/lucene/analysis/tokenattributes/FlagsAttributeImpl.java
[smoker] [rat] AL /x1/jenkins/jenkins-slave/workspace/Lucene-Solr-SmokeRelease-5.x/lucene/build/smokeTestRelease/tmp/unpack/solr-5.5.0/lucene/core/src/java/org/apache/lucene/analysis/tokenattributes/KeywordAttribute.java
[smoker] [rat] AL /x1/jenkins/jenkins-slave/workspace/Lucene-Solr-SmokeRelease-5.x/lucene/build/smokeTestRelease/tmp/unpack/solr-5.5.0/lucene/core/src/java/org/apache/lucene/analysis/tokenattributes/KeywordAttributeImpl.java
[smoker] [rat] AL /x1/jenkins/jenkins-slave/workspace/Lucene-Solr-SmokeRelease-5.x/lucene/build/smokeTestRelease/tmp/unpack/solr-5.5.0/lucene/core/src/java/org/apache/lucene/analysis/tokenattributes/OffsetAttribute.java
[smoker] [rat] AL /x1/jenkins/jenkins-slave/workspace/Lucene-Solr-SmokeRelease-5.x/lucene/build/smokeTestRelease/tmp/unpack/solr-5.5.0/lucene/core/src/java/org/apache/lucene/analysis/tokenattributes/OffsetAttributeImpl.java
[smoker] [rat] AL /x1/jenkins/jenkins-slave/workspace/Lucene-Solr-SmokeRelease-5.x/lucene/build/smokeTestRelease/tmp/unpack/solr-5.5.0/lucene/core/src/java/org/apache/lucene/analysis/tokenattributes/PackedTokenAttributeImpl.java
[smoker] [rat] AL /x1/
[...truncated too long message...]
slave/workspace/Lucene-Solr-SmokeRelease-5.x/lucene/build/smokeTestRelease/tmp/unpack/solr-5.5.0/solr/build/solr-test-framework/classes/java
[smoker] [javac] Note: Some input files use or override a deprecated API.
[smoker] [javac] Note: Recompile with -Xlint:deprecation for details.
[smoker] [javac] Note: Some input files use unchecked or unsafe operations.
[smoker] [javac] Note: Recompile with -Xlint:unchecked for details.
[smoker]
[smoker] compile-test-framework:
[smoker]
[smoker] ivy-availability-check:
[smoker]
[smoker] ivy-fail:
[smoker]
[smoker] ivy-configure:
[smoker] [ivy:configure] :: loading settings :: file = /x1/jenkins/jenkins-slave/workspace/Lucene-Solr-SmokeRelease-5.x/lucene/build/smokeTestRelease/tmp/unpack/solr-5.5.0/lucene/ivy-settings.xml
[smoker]
[smoker] resolve:
[smoker]
[smoker] init:
[smoker]
[smoker] compile-lucene-core:
[smoker]
[smoker] compile-codecs:
[smoker]
[smoker] ivy-availability-check:
[smoker]
[smoker] ivy-fail:
[smoker]
[smoker] ivy-configure:
[smoker] [ivy:configure] :: loading settings :: file = /x1/jenkins/jenkins-slave/workspace/Lucene-Solr-SmokeRelease-5.x/lucene/build/smokeTestRelease/tmp/unpack/solr-5.5.0/lucene/ivy-settings.xml
[smoker]
[smoker] resolve:
[smoker]
[smoker] common.init:
[smoker]
[smoker] compile-lucene-core:
[smoker]
[smoker] init:
[smoker]
[smoker] -clover.disable:
[smoker]
[smoker] -clover.load:
[smoker]
[smoker] -clover.classpath:
[smoker]
[smoker] -clover.setup:
[smoker]
[smoker] clover:
[smoker]
[smoker] compile-core:
[smoker]
[smoker] -clover.disable:
[smoker]
[smoker] -clover.load:
[smoker]
[smoker] -clover.classpath:
[smoker]
[smoker] -clover.setup:
[smoker]
[smoker] clover:
[smoker]
[smoker] common.compile-core:
[smoker]
[smoker] compile-core:
[smoker]
[smoker] common.compile-test:
[smoker] [mkdir] Created dir: /x1/jenkins/jenkins-slave/workspace/Lucene-Solr-SmokeRelease-5.x/lucene/build/smokeTestRelease/tmp/unpack/solr-5.5.0/solr/build/solr-core/classes/test
[smoker] [javac] Compiling 613 source files to /x1/jenkins/jenkins-slave/workspace/Lucene-Solr-SmokeRelease-5.x/lucene/build/smokeTestRelease/tmp/unpack/solr-5.5.0/solr/build/solr-core/classes/test
[smoker] [javac] /x1/jenkins/jenkins-slave/workspace/Lucene-Solr-SmokeRelease-5.x/lucene/build/smokeTestRelease/tmp/unpack/solr-5.5.0/solr/core/src/test/org/apache/solr/cloud/TestMiniSolrCloudCluster.java:103: error: cannot find symbol
[smoker] [javac] collectionProperties.putIfAbsent(CoreDescriptor.CORE_CONFIG, "solrconfig-tlog.xml");
[smoker] [javac] ^
[smoker] [javac] symbol: method putIfAbsent(String,String)
[smoker] [javac] location: variable collectionProperties of type Map<String,String>
[smoker] [javac] /x1/jenkins/jenkins-slave/workspace/Lucene-Solr-SmokeRelease-5.x/lucene/build/smokeTestRelease/tmp/unpack/solr-5.5.0/solr/core/src/test/org/apache/solr/cloud/TestMiniSolrCloudCluster.java:104: error: cannot find symbol
[smoker] [javac] collectionProperties.putIfAbsent("solr.tests.maxBufferedDocs", "100000");
[smoker] [javac] ^
[smoker] [javac] symbol: method putIfAbsent(String,String)
[smoker] [javac] location: variable collectionProperties of type Map<String,String>
[smoker] [javac] /x1/jenkins/jenkins-slave/workspace/Lucene-Solr-SmokeRelease-5.x/lucene/build/smokeTestRelease/tmp/unpack/solr-5.5.0/solr/core/src/test/org/apache/solr/cloud/TestMiniSolrCloudCluster.java:105: error: cannot find symbol
[smoker] [javac] collectionProperties.putIfAbsent("solr.tests.ramBufferSizeMB", "100");
[smoker] [javac] ^
[smoker] [javac] symbol: method putIfAbsent(String,String)
[smoker] [javac] location: variable collectionProperties of type Map<String,String>
[smoker] [javac] /x1/jenkins/jenkins-slave/workspace/Lucene-Solr-SmokeRelease-5.x/lucene/build/smokeTestRelease/tmp/unpack/solr-5.5.0/solr/core/src/test/org/apache/solr/cloud/TestMiniSolrCloudCluster.java:107: error: cannot find symbol
[smoker] [javac] collectionProperties.putIfAbsent("solr.tests.mergePolicy", "org.apache.lucene.index.TieredMergePolicy");
[smoker] [javac] ^
[smoker] [javac] symbol: method putIfAbsent(String,String)
[smoker] [javac] location: variable collectionProperties of type Map<String,String>
[smoker] [javac] /x1/jenkins/jenkins-slave/workspace/Lucene-Solr-SmokeRelease-5.x/lucene/build/smokeTestRelease/tmp/unpack/solr-5.5.0/solr/core/src/test/org/apache/solr/cloud/TestMiniSolrCloudCluster.java:108: error: cannot find symbol
[smoker] [javac] collectionProperties.putIfAbsent("solr.tests.mergeScheduler", "org.apache.lucene.index.ConcurrentMergeScheduler");
[smoker] [javac] ^
[smoker] [javac] symbol: method putIfAbsent(String,String)
[smoker] [javac] location: variable collectionProperties of type Map<String,String>
[smoker] [javac] /x1/jenkins/jenkins-slave/workspace/Lucene-Solr-SmokeRelease-5.x/lucene/build/smokeTestRelease/tmp/unpack/solr-5.5.0/solr/core/src/test/org/apache/solr/cloud/TestMiniSolrCloudCluster.java:109: error: cannot find symbol
[smoker] [javac] collectionProperties.putIfAbsent("solr.directoryFactory", (persistIndex ? "solr.StandardDirectoryFactory" : "solr.RAMDirectoryFactory"));
[smoker] [javac] ^
[smoker] [javac] symbol: method putIfAbsent(String,String)
[smoker] [javac] location: variable collectionProperties of type Map<String,String>
[smoker] [javac] Note: Some input files use or override a deprecated API.
[smoker] [javac] Note: Recompile with -Xlint:deprecation for details.
[smoker] [javac] Note: Some input files use unchecked or unsafe operations.
[smoker] [javac] Note: Recompile with -Xlint:unchecked for details.
[smoker] [javac] 6 errors
[smoker]
[smoker] BUILD FAILED
[smoker] /x1/jenkins/jenkins-slave/workspace/Lucene-Solr-SmokeRelease-5.x/lucene/build/smokeTestRelease/tmp/unpack/solr-5.5.0/build.xml:117: The following error occurred while executing this line:
[smoker] /x1/jenkins/jenkins-slave/workspace/Lucene-Solr-SmokeRelease-5.x/lucene/build/smokeTestRelease/tmp/unpack/solr-5.5.0/solr/build.xml:347: The following error occurred while executing this line:
[smoker] /x1/jenkins/jenkins-slave/workspace/Lucene-Solr-SmokeRelease-5.x/lucene/build/smokeTestRelease/tmp/unpack/solr-5.5.0/lucene/common-build.xml:808: The following error occurred while executing this line:
[smoker] /x1/jenkins/jenkins-slave/workspace/Lucene-Solr-SmokeRelease-5.x/lucene/build/smokeTestRelease/tmp/unpack/solr-5.5.0/lucene/common-build.xml:822: The following error occurred while executing this line:
[smoker] /x1/jenkins/jenkins-slave/workspace/Lucene-Solr-SmokeRelease-5.x/lucene/build/smokeTestRelease/tmp/unpack/solr-5.5.0/lucene/common-build.xml:1956: Compile failed; see the compiler error output for details.
[smoker]
[smoker] Total time: 2 minutes 1 second
[smoker]
[smoker]
[smoker] Traceback (most recent call last):
[smoker] File "/x1/jenkins/jenkins-slave/workspace/Lucene-Solr-SmokeRelease-5.x/dev-tools/scripts/smokeTestRelease.py", line 1454, in <module>
[smoker] main()
[smoker] File "/x1/jenkins/jenkins-slave/workspace/Lucene-Solr-SmokeRelease-5.x/dev-tools/scripts/smokeTestRelease.py", line 1399, in main
[smoker] smokeTest(c.java, c.url, c.revision, c.version, c.tmp_dir, c.is_signed, ' '.join(c.test_args))
[smoker] File "/x1/jenkins/jenkins-slave/workspace/Lucene-Solr-SmokeRelease-5.x/dev-tools/scripts/smokeTestRelease.py", line 1444, in smokeTest
[smoker] unpackAndVerify(java, 'solr', tmpDir, 'solr-%s-src.tgz' % version, svnRevision, version, testArgs, baseURL)
[smoker] File "/x1/jenkins/jenkins-slave/workspace/Lucene-Solr-SmokeRelease-5.x/dev-tools/scripts/smokeTestRelease.py", line 588, in unpackAndVerify
[smoker] verifyUnpacked(java, project, artifact, unpackPath, svnRevision, version, testArgs, tmpDir, baseURL)
[smoker] File "/x1/jenkins/jenkins-slave/workspace/Lucene-Solr-SmokeRelease-5.x/dev-tools/scripts/smokeTestRelease.py", line 676, in verifyUnpacked
[smoker] java.run_java7('ant validate', '%s/validate.log' % unpackPath)
[smoker] File "/x1/jenkins/jenkins-slave/workspace/Lucene-Solr-SmokeRelease-5.x/dev-tools/scripts/smokeTestRelease.py", line 1231, in run_java
[smoker] run('%s; %s' % (cmd_prefix, cmd), logfile)
[smoker] File "/x1/jenkins/jenkins-slave/workspace/Lucene-Solr-SmokeRelease-5.x/dev-tools/scripts/smokeTestRelease.py", line 513, in run
[smoker] raise RuntimeError('command "%s" failed; see log file %s' % (command, logPath))
[smoker] RuntimeError: command "export JAVA_HOME="/home/jenkins/jenkins-slave/tools/hudson.model.JDK/latest1.7" PATH="/home/jenkins/jenkins-slave/tools/hudson.model.JDK/latest1.7/bin:$PATH" JAVACMD="/home/jenkins/jenkins-slave/tools/hudson.model.JDK/latest1.7/bin/java"; ant validate" failed; see log file /x1/jenkins/jenkins-slave/workspace/Lucene-Solr-SmokeRelease-5.x/lucene/build/smokeTestRelease/tmp/unpack/solr-5.5.0/validate.log
BUILD FAILED
/x1/jenkins/jenkins-slave/workspace/Lucene-Solr-SmokeRelease-5.x/build.xml:545: exec returned: 1
Total time: 77 minutes 29 seconds
Build step 'Invoke Ant' marked build as failure
Email was triggered for: Failure - Any
Sending email for trigger: Failure - Any
Setting LATEST1_8_HOME=/home/jenkins/jenkins-slave/tools/hudson.model.JDK/latest1.8
Setting LATEST1_8_HOME=/home/jenkins/jenkins-slave/tools/hudson.model.JDK/latest1.8
RE: [JENKINS] Lucene-Solr-SmokeRelease-5.x - Build # 430 - Still Failing
Posted by Uwe Schindler <uw...@thetaphi.de>.
Hi,
> >> Looks like ASF Jenkins's lucene slave is running out of disk space (again):
> >>
> >>> [smoker] [junit4] java.io.IOException: No space left on device
> >>
> >> Uwe, opinions on what to do? Should we ask Infra for more disk space
> >> (again)?
>
> I’m guessing you must have done the manual deletions? I don’t see any
> orphaned workspaces on disk, and available space looks adequate:
We should also nuke the workspaces of the disabled jobs of 5.4! I am clicking through that in the GUI...
Uwe
> ——
> sarowe@lucene1-us-west:~$ df /home/jenkins/jenkins-slave/workspace
> Filesystem 1K-blocks Used Available Use% Mounted on
> /dev/sdb1 82437808 56211492 22015680 72% /x1
> ——
>
> Disk footprints for each job’s workspace:
>
> ——
> sarowe@lucene1-us-west:~$ sudo -u jenkins du -sk /home/jenkins/jenkins-
> slave/workspace/*
> 121436 /home/jenkins/jenkins-slave/workspace/Apache Jackrabbit Oak
> matrix
> 973492 /home/jenkins/jenkins-slave/workspace/Lucene-Artifacts-5.3
> 984084 /home/jenkins/jenkins-slave/workspace/Lucene-Artifacts-5.4
> 980732 /home/jenkins/jenkins-slave/workspace/Lucene-Artifacts-5.x
> 963896 /home/jenkins/jenkins-slave/workspace/Lucene-Artifacts-trunk
> 6527688 /home/jenkins/jenkins-slave/workspace/Lucene-Solr-
> Clover-5.x
> 6131460 /home/jenkins/jenkins-slave/workspace/Lucene-Solr-
> Clover-trunk
> 1523640 /home/jenkins/jenkins-slave/workspace/Lucene-Solr-
> Maven-5.3
> 1641880 /home/jenkins/jenkins-slave/workspace/Lucene-Solr-
> Maven-5.4
> 1644900 /home/jenkins/jenkins-slave/workspace/Lucene-Solr-
> Maven-5.x
> 1651268 /home/jenkins/jenkins-slave/workspace/Lucene-Solr-
> Maven-trunk
> 2654308 /home/jenkins/jenkins-slave/workspace/Lucene-Solr-
> NightlyTests-5.3
> 4435392 /home/jenkins/jenkins-slave/workspace/Lucene-Solr-
> NightlyTests-5.4
> 2370868 /home/jenkins/jenkins-slave/workspace/Lucene-Solr-
> NightlyTests-5.x
> 3191700 /home/jenkins/jenkins-slave/workspace/Lucene-Solr-
> NightlyTests-trunk
> 2988924 /home/jenkins/jenkins-slave/workspace/Lucene-Solr-
> SmokeRelease-5.3
> 1917096 /home/jenkins/jenkins-slave/workspace/Lucene-Solr-
> SmokeRelease-5.4
> 1917780 /home/jenkins/jenkins-slave/workspace/Lucene-Solr-
> SmokeRelease-5.x
> 1919780 /home/jenkins/jenkins-slave/workspace/Lucene-Solr-
> SmokeRelease-trunk
> 1017100 /home/jenkins/jenkins-slave/workspace/Lucene-Solr-Tests-
> 5.3-Java7
> 1040176 /home/jenkins/jenkins-slave/workspace/Lucene-Solr-Tests-
> 5.4-Java7
> 1047236 /home/jenkins/jenkins-slave/workspace/Lucene-Solr-Tests-
> 5.x-Java7
> 988956 /home/jenkins/jenkins-slave/workspace/Lucene-Solr-Tests-trunk-
> Java8
> 1618928 /home/jenkins/jenkins-slave/workspace/Solr-Artifacts-5.3
> 1638788 /home/jenkins/jenkins-slave/workspace/Solr-Artifacts-5.4
> 1641804 /home/jenkins/jenkins-slave/workspace/Solr-Artifacts-5.x
> 1649436 /home/jenkins/jenkins-slave/workspace/Solr-Artifacts-trunk
> ——
>
> Totals by branch:
>
> ——
> 16496496 Trunk
> 16131008 5.x
> 11657416 5.4
> 10776392 5.3
> 55182748 Total
> ——
>
> So it looks like as long as we keep up with pruning inactive jobs and orphaned
> workspaces, we can safely accomodate two (or three?) active development
> branches and two (or three?) active release branches with currently available
> disk space.
>
> We’ll have to keep an eye on it when branch_6x and associated Jenkins jobs
> are created.
>
> Steve
>
>
> ---------------------------------------------------------------------
> To unsubscribe, e-mail: dev-unsubscribe@lucene.apache.org
> For additional commands, e-mail: dev-help@lucene.apache.org
---------------------------------------------------------------------
To unsubscribe, e-mail: dev-unsubscribe@lucene.apache.org
For additional commands, e-mail: dev-help@lucene.apache.org
Re: [JENKINS] Lucene-Solr-SmokeRelease-5.x - Build # 430 - Still Failing
Posted by Steve Rowe <sa...@gmail.com>.
Hi Uwe,
> On Jan 7, 2016, at 5:20 PM, Uwe Schindler <uw...@thetaphi.de> wrote:
>
> No, we should delete the deleted Job's workspaces. If you delete a job without first deleting the workspace it is kept on disk (which is a bug in older Jenkins versions as used by ASF). So you have to manually delete it.
>
>> -----Original Message-----
>> From: Steve Rowe [mailto:sarowe@gmail.com]
>> Sent: Thursday, January 07, 2016 7:23 PM
>>
>> Looks like ASF Jenkins's lucene slave is running out of disk space (again):
>>
>>> [smoker] [junit4] java.io.IOException: No space left on device
>>
>> Uwe, opinions on what to do? Should we ask Infra for more disk space
>> (again)?
I’m guessing you must have done the manual deletions? I don’t see any orphaned workspaces on disk, and available space looks adequate:
——
sarowe@lucene1-us-west:~$ df /home/jenkins/jenkins-slave/workspace
Filesystem 1K-blocks Used Available Use% Mounted on
/dev/sdb1 82437808 56211492 22015680 72% /x1
——
Disk footprints for each job’s workspace:
——
sarowe@lucene1-us-west:~$ sudo -u jenkins du -sk /home/jenkins/jenkins-slave/workspace/*
121436 /home/jenkins/jenkins-slave/workspace/Apache Jackrabbit Oak matrix
973492 /home/jenkins/jenkins-slave/workspace/Lucene-Artifacts-5.3
984084 /home/jenkins/jenkins-slave/workspace/Lucene-Artifacts-5.4
980732 /home/jenkins/jenkins-slave/workspace/Lucene-Artifacts-5.x
963896 /home/jenkins/jenkins-slave/workspace/Lucene-Artifacts-trunk
6527688 /home/jenkins/jenkins-slave/workspace/Lucene-Solr-Clover-5.x
6131460 /home/jenkins/jenkins-slave/workspace/Lucene-Solr-Clover-trunk
1523640 /home/jenkins/jenkins-slave/workspace/Lucene-Solr-Maven-5.3
1641880 /home/jenkins/jenkins-slave/workspace/Lucene-Solr-Maven-5.4
1644900 /home/jenkins/jenkins-slave/workspace/Lucene-Solr-Maven-5.x
1651268 /home/jenkins/jenkins-slave/workspace/Lucene-Solr-Maven-trunk
2654308 /home/jenkins/jenkins-slave/workspace/Lucene-Solr-NightlyTests-5.3
4435392 /home/jenkins/jenkins-slave/workspace/Lucene-Solr-NightlyTests-5.4
2370868 /home/jenkins/jenkins-slave/workspace/Lucene-Solr-NightlyTests-5.x
3191700 /home/jenkins/jenkins-slave/workspace/Lucene-Solr-NightlyTests-trunk
2988924 /home/jenkins/jenkins-slave/workspace/Lucene-Solr-SmokeRelease-5.3
1917096 /home/jenkins/jenkins-slave/workspace/Lucene-Solr-SmokeRelease-5.4
1917780 /home/jenkins/jenkins-slave/workspace/Lucene-Solr-SmokeRelease-5.x
1919780 /home/jenkins/jenkins-slave/workspace/Lucene-Solr-SmokeRelease-trunk
1017100 /home/jenkins/jenkins-slave/workspace/Lucene-Solr-Tests-5.3-Java7
1040176 /home/jenkins/jenkins-slave/workspace/Lucene-Solr-Tests-5.4-Java7
1047236 /home/jenkins/jenkins-slave/workspace/Lucene-Solr-Tests-5.x-Java7
988956 /home/jenkins/jenkins-slave/workspace/Lucene-Solr-Tests-trunk-Java8
1618928 /home/jenkins/jenkins-slave/workspace/Solr-Artifacts-5.3
1638788 /home/jenkins/jenkins-slave/workspace/Solr-Artifacts-5.4
1641804 /home/jenkins/jenkins-slave/workspace/Solr-Artifacts-5.x
1649436 /home/jenkins/jenkins-slave/workspace/Solr-Artifacts-trunk
——
Totals by branch:
——
16496496 Trunk
16131008 5.x
11657416 5.4
10776392 5.3
55182748 Total
——
So it looks like as long as we keep up with pruning inactive jobs and orphaned workspaces, we can safely accomodate two (or three?) active development branches and two (or three?) active release branches with currently available disk space.
We’ll have to keep an eye on it when branch_6x and associated Jenkins jobs are created.
Steve
---------------------------------------------------------------------
To unsubscribe, e-mail: dev-unsubscribe@lucene.apache.org
For additional commands, e-mail: dev-help@lucene.apache.org
RE: [JENKINS] Lucene-Solr-SmokeRelease-5.x - Build # 430 - Still Failing
Posted by Uwe Schindler <uw...@thetaphi.de>.
Hi Steve,
No, we should delete the deleted Job's workspaces. If you delete a job without first deleting the workspace it is kept on disk (which is a bug in older Jenkins versions as used by ASF). So you have to manually delete it.
Uwe
-----
Uwe Schindler
H.-H.-Meier-Allee 63, D-28213 Bremen
http://www.thetaphi.de
eMail: uwe@thetaphi.de
> -----Original Message-----
> From: Steve Rowe [mailto:sarowe@gmail.com]
> Sent: Thursday, January 07, 2016 7:23 PM
> To: dev@lucene.apache.org
> Subject: Re: [JENKINS] Lucene-Solr-SmokeRelease-5.x - Build # 430 - Still
> Failing
>
> Looks like ASF Jenkins's lucene slave is running out of disk space (again):
>
> > [smoker] [junit4] java.io.IOException: No space left on device
>
> Uwe, opinions on what to do? Should we ask Infra for more disk space
> (again)?
>
> > On Jan 7, 2016, at 12:54 PM, Apache Jenkins Server
> <je...@builds.apache.org> wrote:
> >
> > Build: https://builds.apache.org/job/Lucene-Solr-SmokeRelease-5.x/430/
> >
> > No tests ran.
> >
> > Build Log:
> > [...truncated 53145 lines...]
> > prepare-release-no-sign:
> > [mkdir] Created dir: /x1/jenkins/jenkins-slave/workspace/Lucene-Solr-
> SmokeRelease-5.x/lucene/build/smokeTestRelease/dist
> > [copy] Copying 461 files to /x1/jenkins/jenkins-slave/workspace/Lucene-
> Solr-SmokeRelease-5.x/lucene/build/smokeTestRelease/dist/lucene
> > [copy] Copying 245 files to /x1/jenkins/jenkins-slave/workspace/Lucene-
> Solr-SmokeRelease-5.x/lucene/build/smokeTestRelease/dist/solr
> > [smoker] Java 1.7 JAVA_HOME=/home/jenkins/jenkins-
> slave/tools/hudson.model.JDK/latest1.7
> > [smoker] Java 1.8 JAVA_HOME=/home/jenkins/jenkins-
> slave/tools/hudson.model.JDK/latest1.8
> > [smoker] NOTE: output encoding is UTF-8
> > [smoker]
> > [smoker] Load release URL "file:/x1/jenkins/jenkins-
> slave/workspace/Lucene-Solr-SmokeRelease-
> 5.x/lucene/build/smokeTestRelease/dist/"...
> > [smoker]
> > [smoker] Test Lucene...
> > [smoker] test basics...
> > [smoker] get KEYS
> > [smoker] 0.2 MB in 0.01 sec (10.3 MB/sec)
> > [smoker] check changes HTML...
> > [smoker] download lucene-5.5.0-src.tgz...
> > [smoker] 28.7 MB in 0.04 sec (644.7 MB/sec)
> > [smoker] verify md5/sha1 digests
> > [smoker] download lucene-5.5.0.tgz...
> > [smoker] 63.4 MB in 0.10 sec (648.5 MB/sec)
> > [smoker] verify md5/sha1 digests
> > [smoker] download lucene-5.5.0.zip...
> > [smoker] 73.8 MB in 0.12 sec (624.1 MB/sec)
> > [smoker] verify md5/sha1 digests
> > [smoker] unpack lucene-5.5.0.tgz...
> > [smoker] verify JAR metadata/identity/no javax.* or java.* classes...
> > [smoker] test demo with 1.7...
> > [smoker] got 6174 hits for query "lucene"
> > [smoker] checkindex with 1.7...
> > [smoker] test demo with 1.8...
> > [smoker] got 6174 hits for query "lucene"
> > [smoker] checkindex with 1.8...
> > [smoker] check Lucene's javadoc JAR
> > [smoker] unpack lucene-5.5.0.zip...
> > [smoker] verify JAR metadata/identity/no javax.* or java.* classes...
> > [smoker] test demo with 1.7...
> > [smoker] got 6174 hits for query "lucene"
> > [smoker] checkindex with 1.7...
> > [smoker] test demo with 1.8...
> > [smoker] got 6174 hits for query "lucene"
> > [smoker] checkindex with 1.8...
> > [smoker] check Lucene's javadoc JAR
> > [smoker] unpack lucene-5.5.0-src.tgz...
> > [smoker] make sure no JARs/WARs in src dist...
> > [smoker] run "ant validate"
> > [smoker] run tests w/ Java 7 and testArgs='-Dtests.slow=false'...
> > [smoker]
> > [smoker] command "export JAVA_HOME="/home/jenkins/jenkins-
> slave/tools/hudson.model.JDK/latest1.7" PATH="/home/jenkins/jenkins-
> slave/tools/hudson.model.JDK/latest1.7/bin:$PATH"
> JAVACMD="/home/jenkins/jenkins-
> slave/tools/hudson.model.JDK/latest1.7/bin/java"; ant clean test -
> Dtests.slow=false" failed:
> > [smoker] Buildfile: /x1/jenkins/jenkins-slave/workspace/Lucene-Solr-
> SmokeRelease-5.x/lucene/build/smokeTestRelease/tmp/unpack/lucene-
> 5.5.0/build.xml
> > [smoker]
> > [smoker] clean:
> > [smoker] [delete] Deleting directory /x1/jenkins/jenkins-
> slave/workspace/Lucene-Solr-SmokeRelease-
> 5.x/lucene/build/smokeTestRelease/tmp/unpack/lucene-5.5.0/build
> > [smoker]
> > [smoker] ivy-availability-check:
> > [smoker]
> > [smoker] ivy-fail:
> > [smoker]
> > [smoker] ivy-configure:
> > [smoker] [ivy:configure] :: Apache Ivy 2.3.0 - 20130110142753 ::
> http://ant.apache.org/ivy/ ::
> > [smoker] [ivy:configure] :: loading settings :: file = /x1/jenkins/jenkins-
> slave/workspace/Lucene-Solr-SmokeRelease-
> 5.x/lucene/build/smokeTestRelease/tmp/unpack/lucene-5.5.0/ivy-
> settings.xml
> > [smoker]
> > [smoker] -clover.load:
> > [smoker]
> > [smoker] resolve-groovy:
> > [smoker] [ivy:cachepath] :: resolving dependencies ::
> org.codehaus.groovy#groovy-all-caller;working
> > [smoker] [ivy:cachepath] confs: [default]
> > [smoker] [ivy:cachepath] found org.codehaus.groovy#groovy-all;2.4.4
> in public
> > [smoker] [ivy:cachepath] :: resolution report :: resolve 291ms :: artifacts dl
> 3ms
> > [smoker] ---------------------------------------------------------------------
> > [smoker] | | modules || artifacts |
> > [smoker] | conf | number| search|dwnlded|evicted||
> number|dwnlded|
> > [smoker] ---------------------------------------------------------------------
> > [smoker] | default | 1 | 0 | 0 | 0 || 1 | 0 |
> > [smoker] ---------------------------------------------------------------------
> > [smoker]
> > [smoker] -init-totals:
> > [smoker]
> > [smoker] test-core:
> > [smoker]
> > [smoker] -clover.disable:
> > [smoker]
> > [smoker] ivy-availability-check:
> > [smoker]
> > [smoker] ivy-fail:
> > [smoker]
> > [smoker] ivy-configure:
> > [smoker] [ivy:configure] :: loading settings :: file = /x1/jenkins/jenkins-
> slave/workspace/Lucene-Solr-SmokeRelease-
> 5.x/lucene/build/smokeTestRelease/tmp/unpack/lucene-5.5.0/ivy-
> settings.xml
> > [smoker]
> > [smoker] -clover.load:
> > [smoker]
> > [smoker] -clover.classpath:
> > [smoker]
> > [smoker] -clover.setup:
> > [smoker]
> > [smoker] clover:
> > [smoker]
> > [smoker] resolve:
> > [smoker]
> > [smoker] init:
> > [smoker]
> > [smoker] compile-core:
> > [smoker] [mkdir] Created dir: /x1/jenkins/jenkins-
> slave/workspace/Lucene-Solr-SmokeRelease-
> 5.x/lucene/build/smokeTestRelease/tmp/unpack/lucene-
> 5.5.0/build/core/classes/java
> > [smoker] [javac] Compiling 733 source files to /x1/jenkins/jenkins-
> slave/workspace/Lucene-Solr-SmokeRelease-
> 5.x/lucene/build/smokeTestRelease/tmp/unpack/lucene-
> 5.5.0/build/core/classes/java
> > [smoker] [javac] Note: Some input files use or override a deprecated
> API.
> > [smoker] [javac] Note: Recompile with -Xlint:deprecation for details.
> > [smoker] [javac] Creating empty /x1/jenkins/jenkins-
> slave/workspace/Lucene-Solr-SmokeRelease-
> 5.x/lucene/build/smokeTestRelease/tmp/unpack/lucene-
> 5.5.0/build/core/classes/java/org/apache/lucene/codecs/blocktree/package
> -info.class
> > [smoker] [javac] Creating empty /x1/jenkins/jenkins-
> slave/workspace/Lucene-Solr-SmokeRelease-
> 5.x/lucene/build/smokeTestRelease/tmp/unpack/lucene-
> 5.5.0/build/core/classes/java/org/apache/lucene/codecs/lucene54/package-
> info.class
> > [smoker] [javac] Creating empty /x1/jenkins/jenkins-
> slave/workspace/Lucene-Solr-SmokeRelease-
> 5.x/lucene/build/smokeTestRelease/tmp/unpack/lucene-
> 5.5.0/build/core/classes/java/org/apache/lucene/util/packed/package-
> info.class
> > [smoker] [javac] Creating empty /x1/jenkins/jenkins-
> slave/workspace/Lucene-Solr-SmokeRelease-
> 5.x/lucene/build/smokeTestRelease/tmp/unpack/lucene-
> 5.5.0/build/core/classes/java/org/apache/lucene/analysis/package-info.class
> > [smoker] [javac] Creating empty /x1/jenkins/jenkins-
> slave/workspace/Lucene-Solr-SmokeRelease-
> 5.x/lucene/build/smokeTestRelease/tmp/unpack/lucene-
> 5.5.0/build/core/classes/java/org/apache/lucene/document/package-
> info.class
> > [smoker] [javac] Creating empty /x1/jenkins/jenkins-
> slave/workspace/Lucene-Solr-SmokeRelease-
> 5.x/lucene/build/smokeTestRelease/tmp/unpack/lucene-
> 5.5.0/build/core/classes/java/org/apache/lucene/util/package-info.class
> > [smoker] [javac] Creating empty /x1/jenkins/jenkins-
> slave/workspace/Lucene-Solr-SmokeRelease-
> 5.x/lucene/build/smokeTestRelease/tmp/unpack/lucene-
> 5.5.0/build/core/classes/java/org/apache/lucene/analysis/tokenattributes/p
> ackage-info.class
> > [smoker] [javac] Creating empty /x1/jenkins/jenkins-
> slave/workspace/Lucene-Solr-SmokeRelease-
> 5.x/lucene/build/smokeTestRelease/tmp/unpack/lucene-
> 5.5.0/build/core/classes/java/org/apache/lucene/codecs/lucene50/package-
> info.class
> > [smoker] [javac] Creating empty /x1/jenkins/jenkins-
> slave/workspace/Lucene-Solr-SmokeRelease-
> 5.x/lucene/build/smokeTestRelease/tmp/unpack/lucene-
> 5.5.0/build/core/classes/java/org/apache/lucene/index/package-info.class
> > [smoker] [javac] Creating empty /x1/jenkins/jenkins-
> slave/workspace/Lucene-Solr-SmokeRelease-
> 5.x/lucene/build/smokeTestRelease/tmp/unpack/lucene-
> 5.5.0/build/core/classes/java/org/apache/lucene/codecs/compressing/pack
> age-info.class
> > [smoker] [javac] Creating empty /x1/jenkins/jenkins-
> slave/workspace/Lucene-Solr-SmokeRelease-
> 5.x/lucene/build/smokeTestRelease/tmp/unpack/lucene-
> 5.5.0/build/core/classes/java/org/apache/lucene/codecs/lucene53/package-
> info.class
> > [smoker] [javac] Creating empty /x1/jenkins/jenkins-
> slave/workspace/Lucene-Solr-SmokeRelease-
> 5.x/lucene/build/smokeTestRelease/tmp/unpack/lucene-
> 5.5.0/build/core/classes/java/org/apache/lucene/util/automaton/package-
> info.class
> > [smoker] [javac] Creating empty /x1/jenkins/jenkins-
> slave/workspace/Lucene-Solr-SmokeRelease-
> 5.x/lucene/build/smokeTestRelease/tmp/unpack/lucene-
> 5.5.0/build/core/classes/java/org/apache/lucene/util/fst/package-info.class
> > [smoker] [javac] Creating empty /x1/jenkins/jenkins-
> slave/workspace/Lucene-Solr-SmokeRelease-
> 5.x/lucene/build/smokeTestRelease/tmp/unpack/lucene-
> 5.5.0/build/core/classes/java/org/apache/lucene/util/mutable/package-
> info.class
> > [smoker] [javac] Creating empty /x1/jenkins/jenkins-
> slave/workspace/Lucene-Solr-SmokeRelease-
> 5.x/lucene/build/smokeTestRelease/tmp/unpack/lucene-
> 5.5.0/build/core/classes/java/org/apache/lucene/search/similarities/packag
> e-info.class
> > [smoker] [javac] Creating empty /x1/jenkins/jenkins-
> slave/workspace/Lucene-Solr-SmokeRelease-
> 5.x/lucene/build/smokeTestRelease/tmp/unpack/lucene-
> 5.5.0/build/core/classes/java/org/apache/lucene/codecs/perfield/package-
> info.class
> > [smoker] [javac] Creating empty /x1/jenkins/jenkins-
> slave/workspace/Lucene-Solr-SmokeRelease-
> 5.x/lucene/build/smokeTestRelease/tmp/unpack/lucene-
> 5.5.0/build/core/classes/java/org/apache/lucene/store/package-info.class
> > [smoker] [javac] Creating empty /x1/jenkins/jenkins-
> slave/workspace/Lucene-Solr-SmokeRelease-
> 5.x/lucene/build/smokeTestRelease/tmp/unpack/lucene-
> 5.5.0/build/core/classes/java/org/apache/lucene/package-info.class
> > [smoker] [javac] Creating empty /x1/jenkins/jenkins-
> slave/workspace/Lucene-Solr-SmokeRelease-
> 5.x/lucene/build/smokeTestRelease/tmp/unpack/lucene-
> 5.5.0/build/core/classes/java/org/apache/lucene/search/package-info.class
> > [smoker] [javac] Creating empty /x1/jenkins/jenkins-
> slave/workspace/Lucene-Solr-SmokeRelease-
> 5.x/lucene/build/smokeTestRelease/tmp/unpack/lucene-
> 5.5.0/build/core/classes/java/org/apache/lucene/codecs/package-info.class
> > [smoker] [javac] Creating empty /x1/jenkins/jenkins-
> slave/workspace/Lucene-Solr-SmokeRelease-
> 5.x/lucene/build/smokeTestRelease/tmp/unpack/lucene-
> 5.5.0/build/core/classes/java/org/apache/lucene/search/spans/package-
> info.class
> > [smoker] [copy] Copying 3 files to /x1/jenkins/jenkins-
> slave/workspace/Lucene-Solr-SmokeRelease-
> 5.x/lucene/build/smokeTestRelease/tmp/unpack/lucene-
> 5.5.0/build/core/classes/java
> > [smoker]
> > [smoker] compile-test-framework:
> > [smoker]
> > [smoker] ivy-availability-check:
> > [smoker]
> > [smoker] ivy-fail:
> > [smoker]
> > [smoker] ivy-configure:
> > [smoker] [ivy:configure] :: loading settings :: file = /x1/jenkins/jenkins-
> slave/workspace/Lucene-Solr-SmokeRelease-
> 5.x/lucene/build/smokeTestRelease/tmp/unpack/lucene-5.5.0/ivy-
> settings.xml
> > [smoker]
> > [smoker] resolve:
> > [smoker]
> > [smoker] init:
> > [smoker]
> > [smoker] compile-lucene-core:
> > [smoker]
> > [smoker] ivy-availability-check:
> > [smoker]
> > [smoker] ivy-fail:
> > [smoker]
> > [smoker] ivy-configure:
> > [smoker] [ivy:configure] :: loading settings :: file = /x1/jenkins/jenkins-
> slave/workspace/Lucene-Solr-SmokeRelease-
> 5.x/lucene/build/smokeTestRelease/tmp/unpack/lucene-5.5.0/ivy-
> settings.xml
> > [smoker]
> > [smoker] resolve:
> > [smoker]
> > [smoker] init:
> > [smoker]
> > [smoker] -clover.disable:
> > [smoker]
> > [smoker] -clover.load:
> > [smoker]
> > [smoker] -clover.classpath:
> > [smoker]
> > [smoker] -clover.setup:
> > [smoker]
> > [smoker] clover:
> > [smoker]
> > [smoker] compile-core:
> > [smoker]
> > [smoker] compile-codecs:
> > [smoker]
> > [smoker] ivy-availability-check:
> > [smoker]
> > [smoker] ivy-fail:
> > [smoker]
> > [smoker] ivy-configure:
> > [smoker] [ivy:configure] :: loading settings :: file = /x1/jenkins/jenkins-
> slave/workspace/Lucene-Solr-SmokeRelease-
> 5.x/lucene/build/smokeTestRelease/tmp/unpack/lucene-5.5.0/ivy-
> settings.xml
> > [smoker]
> > [smoker] resolve:
> > [smoker]
> > [smoker] common.init:
> > [smoker]
> > [smoker] compile-lucene-core:
> > [smoker]
> > [smoker] init:
> > [smoker]
> > [smoker] -clover.disable:
> > [smoker]
> > [smoker] -clover.load:
> > [smoker]
> > [smoker] -clover.classpath:
> > [smoker]
> > [smoker] -clover.setup:
> > [smoker]
> > [smoker] clover:
> > [smoker]
> > [smoker] compile-core:
> > [smoker] [mkdir] Created dir: /x1/jenkins/jenkins-
> slave/workspace/Lucene-Solr-SmokeRelease-
> 5.x/lucene/build/smokeTestRelease/tmp/unpack/lucene-
> 5.5.0/build/codecs/classes/java
> > [smoker] [javac] Compiling 64 source files to /x1/jenkins/jenkins-
> slave/workspace/Lucene-Solr-SmokeRelease-
> 5.x/lucene/build/smokeTestRelease/tmp/unpack/lucene-
> 5.5.0/build/codecs/classes/java
> > [smoker] [javac] Note: Some input files use or override a deprecated
> API.
> > [smoker] [javac] Note: Recompile with -Xlint:deprecation for details.
> > [smoker] [javac] Creating empty /x1/jenkins/jenkins-
> slave/workspace/Lucene-Solr-SmokeRelease-
> 5.x/lucene/build/smokeTestRelease/tmp/unpack/lucene-
> 5.5.0/build/codecs/classes/java/org/apache/lucene/codecs/blocktreeords/p
> ackage-info.class
> > [smoker] [javac] Creating empty /x1/jenkins/jenkins-
> slave/workspace/Lucene-Solr-SmokeRelease-
> 5.x/lucene/build/smokeTestRelease/tmp/unpack/lucene-
> 5.5.0/build/codecs/classes/java/org/apache/lucene/codecs/memory/packag
> e-info.class
> > [smoker] [javac] Creating empty /x1/jenkins/jenkins-
> slave/workspace/Lucene-Solr-SmokeRelease-
> 5.x/lucene/build/smokeTestRelease/tmp/unpack/lucene-
> 5.5.0/build/codecs/classes/java/org/apache/lucene/codecs/simpletext/pack
> age-info.class
> > [smoker] [javac] Creating empty /x1/jenkins/jenkins-
> slave/workspace/Lucene-Solr-SmokeRelease-
> 5.x/lucene/build/smokeTestRelease/tmp/unpack/lucene-
> 5.5.0/build/codecs/classes/java/org/apache/lucene/codecs/blockterms/pac
> kage-info.class
> > [smoker] [javac] Creating empty /x1/jenkins/jenkins-
> slave/workspace/Lucene-Solr-SmokeRelease-
> 5.x/lucene/build/smokeTestRelease/tmp/unpack/lucene-
> 5.5.0/build/codecs/classes/java/org/apache/lucene/codecs/bloom/package-
> info.class
> > [smoker] [javac] Creating empty /x1/jenkins/jenkins-
> slave/workspace/Lucene-Solr-SmokeRelease-
> 5.x/lucene/build/smokeTestRelease/tmp/unpack/lucene-
> 5.5.0/build/codecs/classes/java/org/apache/lucene/codecs/autoprefix/pack
> age-info.class
> > [smoker] [copy] Copying 3 files to /x1/jenkins/jenkins-
> slave/workspace/Lucene-Solr-SmokeRelease-
> 5.x/lucene/build/smokeTestRelease/tmp/unpack/lucene-
> 5.5.0/build/codecs/classes/java
> > [smoker]
> > [smoker] -clover.disable:
> > [smoker]
> > [smoker] -clover.load:
> > [smoker]
> > [smoker] -clover.classpath:
> > [smoker]
> > [smoker] -clover.setup:
> > [smoker]
> > [smoker] clover:
> > [smoker]
> > [smoker] common.compile-core:
> > [smoker] [mkdir] Created dir: /x1/jenkins/jenkins-
> slave/workspace/Lucene-Solr-SmokeRelease-
> 5.x/lucene/build/smokeTestRelease/tmp/unpack/lucene-5.5.0/build/test-
> framework/classes/java
> > [smoker] [javac] Compiling 174 source files to /x1/jenkins/jenkins-
> slave/workspace/Lucene-Solr-SmokeRelease-
> 5.x/lucene/build/smokeTestRelease/tmp/unpack/lucene-5.5.0/build/test-
> framework/classes/java
> > [smoker] [javac] Note: Some input files use or override a deprecated
> API.
> > [smoker] [javac] Note: Recompile with -Xlint:deprecation for details.
> > [smoker] [javac] Creating empty /x1/jenkins/jenkins-
> slave/workspace/Lucene-Solr-SmokeRelease-
> 5.x/lucene/build/smokeTestRelease/tmp/unpack/lucene-5.5.0/build/test-
> framework/classes/java/org/apache/lucene/mockfile/package-info.class
> > [smoker] [javac] Creating empty /x1/jenkins/jenkins-
> slave/workspace/Lucene-Solr-SmokeRelease-
> 5.x/lucene/build/smokeTestRelease/tmp/unpack/lucene-5.5.0/build/test-
> framework/classes/java/org/apache/lucene/codecs/cranky/package-
> info.class
> > [smoker] [javac] Creating empty /x1/jenkins/jenkins-
> slave/workspace/Lucene-Solr-SmokeRelease-
> 5.x/lucene/build/smokeTestRelease/tmp/unpack/lucene-5.5.0/build/test-
> framework/classes/java/org/apache/lucene/codecs/compressing/dummy/p
> ackage-info.class
> > [smoker] [javac] Creating empty /x1/jenkins/jenkins-
> slave/workspace/Lucene-Solr-SmokeRelease-
> 5.x/lucene/build/smokeTestRelease/tmp/unpack/lucene-5.5.0/build/test-
> framework/classes/java/org/apache/lucene/codecs/asserting/package-
> info.class
> > [smoker] [javac] Creating empty /x1/jenkins/jenkins-
> slave/workspace/Lucene-Solr-SmokeRelease-
> 5.x/lucene/build/smokeTestRelease/tmp/unpack/lucene-5.5.0/build/test-
> framework/classes/java/org/apache/lucene/codecs/ramonly/package-
> info.class
> > [smoker] [javac] Creating empty /x1/jenkins/jenkins-
> slave/workspace/Lucene-Solr-SmokeRelease-
> 5.x/lucene/build/smokeTestRelease/tmp/unpack/lucene-5.5.0/build/test-
> framework/classes/java/org/apache/lucene/codecs/cheapbastard/package-
> info.class
> > [smoker] [javac] Creating empty /x1/jenkins/jenkins-
> slave/workspace/Lucene-Solr-SmokeRelease-
> 5.x/lucene/build/smokeTestRelease/tmp/unpack/lucene-5.5.0/build/test-
> framework/classes/java/org/apache/lucene/codecs/mockrandom/package-
> info.class
> > [smoker] [copy] Copying 4 files to /x1/jenkins/jenkins-
> slave/workspace/Lucene-Solr-SmokeRelease-
> 5.x/lucene/build/smokeTestRelease/tmp/unpack/lucene-5.5.0/build/test-
> framework/classes/java
> > [smoker]
> > [smoker] compile-core:
> > [smoker]
> > [smoker] compile-test:
> > [smoker] [mkdir] Created dir: /x1/jenkins/jenkins-
> slave/workspace/Lucene-Solr-SmokeRelease-
> 5.x/lucene/build/smokeTestRelease/tmp/unpack/lucene-
> 5.5.0/build/core/classes/test
> > [smoker] [javac] Compiling 423 source files to /x1/jenkins/jenkins-
> slave/workspace/Lucene-Solr-SmokeRelease-
> 5.x/lucene/build/smokeTestRelease/tmp/unpack/lucene-
> 5.5.0/build/core/classes/test
> > [smoker] [javac] Note: Some input files use or override a deprecated
> API.
> > [smoker] [javac] Note: Recompile with -Xlint:deprecation for details.
> > [smoker] [copy] Copying 3 files to /x1/jenkins/jenkins-
> slave/workspace/Lucene-Solr-SmokeRelease-
> 5.x/lucene/build/smokeTestRelease/tmp/unpack/lucene-
> 5.5.0/build/core/classes/test
> > [smoker]
> > [smoker] install-junit4-taskdef:
> > [smoker]
> > [smoker] validate:
> > [smoker]
> > [smoker] resolve-groovy:
> > [smoker]
> > [smoker] -init-totals:
> > [smoker]
> > [smoker] -test:
> > [smoker] [mkdir] Created dir: /x1/jenkins/jenkins-
> slave/workspace/Lucene-Solr-SmokeRelease-
> 5.x/lucene/build/smokeTestRelease/tmp/unpack/lucene-
> 5.5.0/build/core/test
> > [smoker] [loadresource] Do not set property tests.explicitclass as its
> length is 0.
> > [smoker] [mkdir] Created dir: /x1/jenkins/jenkins-
> slave/workspace/Lucene-Solr-SmokeRelease-
> 5.x/lucene/build/smokeTestRelease/tmp/unpack/lucene-
> 5.5.0/build/core/test/temp
> > [smoker] [mkdir] Created dir: /x1/jenkins/jenkins-
> slave/workspace/Lucene-Solr-SmokeRelease-
> 5.x/lucene/build/smokeTestRelease/tmp/unpack/.caches/test-stats/core
> > [smoker] [junit4] <JUnit4> says Привет! Master seed:
> 7D958AF1623A040A
> > [smoker] [junit4] Executing 415 suites with 3 JVMs.
> > [smoker] [junit4]
> > [smoker] [junit4] Started J2 PID(5848@localhost).
> > [smoker] [junit4] Started J1 PID(5851@localhost).
> > [smoker] [junit4] Started J0 PID(5849@localhost).
> > [smoker] [junit4] Suite: org.apache.lucene.search.TestMultiset
> > [smoker] [junit4] Completed [2/415] on J0 in 1.28s, 2 tests
> > [smoker] [junit4]
> > [smoker] [junit4] Suite: org.apache.lucene.search.TestTopDocsCollector
> > [smoker] [junit4] Completed [3/415] on J2 in 2.09s, 8 tests
> > [smoker] [junit4]
> > [smoker] [junit4] Suite: org.apache.lucene.store.TestWindowsMMap
> > [smoker] [junit4] Completed [4/415] on J2 in 1.08s, 1 test
> > [smoker] [junit4]
> > [smoker] [junit4] Suite: org.apache.lucene.store.TestBufferedChecksum
> > [smoker] [junit4] Completed [5/415] on J2 in 0.23s, 2 tests
> > [smoker] [junit4]
> > [smoker] [junit4] Suite: org.apache.lucene.index.TestOmitTf
> > [smoker] [junit4] Completed [6/415] on J2 in 2.06s, 6 tests
> > [smoker] [junit4]
> > [smoker] [junit4] Suite:
> org.apache.lucene.search.TestPositionIncrement
> > [smoker] [junit4] Completed [7/415] on J2 in 0.28s, 2 tests
> > [smoker] [junit4]
> > [smoker] [junit4] Suite:
> org.apache.lucene.search.TestQueryWrapperFilter
> > [smoker] [junit4] Completed [8/415] on J2 in 3.51s, 6 tests
> > [smoker] [junit4]
> > [smoker] [junit4] Suite: org.apache.lucene.search.TestFieldValueQuery
> > [smoker] [junit4] Completed [9/415] on J1 in 9.41s, 6 tests
> > [smoker] [junit4]
> > [smoker] [junit4] Suite: org.apache.lucene.util.TestPagedBytes
> > [smoker] [junit4] Completed [10/415] on J2 in 3.28s, 4 tests, 1 skipped
> > [smoker] [junit4]
> > [smoker] [junit4] Suite:
> org.apache.lucene.search.TestSloppyPhraseQuery
> > [smoker] [junit4] Completed [11/415] on J2 in 4.54s, 9 tests
> > [smoker] [junit4]
> > [smoker] [junit4] Suite:
> org.apache.lucene.search.TestQueryCachingPolicy
> > [smoker] [junit4] Completed [12/415] on J2 in 0.12s, 1 test
> > [smoker] [junit4]
> > [smoker] [junit4] Suite:
> org.apache.lucene.codecs.lucene50.TestBlockPostingsFormat
> > [smoker] [junit4] IGNOR/A 0.02s J1 |
> TestBlockPostingsFormat.testRamBytesUsed
> > [smoker] [junit4] > Assumption #1: 'slow' test group is disabled
> (@Slow())
> > [smoker] [junit4] Completed [13/415] on J1 in 13.71s, 32 tests, 1 skipped
> > [smoker] [junit4]
> > [smoker] [junit4] Suite: org.apache.lucene.index.TestFlex
> > [smoker] [junit4] Completed [14/415] on J1 in 0.30s, 2 tests
> > [smoker] [junit4]
> > [smoker] [junit4] Suite:
> org.apache.lucene.index.TestConcurrentMergeScheduler
> > [smoker] [junit4] Completed [15/415] on J2 in 10.43s, 16 tests
> > [smoker] [junit4]
> > [smoker] [junit4] Suite: org.apache.lucene.index.TestIndexWriterReader
> > [smoker] [junit4] IGNOR/A 0.01s J2 |
> TestIndexWriterReader.testDuringAddIndexes
> > [smoker] [junit4] > Assumption #1: 'nightly' test group is disabled
> (@Nightly())
> > [smoker] [junit4] IGNOR/A 0.00s J2 |
> TestIndexWriterReader.testAddIndexesAndDoDeletesThreads
> > [smoker] [junit4] > Assumption #1: 'slow' test group is disabled
> (@Slow())
> > [smoker] [junit4] Completed [16/415] on J2 in 10.16s, 23 tests, 2 skipped
> > [smoker] [junit4]
> > [smoker] [junit4] Suite:
> org.apache.lucene.index.TestIndexWriterExceptions
> > [smoker] [junit4] IGNOR/A 0.00s J1 |
> TestIndexWriterExceptions.testTooManyTokens
> > [smoker] [junit4] > Assumption #1: 'nightly' test group is disabled
> (@Nightly())
> > [smoker] [junit4] Completed [17/415] on J1 in 19.20s, 36 tests, 1 skipped
> > [smoker] [junit4]
> > [smoker] [junit4] Suite: org.apache.lucene.TestMergeSchedulerExternal
> > [smoker] [junit4] Completed [18/415] on J1 in 0.62s, 2 tests
> > [smoker] [junit4]
> > [smoker] [junit4] Suite: org.apache.lucene.util.TestCloseableThreadLocal
> > [smoker] [junit4] Completed [19/415] on J1 in 0.04s, 3 tests
> > [smoker] [junit4]
> > [smoker] [junit4] Suite:
> org.apache.lucene.index.TestIndexWriterMerging
> > [smoker] [junit4] IGNOR/A 0.00s J2 |
> TestIndexWriterMerging.testNoWaitClose
> > [smoker] [junit4] > Assumption #1: 'slow' test group is disabled
> (@Slow())
> > [smoker] [junit4] Completed [20/415] on J2 in 7.72s, 6 tests, 1 skipped
> > [smoker] [junit4]
> > [smoker] [junit4] Suite: org.apache.lucene.index.TestStressIndexing
> > [smoker] [junit4] Completed [21/415] on J1 in 2.42s, 1 test
> > [smoker] [junit4]
> > [smoker] [junit4] Suite: org.apache.lucene.index.TestSegmentTermDocs
> > [smoker] [junit4] Completed [22/415] on J1 in 1.03s, 4 tests
> > [smoker] [junit4]
> > [smoker] [junit4] Suite: org.apache.lucene.index.TestTerms
> > [smoker] [junit4] Completed [23/415] on J2 in 1.65s, 8 tests
> > [smoker] [junit4]
> > [smoker] [junit4] Suite: org.apache.lucene.util.TestBitDocIdSetBuilder
> > [smoker] [junit4] Completed [24/415] on J1 in 0.50s, 6 tests
> > [smoker] [junit4]
> > [smoker] [junit4] Suite:
> org.apache.lucene.search.spans.TestFieldMaskingSpanQuery
> > [smoker] [junit4] Completed [25/415] on J1 in 2.35s, 11 tests
> > [smoker] [junit4]
> > [smoker] [junit4] Suite: org.apache.lucene.search.TestBooleanOr
> > [smoker] [junit4] Completed [26/415] on J2 in 6.68s, 7 tests
> > [smoker] [junit4]
> > [smoker] [junit4] Suite:
> org.apache.lucene.store.TestNRTCachingDirectory
> > [smoker] [junit4] IGNOR/A 0.01s J1 |
> TestNRTCachingDirectory.testFsyncDoesntCreateNewFiles
> > [smoker] [junit4] > Assumption #1: test only works for FSDirectory
> subclasses
> > [smoker] [junit4] Completed [27/415] on J1 in 4.40s, 41 tests, 1 skipped
> > [smoker] [junit4]
> > [smoker] [junit4] Suite: org.apache.lucene.util.TestVersion
> > [smoker] [junit4] Completed [28/415] on J1 in 0.16s, 11 tests
> > [smoker] [junit4]
> > [smoker] [junit4] Suite: org.apache.lucene.util.TestRoaringDocIdSet
> > [smoker] [junit4] Completed [29/415] on J2 in 0.60s, 5 tests
> > [smoker] [junit4]
> > [smoker] [junit4] Suite: org.apache.lucene.search.TestTopDocsMerge
> > [smoker] [junit4] Completed [30/415] on J2 in 2.48s, 2 tests
> > [smoker] [junit4]
> > [smoker] [junit4] Suite: org.apache.lucene.index.TestIndexWriterConfig
> > [smoker] [junit4] Completed [31/415] on J2 in 0.18s, 8 tests
> > [smoker] [junit4]
> > [smoker] [junit4] Suite:
> org.apache.lucene.index.TestCodecHoldsOpenFiles
> > [smoker] [junit4] Completed [32/415] on J2 in 0.09s, 1 test
> > [smoker] [junit4]
> > [smoker] [junit4] Suite: org.apache.lucene.index.TestAddIndexes
> > [smoker] [junit4] Completed [33/415] on J1 in 4.76s, 23 tests
> > [smoker] [junit4]
> > [smoker] [junit4] Suite:
> org.apache.lucene.analysis.TestNumericTokenStream
> > [smoker] [junit4] Completed [34/415] on J1 in 0.09s, 5 tests
> > [smoker] [junit4]
> > [smoker] [junit4] Suite: org.apache.lucene.index.TestByteSlices
> > [smoker] [junit4] Completed [35/415] on J1 in 5.09s, 1 test
> > [smoker] [junit4]
> > [smoker] [junit4] Suite:
> org.apache.lucene.util.automaton.TestOperations
> > [smoker] [junit4] Completed [36/415] on J1 in 0.65s, 5 tests
> > [smoker] [junit4]
> > [smoker] [junit4] Suite:
> org.apache.lucene.search.TestDisjunctionMaxQuery
> > [smoker] [junit4] Completed [37/415] on J1 in 2.44s, 12 tests
> > [smoker] [junit4]
> > [smoker] [junit4] Suite: org.apache.lucene.document.TestFieldType
> > [smoker] [junit4] Completed [38/415] on J1 in 0.14s, 2 tests
> > [smoker] [junit4]
> > [smoker] [junit4] Suite: org.apache.lucene.analysis.TestCharFilter
> > [smoker] [junit4] Completed [39/415] on J1 in 0.06s, 4 tests
> > [smoker] [junit4]
> > [smoker] [junit4] HEARTBEAT J0 PID(5849@localhost): 2016-01-
> 07T17:53:44, stalled for 69.5s at:
> TestGrowableByteArrayDataOutput.testWriteLargeStrings
> > [smoker] [junit4] Suite:
> org.apache.lucene.codecs.perfield.TestPerFieldPostingsFormat
> > [smoker] [junit4] IGNOR/A 0.01s J2 |
> TestPerFieldPostingsFormat.testPostingsEnumReuse
> > [smoker] [junit4] > Assumption #1: The MockRandom PF randomizes
> content on the fly, so we can't check it
> > [smoker] [junit4] IGNOR/A 0.00s J2 |
> TestPerFieldPostingsFormat.testRamBytesUsed
> > [smoker] [junit4] > Assumption #1: 'slow' test group is disabled
> (@Slow())
> > [smoker] [junit4] IGNOR/A 0.01s J2 |
> TestPerFieldPostingsFormat.testMergeStability
> > [smoker] [junit4] > Assumption #1: The MockRandom PF randomizes
> content on the fly, so we can't check it
> > [smoker] [junit4] Completed [40/415] on J2 in 13.46s, 30 tests, 3 skipped
> > [smoker] [junit4]
> > [smoker] [junit4] Suite: org.apache.lucene.index.TestStressAdvance
> > [smoker] [junit4] Completed [41/415] on J1 in 4.00s, 1 test
> > [smoker] [junit4]
> > [smoker] [junit4] Suite:
> org.apache.lucene.search.spans.TestSpanCollection
> > [smoker] [junit4] Completed [42/415] on J1 in 0.12s, 3 tests
> > [smoker] [junit4]
> > [smoker] [junit4] Suite:
> org.apache.lucene.index.TestTransactionRollback
> > [smoker] [junit4] Completed [43/415] on J1 in 0.49s, 2 tests
> > [smoker] [junit4]
> > [smoker] [junit4] Suite: org.apache.lucene.search.TestTermRangeQuery
> > [smoker] [junit4] Completed [44/415] on J1 in 0.27s, 7 tests
> > [smoker] [junit4]
> > [smoker] [junit4] Suite:
> org.apache.lucene.index.TestAllFilesHaveChecksumFooter
> > [smoker] [junit4] Completed [45/415] on J1 in 0.18s, 1 test
> > [smoker] [junit4]
> > [smoker] [junit4] Suite:
> org.apache.lucene.index.TestIndexWriterLockRelease
> > [smoker] [junit4] Completed [46/415] on J1 in 0.09s, 1 test
> > [smoker] [junit4]
> > [smoker] [junit4] Suite: org.apache.lucene.index.TestTermdocPerf
> > [smoker] [junit4] Completed [47/415] on J1 in 0.23s, 1 test
> > [smoker] [junit4]
> > [smoker] [junit4] Suite: org.apache.lucene.util.TestUnicodeUtil
> > [smoker] [junit4] Completed [48/415] on J1 in 1.21s, 5 tests
> > [smoker] [junit4]
> > [smoker] [junit4] Suite: org.apache.lucene.search.TestTermRangeFilter
> > [smoker] [junit4] Completed [49/415] on J1 in 3.54s, 3 tests
> > [smoker] [junit4]
> > [smoker] [junit4] Suite: org.apache.lucene.util.TestSloppyMath
> > [smoker] [junit4] Completed [50/415] on J1 in 0.35s, 3 tests
> > [smoker] [junit4]
> > [smoker] [junit4] Suite:
> org.apache.lucene.search.TestSameScoresWithThreads
> > [smoker] [junit4] Completed [51/415] on J1 in 2.83s, 1 test
> > [smoker] [junit4]
> > [smoker] [junit4] Suite: org.apache.lucene.index.TestDuelingCodecs
> > [smoker] [junit4] IGNOR/A 0.00s J1 |
> TestDuelingCodecs.testCrazyReaderEquals
> > [smoker] [junit4] > Assumption #1: 'slow' test group is disabled
> (@Slow())
> > [smoker] [junit4] IGNOR/A 0.00s J1 | TestDuelingCodecs.testEquals
> > [smoker] [junit4] > Assumption #1: 'slow' test group is disabled
> (@Slow())
> > [smoker] [junit4] Completed [52/415] on J1 in 0.02s, 2 tests, 2 skipped
> > [smoker] [junit4]
> > [smoker] [junit4] Suite:
> org.apache.lucene.codecs.lucene50.TestLucene50StoredFieldsFormat
> > [smoker] [junit4] IGNOR/A 0.00s J2 |
> TestLucene50StoredFieldsFormat.testBigDocuments
> > [smoker] [junit4] > Assumption #1: 'nightly' test group is disabled
> (@Nightly())
> > [smoker] [junit4] IGNOR/A 0.00s J2 |
> TestLucene50StoredFieldsFormat.testRamBytesUsed
> > [smoker] [junit4] > Assumption #1: 'slow' test group is disabled
> (@Slow())
> > [smoker] [junit4] Completed [53/415] on J2 in 10.95s, 17 tests, 2 skipped
> > [smoker] [junit4]
> > [smoker] [junit4] Suite: org.apache.lucene.util.packed.TestDirectPacked
> > [smoker] [junit4] Completed [54/415] on J2 in 1.36s, 4 tests
> > [smoker] [junit4]
> > [smoker] [junit4] Suite:
> org.apache.lucene.codecs.compressing.TestGrowableByteArrayDataOutput
> > [smoker] [junit4] Completed [55/415] on J0 in 83.08s, 2 tests
> > [smoker] [junit4]
> > [smoker] [junit4] Suite: org.apache.lucene.index.TestLongPostings
> > [smoker] [junit4] Completed [56/415] on J2 in 3.50s, 2 tests
> > [smoker] [junit4]
> > [smoker] [junit4] Suite: org.apache.lucene.util.fst.TestBytesStore
> > [smoker] [junit4] Completed [57/415] on J2 in 1.31s, 1 test
> > [smoker] [junit4]
> > [smoker] [junit4] Suite: org.apache.lucene.index.TestManyFields
> > [smoker] [junit4] Completed [58/415] on J1 in 7.08s, 3 tests
> > [smoker] [junit4]
> > [smoker] [junit4] Suite: org.apache.lucene.util.TestBytesRef
> > [smoker] [junit4] Completed [59/415] on J1 in 0.07s, 3 tests
> > [smoker] [junit4]
> > [smoker] [junit4] Suite: org.apache.lucene.codecs.lucene50.TestForUtil
> > [smoker] [junit4] Completed [60/415] on J1 in 0.15s, 1 test
> > [smoker] [junit4]
> > [smoker] [junit4] Suite:
> org.apache.lucene.index.Test2BSortedDocValuesFixedSorted
> > [smoker] [junit4] IGNOR/A 0.00s J2 |
> Test2BSortedDocValuesFixedSorted.testFixedSorted
> > [smoker] [junit4] > Assumption #1: 'monster' test group is disabled
> (@Monster(value=Takes ~ 6 hours if the heap is 5gb))
> > [smoker] [junit4] Completed [61/415] on J2 in 0.04s, 1 test, 1 skipped
> > [smoker] [junit4]
> > [smoker] [junit4] Suite: org.apache.lucene.search.TestReqExclBulkScorer
> > [smoker] [junit4] Completed [62/415] on J1 in 0.05s, 1 test
> > [smoker] [junit4]
> > [smoker] [junit4] Suite: org.apache.lucene.index.TestIndexCommit
> > [smoker] [junit4] Completed [63/415] on J1 in 0.09s, 1 test
> > [smoker] [junit4]
> > [smoker] [junit4] Suite:
> org.apache.lucene.search.TestComplexExplanationsOfNonMatches
> > [smoker] [junit4] Completed [64/415] on J2 in 0.33s, 21 tests
> > [smoker] [junit4]
> > [smoker] [junit4] Suite: org.apache.lucene.search.TestIndexSearcher
> > [smoker] [junit4] Completed [65/415] on J2 in 0.90s, 5 tests
> > [smoker] [junit4]
> > [smoker] [junit4] Suite: org.apache.lucene.index.TestNorms
> > [smoker] [junit4] IGNOR/A 0.00s J2 | TestNorms.testCustomEncoder
> > [smoker] [junit4] > Assumption #1: 'slow' test group is disabled
> (@Slow())
> > [smoker] [junit4] IGNOR/A 0.00s J2 | TestNorms.testMaxByteNorms
> > [smoker] [junit4] > Assumption #1: 'slow' test group is disabled
> (@Slow())
> > [smoker] [junit4] Completed [66/415] on J2 in 0.00s, 2 tests, 2 skipped
> > [smoker] [junit4]
> > [smoker] [junit4] Suite: org.apache.lucene.search.TestSearchAfter
> > [smoker] [junit4] Completed [67/415] on J1 in 2.49s, 1 test
> > [smoker] [junit4]
> > [smoker] [junit4] Suite: org.apache.lucene.search.TestFilteredSearch
> > [smoker] [junit4] Completed [68/415] on J1 in 0.08s, 1 test
> > [smoker] [junit4]
> > [smoker] [junit4] Suite:
> org.apache.lucene.index.TestIndexWriterCommit
> > [smoker] [junit4] Completed [69/415] on J0 in 7.02s, 13 tests
> > [smoker] [junit4]
> > [smoker] [junit4] Suite:
> org.apache.lucene.index.TestForceMergeForever
> > [smoker] [junit4] Completed [70/415] on J1 in 0.47s, 1 test
> > [smoker] [junit4]
> > [smoker] [junit4] Suite:
> org.apache.lucene.index.TestIndexWriterWithThreads
> > [smoker] [junit4] IGNOR/A 0.02s J0 |
> TestIndexWriterWithThreads.testIOExceptionDuringWriteSegment
> > [smoker] [junit4] > Assumption #1: 'slow' test group is disabled
> (@Slow())
> > [smoker] [junit4] IGNOR/A 0.00s J0 |
> TestIndexWriterWithThreads.testIOExceptionDuringAbortWithThreadsOnly
> Once
> > [smoker] [junit4] > Assumption #1: 'slow' test group is disabled
> (@Slow())
> > [smoker] [junit4] IGNOR/A 0.00s J0 |
> TestIndexWriterWithThreads.testImmediateDiskFullWithThreads
> > [smoker] [junit4] > Assumption #1: 'slow' test group is disabled
> (@Slow())
> > [smoker] [junit4] IGNOR/A 0.02s J0 |
> TestIndexWriterWithThreads.testIOExceptionDuringWriteSegmentWithThre
> ads
> > [smoker] [junit4] > Assumption #1: 'slow' test group is disabled
> (@Slow())
> > [smoker] [junit4] IGNOR/A 0.00s J0 |
> TestIndexWriterWithThreads.testIOExceptionDuringWriteSegmentWithThre
> adsOnlyOnce
> > [smoker] [junit4] > Assumption #1: 'slow' test group is disabled
> (@Slow())
> > [smoker] [junit4] IGNOR/A 0.00s J0 |
> TestIndexWriterWithThreads.testCloseWithThreads
> > [smoker] [junit4] > Assumption #1: 'slow' test group is disabled
> (@Slow())
> > [smoker] [junit4] IGNOR/A 0.00s J0 |
> TestIndexWriterWithThreads.testIOExceptionDuringWriteSegmentOnlyOnce
> > [smoker] [junit4] > Assumption #1: 'slow' test group is disabled
> (@Slow())
> > [smoker] [junit4] IGNOR/A 0.00s J0 |
> TestIndexWriterWithThreads.testIOExceptionDuringAbortWithThreads
> > [smoker] [junit4] > Assumption #1: 'slow' test group is disabled
> (@Slow())
> > [smoker] [junit4] IGNOR/A 0.00s J0 |
> TestIndexWriterWithThreads.testRollbackAndCommitWithThreads
> > [smoker] [junit4] > Assumption #1: 'slow' test group is disabled
> (@Slow())
> > [smoker] [junit4] IGNOR/A 0.00s J0 |
> TestIndexWriterWithThreads.testIOExceptionDuringAbortOnlyOnce
> > [smoker] [junit4] > Assumption #1: 'slow' test group is disabled
> (@Slow())
> > [smoker] [junit4] IGNOR/A 0.00s J0 |
> TestIndexWriterWithThreads.testOpenTwoIndexWritersOnDifferentThreads
> > [smoker] [junit4] > Assumption #1: 'slow' test group is disabled
> (@Slow())
> > [smoker] [junit4] IGNOR/A 0.00s J0 |
> TestIndexWriterWithThreads.testIOExceptionDuringAbort
> > [smoker] [junit4] > Assumption #1: 'slow' test group is disabled
> (@Slow())
> > [smoker] [junit4] Completed [71/415] on J0 in 0.10s, 12 tests, 12 skipped
> > [smoker] [junit4]
> > [smoker] [junit4] Suite:
> org.apache.lucene.search.TestMultiTermQueryRewrites
> > [smoker] [junit4] Completed [72/415] on J1 in 0.33s, 3 tests
> > [smoker] [junit4]
> > [smoker] [junit4] Suite: org.apache.lucene.index.TestNewestSegment
> > [smoker] [junit4] Completed [73/415] on J1 in 0.07s, 1 test
> > [smoker] [junit4]
> > [smoker] [junit4] Suite: org.apache.lucene.document.TestDateTools
> > [smoker] [junit4] Completed [74/415] on J1 in 0.12s, 5 tests
> > [smoker] [junit4]
> > [smoker] [junit4] Suite: org.apache.lucene.TestDemo
> > [smoker] [junit4] Completed [75/415] on J0 in 0.48s, 1 test
> > [smoker] [junit4]
> > [smoker] [junit4] Suite: org.apache.lucene.util.Test2BPagedBytes
> > [smoker] [junit4] IGNOR/A 0.00s J0 | Test2BPagedBytes.test
> > [smoker] [junit4] > Assumption #1: 'monster' test group is disabled
> (@Monster(value=You must increase heap to > 2 G to run this))
> > [smoker] [junit4] Completed [76/415] on J0 in 0.03s, 1 test, 1 skipped
> > [smoker] [junit4]
> > [smoker] [junit4] Suite: org.apache.lucene.index.TestFieldReuse
> > [smoker] [junit4] Completed [77/415] on J1 in 0.08s, 3 tests
> > [smoker] [junit4]
> > [smoker] [junit4] Suite: org.apache.lucene.search.TestMultiCollector
> > [smoker] [junit4] Completed [78/415] on J1 in 0.34s, 1 test
> > [smoker] [junit4]
> > [smoker] [junit4] Suite:
> org.apache.lucene.index.TestIndexWriterUnicode
> > [smoker] [junit4] Completed [79/415] on J2 in 7.85s, 5 tests
> > [smoker] [junit4]
> > [smoker] [junit4] Suite: org.apache.lucene.index.TestIndexInput
> > [smoker] [junit4] Completed [80/415] on J1 in 5.69s, 2 tests
> > [smoker] [junit4]
> > [smoker] [junit4] Suite:
> org.apache.lucene.search.TestCachingWrapperQuery
> > [smoker] [junit4] Completed [81/415] on J2 in 0.97s, 7 tests
> > [smoker] [junit4]
> > [smoker] [junit4] Suite: org.apache.lucene.util.TestByteBlockPool
> > [smoker] [junit4] Completed [82/415] on J2 in 0.16s, 1 test
> > [smoker] [junit4]
> > [smoker] [junit4] Suite: org.apache.lucene.store.TestRateLimiter
> > [smoker] [junit4] Completed [83/415] on J1 in 0.39s, 2 tests
> > [smoker] [junit4]
> > [smoker] [junit4] Suite: org.apache.lucene.util.TestNotDocIdSet
> > [smoker] [junit4] Completed [84/415] on J2 in 1.19s, 6 tests
> > [smoker] [junit4]
> > [smoker] [junit4] Suite:
> org.apache.lucene.util.automaton.FiniteStringsIteratorTest
> > [smoker] [junit4] Completed [85/415] on J1 in 1.28s, 7 tests
> > [smoker] [junit4]
> > [smoker] [junit4] Suite:
> org.apache.lucene.search.TestCachingWrapperFilter
> > [smoker] [junit4] Completed [86/415] on J2 in 1.59s, 11 tests
> > [smoker] [junit4]
> > [smoker] [junit4] Suite: org.apache.lucene.search.spans.TestFilterSpans
> > [smoker] [junit4] Completed [87/415] on J2 in 0.05s, 1 test
> > [smoker] [junit4]
> > [smoker] [junit4] Suite: org.apache.lucene.index.TestTermVectors
> > [smoker] [junit4] Completed [88/415] on J1 in 2.02s, 3 tests
> > [smoker] [junit4]
> > [smoker] [junit4] Suite: org.apache.lucene.store.TestLockFactory
> > [smoker] [junit4] Completed [89/415] on J1 in 0.09s, 2 tests
> > [smoker] [junit4]
> > [smoker] [junit4] Suite: org.apache.lucene.index.TestStressNRT
> > [smoker] [junit4] Completed [90/415] on J0 in 15.47s, 1 test
> > [smoker] [junit4]
> > [smoker] [junit4] Suite:
> org.apache.lucene.index.TestSnapshotDeletionPolicy
> > [smoker] [junit4] Completed [91/415] on J0 in 1.84s, 7 tests
> > [smoker] [junit4]
> > [smoker] [junit4] Could not serialize report for suite
> org.apache.lucene.index.TestSnapshotDeletionPolicy: java.io.IOException:
> No space left on device
> > [smoker] [junit4] Suite: org.apache.lucene.search.spans.TestBasics
> > [smoker] [junit4] Completed [92/415] on J1 in 8.39s, 25 tests
> > [smoker] [junit4]
> > [smoker] [junit4] Could not serialize report for suite
> org.apache.lucene.search.spans.TestBasics: java.io.IOException: No space
> left on device
> > [smoker] [junit4] Suite:
> org.apache.lucene.index.TestAllFilesHaveCodecHeader
> > [smoker] [junit4] Completed [93/415] on J1 in 0.23s, 1 test
> > [smoker] [junit4]
> > [smoker] [junit4] Could not serialize report for suite
> org.apache.lucene.index.TestAllFilesHaveCodecHeader: java.io.IOException:
> No space left on device
> > [smoker] [junit4] Jan 07, 2016 5:54:29 PM
> com.carrotsearch.ant.tasks.junit4.dependencies.com.google.common.io.Clo
> seables close
> > [smoker] [junit4] WARNING: IOException thrown while closing
> Closeable.
> > [smoker] [junit4] java.io.IOException: No space left on device
> > [smoker] [junit4] at java.io.FileOutputStream.writeBytes(Native
> Method)
> > [smoker] [junit4] at
> java.io.FileOutputStream.write(FileOutputStream.java:345)
> > [smoker] [junit4] at
> sun.nio.cs.StreamEncoder.writeBytes(StreamEncoder.java:221)
> > [smoker] [junit4] at
> sun.nio.cs.StreamEncoder.implWrite(StreamEncoder.java:282)
> > [smoker] [junit4] at
> sun.nio.cs.StreamEncoder.write(StreamEncoder.java:125)
> > [smoker] [junit4] at
> java.io.OutputStreamWriter.write(OutputStreamWriter.java:207)
> > [smoker] [junit4] at
> java.io.BufferedWriter.flushBuffer(BufferedWriter.java:129)
> > [smoker] [junit4] at
> java.io.BufferedWriter.close(BufferedWriter.java:264)
> > [smoker] [junit4] at
> com.carrotsearch.ant.tasks.junit4.dependencies.com.google.common.io.Clo
> seables.close(Closeables.java:79)
> > [smoker] [junit4] at
> com.carrotsearch.ant.tasks.junit4.listeners.TextReport.onQuit(TextReport.ja
> va:409)
> > [smoker] [junit4] at
> sun.reflect.NativeMethodAccessorImpl.invoke0(Native Method)
> > [smoker] [junit4] at
> sun.reflect.NativeMethodAccessorImpl.invoke(NativeMethodAc
> > [smoker]
> > [smoker] Traceback (most recent call last):
> > [smoker] File "/x1/jenkins/jenkins-slave/workspace/Lucene-Solr-
> SmokeRelease-5.x/dev-tools/scripts/smokeTestRelease.py", line 1454, in
> <module>
> > [smoker] main()
> > [smoker] File "/x1/jenkins/jenkins-slave/workspace/Lucene-Solr-
> SmokeRelease-5.x/dev-tools/scripts/smokeTestRelease.py", line 1399, in
> main
> > [smoker] smokeTest(c.java, c.url, c.revision, c.version, c.tmp_dir,
> c.is_signed, ' '.join(c.test_args))
> > [smoker] File "/x1/jenkins/jenkins-slave/workspace/Lucene-Solr-
> SmokeRelease-5.x/dev-tools/scripts/smokeTestRelease.py", line 1437, in
> smokeTest
> > [smoker] unpackAndVerify(java, 'lucene', tmpDir, 'lucene-%s-src.tgz' %
> version, svnRevision, version, testArgs, baseURL)
> > [smoker] File "/x1/jenkins/jenkins-slave/workspace/Lucene-Solr-
> SmokeRelease-5.x/dev-tools/scripts/smokeTestRelease.py", line 588, in
> unpackAndVerify
> > [smoker] verifyUnpacked(java, project, artifact, unpackPath,
> svnRevision, version, testArgs, tmpDir, baseURL)
> > [smoker] File "/x1/jenkins/jenkins-slave/workspace/Lucene-Solr-
> SmokeRelease-5.x/dev-tools/scripts/smokeTestRelease.py", line 680, in
> verifyUnpacked
> > [smoker] java.run_java7('ant clean test %s' % testArgs, '%s/test.log' %
> unpackPath)
> > [smoker] File "/x1/jenkins/jenkins-slave/workspace/Lucene-Solr-
> SmokeRelease-5.x/dev-tools/scripts/smokeTestRelease.py", line 1231, in
> run_java
> > [smoker] run('%s; %s' % (cmd_prefix, cmd), logfile)
> > [smoker] File "/x1/jenkins/jenkins-slave/workspace/Lucene-Solr-
> SmokeRelease-5.x/dev-tools/scripts/smokeTestRelease.py", line 513, in run
> > [smoker] raise RuntimeError('command "%s" failed; see log file %s' %
> (command, logPath))
> > [smoker] RuntimeError: command "export
> JAVA_HOME="/home/jenkins/jenkins-
> slave/tools/hudson.model.JDK/latest1.7" PATH="/home/jenkins/jenkins-
> slave/tools/hudson.model.JDK/latest1.7/bin:$PATH"
> JAVACMD="/home/jenkins/jenkins-
> slave/tools/hudson.model.JDK/latest1.7/bin/java"; ant clean test -
> Dtests.slow=false" failed; see log file /x1/jenkins/jenkins-
> slave/workspace/Lucene-Solr-SmokeRelease-
> 5.x/lucene/build/smokeTestRelease/tmp/unpack/lucene-5.5.0/test.log
> >
> > BUILD FAILED
> > /x1/jenkins/jenkins-slave/workspace/Lucene-Solr-SmokeRelease-
> 5.x/build.xml:545: exec returned: 1
> >
> > Total time: 17 minutes 30 seconds
> > Build step 'Invoke Ant' marked build as failure
> > Email was triggered for: Failure - Any
> > Sending email for trigger: Failure - Any
> > Setting LATEST1_8_HOME=/home/jenkins/jenkins-
> slave/tools/hudson.model.JDK/latest1.8
> > Setting LATEST1_8_HOME=/home/jenkins/jenkins-
> slave/tools/hudson.model.JDK/latest1.8
> >
> >
> >
> > ---------------------------------------------------------------------
> > To unsubscribe, e-mail: dev-unsubscribe@lucene.apache.org
> > For additional commands, e-mail: dev-help@lucene.apache.org
>
>
>
> ---------------------------------------------------------------------
> To unsubscribe, e-mail: dev-unsubscribe@lucene.apache.org
> For additional commands, e-mail: dev-help@lucene.apache.org
---------------------------------------------------------------------
To unsubscribe, e-mail: dev-unsubscribe@lucene.apache.org
For additional commands, e-mail: dev-help@lucene.apache.org
Re: [JENKINS] Lucene-Solr-SmokeRelease-5.x - Build # 430 - Still Failing
Posted by Steve Rowe <sa...@gmail.com>.
Looks like ASF Jenkins's lucene slave is running out of disk space (again):
> [smoker] [junit4] java.io.IOException: No space left on device
Uwe, opinions on what to do? Should we ask Infra for more disk space (again)?
> On Jan 7, 2016, at 12:54 PM, Apache Jenkins Server <je...@builds.apache.org> wrote:
>
> Build: https://builds.apache.org/job/Lucene-Solr-SmokeRelease-5.x/430/
>
> No tests ran.
>
> Build Log:
> [...truncated 53145 lines...]
> prepare-release-no-sign:
> [mkdir] Created dir: /x1/jenkins/jenkins-slave/workspace/Lucene-Solr-SmokeRelease-5.x/lucene/build/smokeTestRelease/dist
> [copy] Copying 461 files to /x1/jenkins/jenkins-slave/workspace/Lucene-Solr-SmokeRelease-5.x/lucene/build/smokeTestRelease/dist/lucene
> [copy] Copying 245 files to /x1/jenkins/jenkins-slave/workspace/Lucene-Solr-SmokeRelease-5.x/lucene/build/smokeTestRelease/dist/solr
> [smoker] Java 1.7 JAVA_HOME=/home/jenkins/jenkins-slave/tools/hudson.model.JDK/latest1.7
> [smoker] Java 1.8 JAVA_HOME=/home/jenkins/jenkins-slave/tools/hudson.model.JDK/latest1.8
> [smoker] NOTE: output encoding is UTF-8
> [smoker]
> [smoker] Load release URL "file:/x1/jenkins/jenkins-slave/workspace/Lucene-Solr-SmokeRelease-5.x/lucene/build/smokeTestRelease/dist/"...
> [smoker]
> [smoker] Test Lucene...
> [smoker] test basics...
> [smoker] get KEYS
> [smoker] 0.2 MB in 0.01 sec (10.3 MB/sec)
> [smoker] check changes HTML...
> [smoker] download lucene-5.5.0-src.tgz...
> [smoker] 28.7 MB in 0.04 sec (644.7 MB/sec)
> [smoker] verify md5/sha1 digests
> [smoker] download lucene-5.5.0.tgz...
> [smoker] 63.4 MB in 0.10 sec (648.5 MB/sec)
> [smoker] verify md5/sha1 digests
> [smoker] download lucene-5.5.0.zip...
> [smoker] 73.8 MB in 0.12 sec (624.1 MB/sec)
> [smoker] verify md5/sha1 digests
> [smoker] unpack lucene-5.5.0.tgz...
> [smoker] verify JAR metadata/identity/no javax.* or java.* classes...
> [smoker] test demo with 1.7...
> [smoker] got 6174 hits for query "lucene"
> [smoker] checkindex with 1.7...
> [smoker] test demo with 1.8...
> [smoker] got 6174 hits for query "lucene"
> [smoker] checkindex with 1.8...
> [smoker] check Lucene's javadoc JAR
> [smoker] unpack lucene-5.5.0.zip...
> [smoker] verify JAR metadata/identity/no javax.* or java.* classes...
> [smoker] test demo with 1.7...
> [smoker] got 6174 hits for query "lucene"
> [smoker] checkindex with 1.7...
> [smoker] test demo with 1.8...
> [smoker] got 6174 hits for query "lucene"
> [smoker] checkindex with 1.8...
> [smoker] check Lucene's javadoc JAR
> [smoker] unpack lucene-5.5.0-src.tgz...
> [smoker] make sure no JARs/WARs in src dist...
> [smoker] run "ant validate"
> [smoker] run tests w/ Java 7 and testArgs='-Dtests.slow=false'...
> [smoker]
> [smoker] command "export JAVA_HOME="/home/jenkins/jenkins-slave/tools/hudson.model.JDK/latest1.7" PATH="/home/jenkins/jenkins-slave/tools/hudson.model.JDK/latest1.7/bin:$PATH" JAVACMD="/home/jenkins/jenkins-slave/tools/hudson.model.JDK/latest1.7/bin/java"; ant clean test -Dtests.slow=false" failed:
> [smoker] Buildfile: /x1/jenkins/jenkins-slave/workspace/Lucene-Solr-SmokeRelease-5.x/lucene/build/smokeTestRelease/tmp/unpack/lucene-5.5.0/build.xml
> [smoker]
> [smoker] clean:
> [smoker] [delete] Deleting directory /x1/jenkins/jenkins-slave/workspace/Lucene-Solr-SmokeRelease-5.x/lucene/build/smokeTestRelease/tmp/unpack/lucene-5.5.0/build
> [smoker]
> [smoker] ivy-availability-check:
> [smoker]
> [smoker] ivy-fail:
> [smoker]
> [smoker] ivy-configure:
> [smoker] [ivy:configure] :: Apache Ivy 2.3.0 - 20130110142753 :: http://ant.apache.org/ivy/ ::
> [smoker] [ivy:configure] :: loading settings :: file = /x1/jenkins/jenkins-slave/workspace/Lucene-Solr-SmokeRelease-5.x/lucene/build/smokeTestRelease/tmp/unpack/lucene-5.5.0/ivy-settings.xml
> [smoker]
> [smoker] -clover.load:
> [smoker]
> [smoker] resolve-groovy:
> [smoker] [ivy:cachepath] :: resolving dependencies :: org.codehaus.groovy#groovy-all-caller;working
> [smoker] [ivy:cachepath] confs: [default]
> [smoker] [ivy:cachepath] found org.codehaus.groovy#groovy-all;2.4.4 in public
> [smoker] [ivy:cachepath] :: resolution report :: resolve 291ms :: artifacts dl 3ms
> [smoker] ---------------------------------------------------------------------
> [smoker] | | modules || artifacts |
> [smoker] | conf | number| search|dwnlded|evicted|| number|dwnlded|
> [smoker] ---------------------------------------------------------------------
> [smoker] | default | 1 | 0 | 0 | 0 || 1 | 0 |
> [smoker] ---------------------------------------------------------------------
> [smoker]
> [smoker] -init-totals:
> [smoker]
> [smoker] test-core:
> [smoker]
> [smoker] -clover.disable:
> [smoker]
> [smoker] ivy-availability-check:
> [smoker]
> [smoker] ivy-fail:
> [smoker]
> [smoker] ivy-configure:
> [smoker] [ivy:configure] :: loading settings :: file = /x1/jenkins/jenkins-slave/workspace/Lucene-Solr-SmokeRelease-5.x/lucene/build/smokeTestRelease/tmp/unpack/lucene-5.5.0/ivy-settings.xml
> [smoker]
> [smoker] -clover.load:
> [smoker]
> [smoker] -clover.classpath:
> [smoker]
> [smoker] -clover.setup:
> [smoker]
> [smoker] clover:
> [smoker]
> [smoker] resolve:
> [smoker]
> [smoker] init:
> [smoker]
> [smoker] compile-core:
> [smoker] [mkdir] Created dir: /x1/jenkins/jenkins-slave/workspace/Lucene-Solr-SmokeRelease-5.x/lucene/build/smokeTestRelease/tmp/unpack/lucene-5.5.0/build/core/classes/java
> [smoker] [javac] Compiling 733 source files to /x1/jenkins/jenkins-slave/workspace/Lucene-Solr-SmokeRelease-5.x/lucene/build/smokeTestRelease/tmp/unpack/lucene-5.5.0/build/core/classes/java
> [smoker] [javac] Note: Some input files use or override a deprecated API.
> [smoker] [javac] Note: Recompile with -Xlint:deprecation for details.
> [smoker] [javac] Creating empty /x1/jenkins/jenkins-slave/workspace/Lucene-Solr-SmokeRelease-5.x/lucene/build/smokeTestRelease/tmp/unpack/lucene-5.5.0/build/core/classes/java/org/apache/lucene/codecs/blocktree/package-info.class
> [smoker] [javac] Creating empty /x1/jenkins/jenkins-slave/workspace/Lucene-Solr-SmokeRelease-5.x/lucene/build/smokeTestRelease/tmp/unpack/lucene-5.5.0/build/core/classes/java/org/apache/lucene/codecs/lucene54/package-info.class
> [smoker] [javac] Creating empty /x1/jenkins/jenkins-slave/workspace/Lucene-Solr-SmokeRelease-5.x/lucene/build/smokeTestRelease/tmp/unpack/lucene-5.5.0/build/core/classes/java/org/apache/lucene/util/packed/package-info.class
> [smoker] [javac] Creating empty /x1/jenkins/jenkins-slave/workspace/Lucene-Solr-SmokeRelease-5.x/lucene/build/smokeTestRelease/tmp/unpack/lucene-5.5.0/build/core/classes/java/org/apache/lucene/analysis/package-info.class
> [smoker] [javac] Creating empty /x1/jenkins/jenkins-slave/workspace/Lucene-Solr-SmokeRelease-5.x/lucene/build/smokeTestRelease/tmp/unpack/lucene-5.5.0/build/core/classes/java/org/apache/lucene/document/package-info.class
> [smoker] [javac] Creating empty /x1/jenkins/jenkins-slave/workspace/Lucene-Solr-SmokeRelease-5.x/lucene/build/smokeTestRelease/tmp/unpack/lucene-5.5.0/build/core/classes/java/org/apache/lucene/util/package-info.class
> [smoker] [javac] Creating empty /x1/jenkins/jenkins-slave/workspace/Lucene-Solr-SmokeRelease-5.x/lucene/build/smokeTestRelease/tmp/unpack/lucene-5.5.0/build/core/classes/java/org/apache/lucene/analysis/tokenattributes/package-info.class
> [smoker] [javac] Creating empty /x1/jenkins/jenkins-slave/workspace/Lucene-Solr-SmokeRelease-5.x/lucene/build/smokeTestRelease/tmp/unpack/lucene-5.5.0/build/core/classes/java/org/apache/lucene/codecs/lucene50/package-info.class
> [smoker] [javac] Creating empty /x1/jenkins/jenkins-slave/workspace/Lucene-Solr-SmokeRelease-5.x/lucene/build/smokeTestRelease/tmp/unpack/lucene-5.5.0/build/core/classes/java/org/apache/lucene/index/package-info.class
> [smoker] [javac] Creating empty /x1/jenkins/jenkins-slave/workspace/Lucene-Solr-SmokeRelease-5.x/lucene/build/smokeTestRelease/tmp/unpack/lucene-5.5.0/build/core/classes/java/org/apache/lucene/codecs/compressing/package-info.class
> [smoker] [javac] Creating empty /x1/jenkins/jenkins-slave/workspace/Lucene-Solr-SmokeRelease-5.x/lucene/build/smokeTestRelease/tmp/unpack/lucene-5.5.0/build/core/classes/java/org/apache/lucene/codecs/lucene53/package-info.class
> [smoker] [javac] Creating empty /x1/jenkins/jenkins-slave/workspace/Lucene-Solr-SmokeRelease-5.x/lucene/build/smokeTestRelease/tmp/unpack/lucene-5.5.0/build/core/classes/java/org/apache/lucene/util/automaton/package-info.class
> [smoker] [javac] Creating empty /x1/jenkins/jenkins-slave/workspace/Lucene-Solr-SmokeRelease-5.x/lucene/build/smokeTestRelease/tmp/unpack/lucene-5.5.0/build/core/classes/java/org/apache/lucene/util/fst/package-info.class
> [smoker] [javac] Creating empty /x1/jenkins/jenkins-slave/workspace/Lucene-Solr-SmokeRelease-5.x/lucene/build/smokeTestRelease/tmp/unpack/lucene-5.5.0/build/core/classes/java/org/apache/lucene/util/mutable/package-info.class
> [smoker] [javac] Creating empty /x1/jenkins/jenkins-slave/workspace/Lucene-Solr-SmokeRelease-5.x/lucene/build/smokeTestRelease/tmp/unpack/lucene-5.5.0/build/core/classes/java/org/apache/lucene/search/similarities/package-info.class
> [smoker] [javac] Creating empty /x1/jenkins/jenkins-slave/workspace/Lucene-Solr-SmokeRelease-5.x/lucene/build/smokeTestRelease/tmp/unpack/lucene-5.5.0/build/core/classes/java/org/apache/lucene/codecs/perfield/package-info.class
> [smoker] [javac] Creating empty /x1/jenkins/jenkins-slave/workspace/Lucene-Solr-SmokeRelease-5.x/lucene/build/smokeTestRelease/tmp/unpack/lucene-5.5.0/build/core/classes/java/org/apache/lucene/store/package-info.class
> [smoker] [javac] Creating empty /x1/jenkins/jenkins-slave/workspace/Lucene-Solr-SmokeRelease-5.x/lucene/build/smokeTestRelease/tmp/unpack/lucene-5.5.0/build/core/classes/java/org/apache/lucene/package-info.class
> [smoker] [javac] Creating empty /x1/jenkins/jenkins-slave/workspace/Lucene-Solr-SmokeRelease-5.x/lucene/build/smokeTestRelease/tmp/unpack/lucene-5.5.0/build/core/classes/java/org/apache/lucene/search/package-info.class
> [smoker] [javac] Creating empty /x1/jenkins/jenkins-slave/workspace/Lucene-Solr-SmokeRelease-5.x/lucene/build/smokeTestRelease/tmp/unpack/lucene-5.5.0/build/core/classes/java/org/apache/lucene/codecs/package-info.class
> [smoker] [javac] Creating empty /x1/jenkins/jenkins-slave/workspace/Lucene-Solr-SmokeRelease-5.x/lucene/build/smokeTestRelease/tmp/unpack/lucene-5.5.0/build/core/classes/java/org/apache/lucene/search/spans/package-info.class
> [smoker] [copy] Copying 3 files to /x1/jenkins/jenkins-slave/workspace/Lucene-Solr-SmokeRelease-5.x/lucene/build/smokeTestRelease/tmp/unpack/lucene-5.5.0/build/core/classes/java
> [smoker]
> [smoker] compile-test-framework:
> [smoker]
> [smoker] ivy-availability-check:
> [smoker]
> [smoker] ivy-fail:
> [smoker]
> [smoker] ivy-configure:
> [smoker] [ivy:configure] :: loading settings :: file = /x1/jenkins/jenkins-slave/workspace/Lucene-Solr-SmokeRelease-5.x/lucene/build/smokeTestRelease/tmp/unpack/lucene-5.5.0/ivy-settings.xml
> [smoker]
> [smoker] resolve:
> [smoker]
> [smoker] init:
> [smoker]
> [smoker] compile-lucene-core:
> [smoker]
> [smoker] ivy-availability-check:
> [smoker]
> [smoker] ivy-fail:
> [smoker]
> [smoker] ivy-configure:
> [smoker] [ivy:configure] :: loading settings :: file = /x1/jenkins/jenkins-slave/workspace/Lucene-Solr-SmokeRelease-5.x/lucene/build/smokeTestRelease/tmp/unpack/lucene-5.5.0/ivy-settings.xml
> [smoker]
> [smoker] resolve:
> [smoker]
> [smoker] init:
> [smoker]
> [smoker] -clover.disable:
> [smoker]
> [smoker] -clover.load:
> [smoker]
> [smoker] -clover.classpath:
> [smoker]
> [smoker] -clover.setup:
> [smoker]
> [smoker] clover:
> [smoker]
> [smoker] compile-core:
> [smoker]
> [smoker] compile-codecs:
> [smoker]
> [smoker] ivy-availability-check:
> [smoker]
> [smoker] ivy-fail:
> [smoker]
> [smoker] ivy-configure:
> [smoker] [ivy:configure] :: loading settings :: file = /x1/jenkins/jenkins-slave/workspace/Lucene-Solr-SmokeRelease-5.x/lucene/build/smokeTestRelease/tmp/unpack/lucene-5.5.0/ivy-settings.xml
> [smoker]
> [smoker] resolve:
> [smoker]
> [smoker] common.init:
> [smoker]
> [smoker] compile-lucene-core:
> [smoker]
> [smoker] init:
> [smoker]
> [smoker] -clover.disable:
> [smoker]
> [smoker] -clover.load:
> [smoker]
> [smoker] -clover.classpath:
> [smoker]
> [smoker] -clover.setup:
> [smoker]
> [smoker] clover:
> [smoker]
> [smoker] compile-core:
> [smoker] [mkdir] Created dir: /x1/jenkins/jenkins-slave/workspace/Lucene-Solr-SmokeRelease-5.x/lucene/build/smokeTestRelease/tmp/unpack/lucene-5.5.0/build/codecs/classes/java
> [smoker] [javac] Compiling 64 source files to /x1/jenkins/jenkins-slave/workspace/Lucene-Solr-SmokeRelease-5.x/lucene/build/smokeTestRelease/tmp/unpack/lucene-5.5.0/build/codecs/classes/java
> [smoker] [javac] Note: Some input files use or override a deprecated API.
> [smoker] [javac] Note: Recompile with -Xlint:deprecation for details.
> [smoker] [javac] Creating empty /x1/jenkins/jenkins-slave/workspace/Lucene-Solr-SmokeRelease-5.x/lucene/build/smokeTestRelease/tmp/unpack/lucene-5.5.0/build/codecs/classes/java/org/apache/lucene/codecs/blocktreeords/package-info.class
> [smoker] [javac] Creating empty /x1/jenkins/jenkins-slave/workspace/Lucene-Solr-SmokeRelease-5.x/lucene/build/smokeTestRelease/tmp/unpack/lucene-5.5.0/build/codecs/classes/java/org/apache/lucene/codecs/memory/package-info.class
> [smoker] [javac] Creating empty /x1/jenkins/jenkins-slave/workspace/Lucene-Solr-SmokeRelease-5.x/lucene/build/smokeTestRelease/tmp/unpack/lucene-5.5.0/build/codecs/classes/java/org/apache/lucene/codecs/simpletext/package-info.class
> [smoker] [javac] Creating empty /x1/jenkins/jenkins-slave/workspace/Lucene-Solr-SmokeRelease-5.x/lucene/build/smokeTestRelease/tmp/unpack/lucene-5.5.0/build/codecs/classes/java/org/apache/lucene/codecs/blockterms/package-info.class
> [smoker] [javac] Creating empty /x1/jenkins/jenkins-slave/workspace/Lucene-Solr-SmokeRelease-5.x/lucene/build/smokeTestRelease/tmp/unpack/lucene-5.5.0/build/codecs/classes/java/org/apache/lucene/codecs/bloom/package-info.class
> [smoker] [javac] Creating empty /x1/jenkins/jenkins-slave/workspace/Lucene-Solr-SmokeRelease-5.x/lucene/build/smokeTestRelease/tmp/unpack/lucene-5.5.0/build/codecs/classes/java/org/apache/lucene/codecs/autoprefix/package-info.class
> [smoker] [copy] Copying 3 files to /x1/jenkins/jenkins-slave/workspace/Lucene-Solr-SmokeRelease-5.x/lucene/build/smokeTestRelease/tmp/unpack/lucene-5.5.0/build/codecs/classes/java
> [smoker]
> [smoker] -clover.disable:
> [smoker]
> [smoker] -clover.load:
> [smoker]
> [smoker] -clover.classpath:
> [smoker]
> [smoker] -clover.setup:
> [smoker]
> [smoker] clover:
> [smoker]
> [smoker] common.compile-core:
> [smoker] [mkdir] Created dir: /x1/jenkins/jenkins-slave/workspace/Lucene-Solr-SmokeRelease-5.x/lucene/build/smokeTestRelease/tmp/unpack/lucene-5.5.0/build/test-framework/classes/java
> [smoker] [javac] Compiling 174 source files to /x1/jenkins/jenkins-slave/workspace/Lucene-Solr-SmokeRelease-5.x/lucene/build/smokeTestRelease/tmp/unpack/lucene-5.5.0/build/test-framework/classes/java
> [smoker] [javac] Note: Some input files use or override a deprecated API.
> [smoker] [javac] Note: Recompile with -Xlint:deprecation for details.
> [smoker] [javac] Creating empty /x1/jenkins/jenkins-slave/workspace/Lucene-Solr-SmokeRelease-5.x/lucene/build/smokeTestRelease/tmp/unpack/lucene-5.5.0/build/test-framework/classes/java/org/apache/lucene/mockfile/package-info.class
> [smoker] [javac] Creating empty /x1/jenkins/jenkins-slave/workspace/Lucene-Solr-SmokeRelease-5.x/lucene/build/smokeTestRelease/tmp/unpack/lucene-5.5.0/build/test-framework/classes/java/org/apache/lucene/codecs/cranky/package-info.class
> [smoker] [javac] Creating empty /x1/jenkins/jenkins-slave/workspace/Lucene-Solr-SmokeRelease-5.x/lucene/build/smokeTestRelease/tmp/unpack/lucene-5.5.0/build/test-framework/classes/java/org/apache/lucene/codecs/compressing/dummy/package-info.class
> [smoker] [javac] Creating empty /x1/jenkins/jenkins-slave/workspace/Lucene-Solr-SmokeRelease-5.x/lucene/build/smokeTestRelease/tmp/unpack/lucene-5.5.0/build/test-framework/classes/java/org/apache/lucene/codecs/asserting/package-info.class
> [smoker] [javac] Creating empty /x1/jenkins/jenkins-slave/workspace/Lucene-Solr-SmokeRelease-5.x/lucene/build/smokeTestRelease/tmp/unpack/lucene-5.5.0/build/test-framework/classes/java/org/apache/lucene/codecs/ramonly/package-info.class
> [smoker] [javac] Creating empty /x1/jenkins/jenkins-slave/workspace/Lucene-Solr-SmokeRelease-5.x/lucene/build/smokeTestRelease/tmp/unpack/lucene-5.5.0/build/test-framework/classes/java/org/apache/lucene/codecs/cheapbastard/package-info.class
> [smoker] [javac] Creating empty /x1/jenkins/jenkins-slave/workspace/Lucene-Solr-SmokeRelease-5.x/lucene/build/smokeTestRelease/tmp/unpack/lucene-5.5.0/build/test-framework/classes/java/org/apache/lucene/codecs/mockrandom/package-info.class
> [smoker] [copy] Copying 4 files to /x1/jenkins/jenkins-slave/workspace/Lucene-Solr-SmokeRelease-5.x/lucene/build/smokeTestRelease/tmp/unpack/lucene-5.5.0/build/test-framework/classes/java
> [smoker]
> [smoker] compile-core:
> [smoker]
> [smoker] compile-test:
> [smoker] [mkdir] Created dir: /x1/jenkins/jenkins-slave/workspace/Lucene-Solr-SmokeRelease-5.x/lucene/build/smokeTestRelease/tmp/unpack/lucene-5.5.0/build/core/classes/test
> [smoker] [javac] Compiling 423 source files to /x1/jenkins/jenkins-slave/workspace/Lucene-Solr-SmokeRelease-5.x/lucene/build/smokeTestRelease/tmp/unpack/lucene-5.5.0/build/core/classes/test
> [smoker] [javac] Note: Some input files use or override a deprecated API.
> [smoker] [javac] Note: Recompile with -Xlint:deprecation for details.
> [smoker] [copy] Copying 3 files to /x1/jenkins/jenkins-slave/workspace/Lucene-Solr-SmokeRelease-5.x/lucene/build/smokeTestRelease/tmp/unpack/lucene-5.5.0/build/core/classes/test
> [smoker]
> [smoker] install-junit4-taskdef:
> [smoker]
> [smoker] validate:
> [smoker]
> [smoker] resolve-groovy:
> [smoker]
> [smoker] -init-totals:
> [smoker]
> [smoker] -test:
> [smoker] [mkdir] Created dir: /x1/jenkins/jenkins-slave/workspace/Lucene-Solr-SmokeRelease-5.x/lucene/build/smokeTestRelease/tmp/unpack/lucene-5.5.0/build/core/test
> [smoker] [loadresource] Do not set property tests.explicitclass as its length is 0.
> [smoker] [mkdir] Created dir: /x1/jenkins/jenkins-slave/workspace/Lucene-Solr-SmokeRelease-5.x/lucene/build/smokeTestRelease/tmp/unpack/lucene-5.5.0/build/core/test/temp
> [smoker] [mkdir] Created dir: /x1/jenkins/jenkins-slave/workspace/Lucene-Solr-SmokeRelease-5.x/lucene/build/smokeTestRelease/tmp/unpack/.caches/test-stats/core
> [smoker] [junit4] <JUnit4> says Привет! Master seed: 7D958AF1623A040A
> [smoker] [junit4] Executing 415 suites with 3 JVMs.
> [smoker] [junit4]
> [smoker] [junit4] Started J2 PID(5848@localhost).
> [smoker] [junit4] Started J1 PID(5851@localhost).
> [smoker] [junit4] Started J0 PID(5849@localhost).
> [smoker] [junit4] Suite: org.apache.lucene.search.TestMultiset
> [smoker] [junit4] Completed [2/415] on J0 in 1.28s, 2 tests
> [smoker] [junit4]
> [smoker] [junit4] Suite: org.apache.lucene.search.TestTopDocsCollector
> [smoker] [junit4] Completed [3/415] on J2 in 2.09s, 8 tests
> [smoker] [junit4]
> [smoker] [junit4] Suite: org.apache.lucene.store.TestWindowsMMap
> [smoker] [junit4] Completed [4/415] on J2 in 1.08s, 1 test
> [smoker] [junit4]
> [smoker] [junit4] Suite: org.apache.lucene.store.TestBufferedChecksum
> [smoker] [junit4] Completed [5/415] on J2 in 0.23s, 2 tests
> [smoker] [junit4]
> [smoker] [junit4] Suite: org.apache.lucene.index.TestOmitTf
> [smoker] [junit4] Completed [6/415] on J2 in 2.06s, 6 tests
> [smoker] [junit4]
> [smoker] [junit4] Suite: org.apache.lucene.search.TestPositionIncrement
> [smoker] [junit4] Completed [7/415] on J2 in 0.28s, 2 tests
> [smoker] [junit4]
> [smoker] [junit4] Suite: org.apache.lucene.search.TestQueryWrapperFilter
> [smoker] [junit4] Completed [8/415] on J2 in 3.51s, 6 tests
> [smoker] [junit4]
> [smoker] [junit4] Suite: org.apache.lucene.search.TestFieldValueQuery
> [smoker] [junit4] Completed [9/415] on J1 in 9.41s, 6 tests
> [smoker] [junit4]
> [smoker] [junit4] Suite: org.apache.lucene.util.TestPagedBytes
> [smoker] [junit4] Completed [10/415] on J2 in 3.28s, 4 tests, 1 skipped
> [smoker] [junit4]
> [smoker] [junit4] Suite: org.apache.lucene.search.TestSloppyPhraseQuery
> [smoker] [junit4] Completed [11/415] on J2 in 4.54s, 9 tests
> [smoker] [junit4]
> [smoker] [junit4] Suite: org.apache.lucene.search.TestQueryCachingPolicy
> [smoker] [junit4] Completed [12/415] on J2 in 0.12s, 1 test
> [smoker] [junit4]
> [smoker] [junit4] Suite: org.apache.lucene.codecs.lucene50.TestBlockPostingsFormat
> [smoker] [junit4] IGNOR/A 0.02s J1 | TestBlockPostingsFormat.testRamBytesUsed
> [smoker] [junit4] > Assumption #1: 'slow' test group is disabled (@Slow())
> [smoker] [junit4] Completed [13/415] on J1 in 13.71s, 32 tests, 1 skipped
> [smoker] [junit4]
> [smoker] [junit4] Suite: org.apache.lucene.index.TestFlex
> [smoker] [junit4] Completed [14/415] on J1 in 0.30s, 2 tests
> [smoker] [junit4]
> [smoker] [junit4] Suite: org.apache.lucene.index.TestConcurrentMergeScheduler
> [smoker] [junit4] Completed [15/415] on J2 in 10.43s, 16 tests
> [smoker] [junit4]
> [smoker] [junit4] Suite: org.apache.lucene.index.TestIndexWriterReader
> [smoker] [junit4] IGNOR/A 0.01s J2 | TestIndexWriterReader.testDuringAddIndexes
> [smoker] [junit4] > Assumption #1: 'nightly' test group is disabled (@Nightly())
> [smoker] [junit4] IGNOR/A 0.00s J2 | TestIndexWriterReader.testAddIndexesAndDoDeletesThreads
> [smoker] [junit4] > Assumption #1: 'slow' test group is disabled (@Slow())
> [smoker] [junit4] Completed [16/415] on J2 in 10.16s, 23 tests, 2 skipped
> [smoker] [junit4]
> [smoker] [junit4] Suite: org.apache.lucene.index.TestIndexWriterExceptions
> [smoker] [junit4] IGNOR/A 0.00s J1 | TestIndexWriterExceptions.testTooManyTokens
> [smoker] [junit4] > Assumption #1: 'nightly' test group is disabled (@Nightly())
> [smoker] [junit4] Completed [17/415] on J1 in 19.20s, 36 tests, 1 skipped
> [smoker] [junit4]
> [smoker] [junit4] Suite: org.apache.lucene.TestMergeSchedulerExternal
> [smoker] [junit4] Completed [18/415] on J1 in 0.62s, 2 tests
> [smoker] [junit4]
> [smoker] [junit4] Suite: org.apache.lucene.util.TestCloseableThreadLocal
> [smoker] [junit4] Completed [19/415] on J1 in 0.04s, 3 tests
> [smoker] [junit4]
> [smoker] [junit4] Suite: org.apache.lucene.index.TestIndexWriterMerging
> [smoker] [junit4] IGNOR/A 0.00s J2 | TestIndexWriterMerging.testNoWaitClose
> [smoker] [junit4] > Assumption #1: 'slow' test group is disabled (@Slow())
> [smoker] [junit4] Completed [20/415] on J2 in 7.72s, 6 tests, 1 skipped
> [smoker] [junit4]
> [smoker] [junit4] Suite: org.apache.lucene.index.TestStressIndexing
> [smoker] [junit4] Completed [21/415] on J1 in 2.42s, 1 test
> [smoker] [junit4]
> [smoker] [junit4] Suite: org.apache.lucene.index.TestSegmentTermDocs
> [smoker] [junit4] Completed [22/415] on J1 in 1.03s, 4 tests
> [smoker] [junit4]
> [smoker] [junit4] Suite: org.apache.lucene.index.TestTerms
> [smoker] [junit4] Completed [23/415] on J2 in 1.65s, 8 tests
> [smoker] [junit4]
> [smoker] [junit4] Suite: org.apache.lucene.util.TestBitDocIdSetBuilder
> [smoker] [junit4] Completed [24/415] on J1 in 0.50s, 6 tests
> [smoker] [junit4]
> [smoker] [junit4] Suite: org.apache.lucene.search.spans.TestFieldMaskingSpanQuery
> [smoker] [junit4] Completed [25/415] on J1 in 2.35s, 11 tests
> [smoker] [junit4]
> [smoker] [junit4] Suite: org.apache.lucene.search.TestBooleanOr
> [smoker] [junit4] Completed [26/415] on J2 in 6.68s, 7 tests
> [smoker] [junit4]
> [smoker] [junit4] Suite: org.apache.lucene.store.TestNRTCachingDirectory
> [smoker] [junit4] IGNOR/A 0.01s J1 | TestNRTCachingDirectory.testFsyncDoesntCreateNewFiles
> [smoker] [junit4] > Assumption #1: test only works for FSDirectory subclasses
> [smoker] [junit4] Completed [27/415] on J1 in 4.40s, 41 tests, 1 skipped
> [smoker] [junit4]
> [smoker] [junit4] Suite: org.apache.lucene.util.TestVersion
> [smoker] [junit4] Completed [28/415] on J1 in 0.16s, 11 tests
> [smoker] [junit4]
> [smoker] [junit4] Suite: org.apache.lucene.util.TestRoaringDocIdSet
> [smoker] [junit4] Completed [29/415] on J2 in 0.60s, 5 tests
> [smoker] [junit4]
> [smoker] [junit4] Suite: org.apache.lucene.search.TestTopDocsMerge
> [smoker] [junit4] Completed [30/415] on J2 in 2.48s, 2 tests
> [smoker] [junit4]
> [smoker] [junit4] Suite: org.apache.lucene.index.TestIndexWriterConfig
> [smoker] [junit4] Completed [31/415] on J2 in 0.18s, 8 tests
> [smoker] [junit4]
> [smoker] [junit4] Suite: org.apache.lucene.index.TestCodecHoldsOpenFiles
> [smoker] [junit4] Completed [32/415] on J2 in 0.09s, 1 test
> [smoker] [junit4]
> [smoker] [junit4] Suite: org.apache.lucene.index.TestAddIndexes
> [smoker] [junit4] Completed [33/415] on J1 in 4.76s, 23 tests
> [smoker] [junit4]
> [smoker] [junit4] Suite: org.apache.lucene.analysis.TestNumericTokenStream
> [smoker] [junit4] Completed [34/415] on J1 in 0.09s, 5 tests
> [smoker] [junit4]
> [smoker] [junit4] Suite: org.apache.lucene.index.TestByteSlices
> [smoker] [junit4] Completed [35/415] on J1 in 5.09s, 1 test
> [smoker] [junit4]
> [smoker] [junit4] Suite: org.apache.lucene.util.automaton.TestOperations
> [smoker] [junit4] Completed [36/415] on J1 in 0.65s, 5 tests
> [smoker] [junit4]
> [smoker] [junit4] Suite: org.apache.lucene.search.TestDisjunctionMaxQuery
> [smoker] [junit4] Completed [37/415] on J1 in 2.44s, 12 tests
> [smoker] [junit4]
> [smoker] [junit4] Suite: org.apache.lucene.document.TestFieldType
> [smoker] [junit4] Completed [38/415] on J1 in 0.14s, 2 tests
> [smoker] [junit4]
> [smoker] [junit4] Suite: org.apache.lucene.analysis.TestCharFilter
> [smoker] [junit4] Completed [39/415] on J1 in 0.06s, 4 tests
> [smoker] [junit4]
> [smoker] [junit4] HEARTBEAT J0 PID(5849@localhost): 2016-01-07T17:53:44, stalled for 69.5s at: TestGrowableByteArrayDataOutput.testWriteLargeStrings
> [smoker] [junit4] Suite: org.apache.lucene.codecs.perfield.TestPerFieldPostingsFormat
> [smoker] [junit4] IGNOR/A 0.01s J2 | TestPerFieldPostingsFormat.testPostingsEnumReuse
> [smoker] [junit4] > Assumption #1: The MockRandom PF randomizes content on the fly, so we can't check it
> [smoker] [junit4] IGNOR/A 0.00s J2 | TestPerFieldPostingsFormat.testRamBytesUsed
> [smoker] [junit4] > Assumption #1: 'slow' test group is disabled (@Slow())
> [smoker] [junit4] IGNOR/A 0.01s J2 | TestPerFieldPostingsFormat.testMergeStability
> [smoker] [junit4] > Assumption #1: The MockRandom PF randomizes content on the fly, so we can't check it
> [smoker] [junit4] Completed [40/415] on J2 in 13.46s, 30 tests, 3 skipped
> [smoker] [junit4]
> [smoker] [junit4] Suite: org.apache.lucene.index.TestStressAdvance
> [smoker] [junit4] Completed [41/415] on J1 in 4.00s, 1 test
> [smoker] [junit4]
> [smoker] [junit4] Suite: org.apache.lucene.search.spans.TestSpanCollection
> [smoker] [junit4] Completed [42/415] on J1 in 0.12s, 3 tests
> [smoker] [junit4]
> [smoker] [junit4] Suite: org.apache.lucene.index.TestTransactionRollback
> [smoker] [junit4] Completed [43/415] on J1 in 0.49s, 2 tests
> [smoker] [junit4]
> [smoker] [junit4] Suite: org.apache.lucene.search.TestTermRangeQuery
> [smoker] [junit4] Completed [44/415] on J1 in 0.27s, 7 tests
> [smoker] [junit4]
> [smoker] [junit4] Suite: org.apache.lucene.index.TestAllFilesHaveChecksumFooter
> [smoker] [junit4] Completed [45/415] on J1 in 0.18s, 1 test
> [smoker] [junit4]
> [smoker] [junit4] Suite: org.apache.lucene.index.TestIndexWriterLockRelease
> [smoker] [junit4] Completed [46/415] on J1 in 0.09s, 1 test
> [smoker] [junit4]
> [smoker] [junit4] Suite: org.apache.lucene.index.TestTermdocPerf
> [smoker] [junit4] Completed [47/415] on J1 in 0.23s, 1 test
> [smoker] [junit4]
> [smoker] [junit4] Suite: org.apache.lucene.util.TestUnicodeUtil
> [smoker] [junit4] Completed [48/415] on J1 in 1.21s, 5 tests
> [smoker] [junit4]
> [smoker] [junit4] Suite: org.apache.lucene.search.TestTermRangeFilter
> [smoker] [junit4] Completed [49/415] on J1 in 3.54s, 3 tests
> [smoker] [junit4]
> [smoker] [junit4] Suite: org.apache.lucene.util.TestSloppyMath
> [smoker] [junit4] Completed [50/415] on J1 in 0.35s, 3 tests
> [smoker] [junit4]
> [smoker] [junit4] Suite: org.apache.lucene.search.TestSameScoresWithThreads
> [smoker] [junit4] Completed [51/415] on J1 in 2.83s, 1 test
> [smoker] [junit4]
> [smoker] [junit4] Suite: org.apache.lucene.index.TestDuelingCodecs
> [smoker] [junit4] IGNOR/A 0.00s J1 | TestDuelingCodecs.testCrazyReaderEquals
> [smoker] [junit4] > Assumption #1: 'slow' test group is disabled (@Slow())
> [smoker] [junit4] IGNOR/A 0.00s J1 | TestDuelingCodecs.testEquals
> [smoker] [junit4] > Assumption #1: 'slow' test group is disabled (@Slow())
> [smoker] [junit4] Completed [52/415] on J1 in 0.02s, 2 tests, 2 skipped
> [smoker] [junit4]
> [smoker] [junit4] Suite: org.apache.lucene.codecs.lucene50.TestLucene50StoredFieldsFormat
> [smoker] [junit4] IGNOR/A 0.00s J2 | TestLucene50StoredFieldsFormat.testBigDocuments
> [smoker] [junit4] > Assumption #1: 'nightly' test group is disabled (@Nightly())
> [smoker] [junit4] IGNOR/A 0.00s J2 | TestLucene50StoredFieldsFormat.testRamBytesUsed
> [smoker] [junit4] > Assumption #1: 'slow' test group is disabled (@Slow())
> [smoker] [junit4] Completed [53/415] on J2 in 10.95s, 17 tests, 2 skipped
> [smoker] [junit4]
> [smoker] [junit4] Suite: org.apache.lucene.util.packed.TestDirectPacked
> [smoker] [junit4] Completed [54/415] on J2 in 1.36s, 4 tests
> [smoker] [junit4]
> [smoker] [junit4] Suite: org.apache.lucene.codecs.compressing.TestGrowableByteArrayDataOutput
> [smoker] [junit4] Completed [55/415] on J0 in 83.08s, 2 tests
> [smoker] [junit4]
> [smoker] [junit4] Suite: org.apache.lucene.index.TestLongPostings
> [smoker] [junit4] Completed [56/415] on J2 in 3.50s, 2 tests
> [smoker] [junit4]
> [smoker] [junit4] Suite: org.apache.lucene.util.fst.TestBytesStore
> [smoker] [junit4] Completed [57/415] on J2 in 1.31s, 1 test
> [smoker] [junit4]
> [smoker] [junit4] Suite: org.apache.lucene.index.TestManyFields
> [smoker] [junit4] Completed [58/415] on J1 in 7.08s, 3 tests
> [smoker] [junit4]
> [smoker] [junit4] Suite: org.apache.lucene.util.TestBytesRef
> [smoker] [junit4] Completed [59/415] on J1 in 0.07s, 3 tests
> [smoker] [junit4]
> [smoker] [junit4] Suite: org.apache.lucene.codecs.lucene50.TestForUtil
> [smoker] [junit4] Completed [60/415] on J1 in 0.15s, 1 test
> [smoker] [junit4]
> [smoker] [junit4] Suite: org.apache.lucene.index.Test2BSortedDocValuesFixedSorted
> [smoker] [junit4] IGNOR/A 0.00s J2 | Test2BSortedDocValuesFixedSorted.testFixedSorted
> [smoker] [junit4] > Assumption #1: 'monster' test group is disabled (@Monster(value=Takes ~ 6 hours if the heap is 5gb))
> [smoker] [junit4] Completed [61/415] on J2 in 0.04s, 1 test, 1 skipped
> [smoker] [junit4]
> [smoker] [junit4] Suite: org.apache.lucene.search.TestReqExclBulkScorer
> [smoker] [junit4] Completed [62/415] on J1 in 0.05s, 1 test
> [smoker] [junit4]
> [smoker] [junit4] Suite: org.apache.lucene.index.TestIndexCommit
> [smoker] [junit4] Completed [63/415] on J1 in 0.09s, 1 test
> [smoker] [junit4]
> [smoker] [junit4] Suite: org.apache.lucene.search.TestComplexExplanationsOfNonMatches
> [smoker] [junit4] Completed [64/415] on J2 in 0.33s, 21 tests
> [smoker] [junit4]
> [smoker] [junit4] Suite: org.apache.lucene.search.TestIndexSearcher
> [smoker] [junit4] Completed [65/415] on J2 in 0.90s, 5 tests
> [smoker] [junit4]
> [smoker] [junit4] Suite: org.apache.lucene.index.TestNorms
> [smoker] [junit4] IGNOR/A 0.00s J2 | TestNorms.testCustomEncoder
> [smoker] [junit4] > Assumption #1: 'slow' test group is disabled (@Slow())
> [smoker] [junit4] IGNOR/A 0.00s J2 | TestNorms.testMaxByteNorms
> [smoker] [junit4] > Assumption #1: 'slow' test group is disabled (@Slow())
> [smoker] [junit4] Completed [66/415] on J2 in 0.00s, 2 tests, 2 skipped
> [smoker] [junit4]
> [smoker] [junit4] Suite: org.apache.lucene.search.TestSearchAfter
> [smoker] [junit4] Completed [67/415] on J1 in 2.49s, 1 test
> [smoker] [junit4]
> [smoker] [junit4] Suite: org.apache.lucene.search.TestFilteredSearch
> [smoker] [junit4] Completed [68/415] on J1 in 0.08s, 1 test
> [smoker] [junit4]
> [smoker] [junit4] Suite: org.apache.lucene.index.TestIndexWriterCommit
> [smoker] [junit4] Completed [69/415] on J0 in 7.02s, 13 tests
> [smoker] [junit4]
> [smoker] [junit4] Suite: org.apache.lucene.index.TestForceMergeForever
> [smoker] [junit4] Completed [70/415] on J1 in 0.47s, 1 test
> [smoker] [junit4]
> [smoker] [junit4] Suite: org.apache.lucene.index.TestIndexWriterWithThreads
> [smoker] [junit4] IGNOR/A 0.02s J0 | TestIndexWriterWithThreads.testIOExceptionDuringWriteSegment
> [smoker] [junit4] > Assumption #1: 'slow' test group is disabled (@Slow())
> [smoker] [junit4] IGNOR/A 0.00s J0 | TestIndexWriterWithThreads.testIOExceptionDuringAbortWithThreadsOnlyOnce
> [smoker] [junit4] > Assumption #1: 'slow' test group is disabled (@Slow())
> [smoker] [junit4] IGNOR/A 0.00s J0 | TestIndexWriterWithThreads.testImmediateDiskFullWithThreads
> [smoker] [junit4] > Assumption #1: 'slow' test group is disabled (@Slow())
> [smoker] [junit4] IGNOR/A 0.02s J0 | TestIndexWriterWithThreads.testIOExceptionDuringWriteSegmentWithThreads
> [smoker] [junit4] > Assumption #1: 'slow' test group is disabled (@Slow())
> [smoker] [junit4] IGNOR/A 0.00s J0 | TestIndexWriterWithThreads.testIOExceptionDuringWriteSegmentWithThreadsOnlyOnce
> [smoker] [junit4] > Assumption #1: 'slow' test group is disabled (@Slow())
> [smoker] [junit4] IGNOR/A 0.00s J0 | TestIndexWriterWithThreads.testCloseWithThreads
> [smoker] [junit4] > Assumption #1: 'slow' test group is disabled (@Slow())
> [smoker] [junit4] IGNOR/A 0.00s J0 | TestIndexWriterWithThreads.testIOExceptionDuringWriteSegmentOnlyOnce
> [smoker] [junit4] > Assumption #1: 'slow' test group is disabled (@Slow())
> [smoker] [junit4] IGNOR/A 0.00s J0 | TestIndexWriterWithThreads.testIOExceptionDuringAbortWithThreads
> [smoker] [junit4] > Assumption #1: 'slow' test group is disabled (@Slow())
> [smoker] [junit4] IGNOR/A 0.00s J0 | TestIndexWriterWithThreads.testRollbackAndCommitWithThreads
> [smoker] [junit4] > Assumption #1: 'slow' test group is disabled (@Slow())
> [smoker] [junit4] IGNOR/A 0.00s J0 | TestIndexWriterWithThreads.testIOExceptionDuringAbortOnlyOnce
> [smoker] [junit4] > Assumption #1: 'slow' test group is disabled (@Slow())
> [smoker] [junit4] IGNOR/A 0.00s J0 | TestIndexWriterWithThreads.testOpenTwoIndexWritersOnDifferentThreads
> [smoker] [junit4] > Assumption #1: 'slow' test group is disabled (@Slow())
> [smoker] [junit4] IGNOR/A 0.00s J0 | TestIndexWriterWithThreads.testIOExceptionDuringAbort
> [smoker] [junit4] > Assumption #1: 'slow' test group is disabled (@Slow())
> [smoker] [junit4] Completed [71/415] on J0 in 0.10s, 12 tests, 12 skipped
> [smoker] [junit4]
> [smoker] [junit4] Suite: org.apache.lucene.search.TestMultiTermQueryRewrites
> [smoker] [junit4] Completed [72/415] on J1 in 0.33s, 3 tests
> [smoker] [junit4]
> [smoker] [junit4] Suite: org.apache.lucene.index.TestNewestSegment
> [smoker] [junit4] Completed [73/415] on J1 in 0.07s, 1 test
> [smoker] [junit4]
> [smoker] [junit4] Suite: org.apache.lucene.document.TestDateTools
> [smoker] [junit4] Completed [74/415] on J1 in 0.12s, 5 tests
> [smoker] [junit4]
> [smoker] [junit4] Suite: org.apache.lucene.TestDemo
> [smoker] [junit4] Completed [75/415] on J0 in 0.48s, 1 test
> [smoker] [junit4]
> [smoker] [junit4] Suite: org.apache.lucene.util.Test2BPagedBytes
> [smoker] [junit4] IGNOR/A 0.00s J0 | Test2BPagedBytes.test
> [smoker] [junit4] > Assumption #1: 'monster' test group is disabled (@Monster(value=You must increase heap to > 2 G to run this))
> [smoker] [junit4] Completed [76/415] on J0 in 0.03s, 1 test, 1 skipped
> [smoker] [junit4]
> [smoker] [junit4] Suite: org.apache.lucene.index.TestFieldReuse
> [smoker] [junit4] Completed [77/415] on J1 in 0.08s, 3 tests
> [smoker] [junit4]
> [smoker] [junit4] Suite: org.apache.lucene.search.TestMultiCollector
> [smoker] [junit4] Completed [78/415] on J1 in 0.34s, 1 test
> [smoker] [junit4]
> [smoker] [junit4] Suite: org.apache.lucene.index.TestIndexWriterUnicode
> [smoker] [junit4] Completed [79/415] on J2 in 7.85s, 5 tests
> [smoker] [junit4]
> [smoker] [junit4] Suite: org.apache.lucene.index.TestIndexInput
> [smoker] [junit4] Completed [80/415] on J1 in 5.69s, 2 tests
> [smoker] [junit4]
> [smoker] [junit4] Suite: org.apache.lucene.search.TestCachingWrapperQuery
> [smoker] [junit4] Completed [81/415] on J2 in 0.97s, 7 tests
> [smoker] [junit4]
> [smoker] [junit4] Suite: org.apache.lucene.util.TestByteBlockPool
> [smoker] [junit4] Completed [82/415] on J2 in 0.16s, 1 test
> [smoker] [junit4]
> [smoker] [junit4] Suite: org.apache.lucene.store.TestRateLimiter
> [smoker] [junit4] Completed [83/415] on J1 in 0.39s, 2 tests
> [smoker] [junit4]
> [smoker] [junit4] Suite: org.apache.lucene.util.TestNotDocIdSet
> [smoker] [junit4] Completed [84/415] on J2 in 1.19s, 6 tests
> [smoker] [junit4]
> [smoker] [junit4] Suite: org.apache.lucene.util.automaton.FiniteStringsIteratorTest
> [smoker] [junit4] Completed [85/415] on J1 in 1.28s, 7 tests
> [smoker] [junit4]
> [smoker] [junit4] Suite: org.apache.lucene.search.TestCachingWrapperFilter
> [smoker] [junit4] Completed [86/415] on J2 in 1.59s, 11 tests
> [smoker] [junit4]
> [smoker] [junit4] Suite: org.apache.lucene.search.spans.TestFilterSpans
> [smoker] [junit4] Completed [87/415] on J2 in 0.05s, 1 test
> [smoker] [junit4]
> [smoker] [junit4] Suite: org.apache.lucene.index.TestTermVectors
> [smoker] [junit4] Completed [88/415] on J1 in 2.02s, 3 tests
> [smoker] [junit4]
> [smoker] [junit4] Suite: org.apache.lucene.store.TestLockFactory
> [smoker] [junit4] Completed [89/415] on J1 in 0.09s, 2 tests
> [smoker] [junit4]
> [smoker] [junit4] Suite: org.apache.lucene.index.TestStressNRT
> [smoker] [junit4] Completed [90/415] on J0 in 15.47s, 1 test
> [smoker] [junit4]
> [smoker] [junit4] Suite: org.apache.lucene.index.TestSnapshotDeletionPolicy
> [smoker] [junit4] Completed [91/415] on J0 in 1.84s, 7 tests
> [smoker] [junit4]
> [smoker] [junit4] Could not serialize report for suite org.apache.lucene.index.TestSnapshotDeletionPolicy: java.io.IOException: No space left on device
> [smoker] [junit4] Suite: org.apache.lucene.search.spans.TestBasics
> [smoker] [junit4] Completed [92/415] on J1 in 8.39s, 25 tests
> [smoker] [junit4]
> [smoker] [junit4] Could not serialize report for suite org.apache.lucene.search.spans.TestBasics: java.io.IOException: No space left on device
> [smoker] [junit4] Suite: org.apache.lucene.index.TestAllFilesHaveCodecHeader
> [smoker] [junit4] Completed [93/415] on J1 in 0.23s, 1 test
> [smoker] [junit4]
> [smoker] [junit4] Could not serialize report for suite org.apache.lucene.index.TestAllFilesHaveCodecHeader: java.io.IOException: No space left on device
> [smoker] [junit4] Jan 07, 2016 5:54:29 PM com.carrotsearch.ant.tasks.junit4.dependencies.com.google.common.io.Closeables close
> [smoker] [junit4] WARNING: IOException thrown while closing Closeable.
> [smoker] [junit4] java.io.IOException: No space left on device
> [smoker] [junit4] at java.io.FileOutputStream.writeBytes(Native Method)
> [smoker] [junit4] at java.io.FileOutputStream.write(FileOutputStream.java:345)
> [smoker] [junit4] at sun.nio.cs.StreamEncoder.writeBytes(StreamEncoder.java:221)
> [smoker] [junit4] at sun.nio.cs.StreamEncoder.implWrite(StreamEncoder.java:282)
> [smoker] [junit4] at sun.nio.cs.StreamEncoder.write(StreamEncoder.java:125)
> [smoker] [junit4] at java.io.OutputStreamWriter.write(OutputStreamWriter.java:207)
> [smoker] [junit4] at java.io.BufferedWriter.flushBuffer(BufferedWriter.java:129)
> [smoker] [junit4] at java.io.BufferedWriter.close(BufferedWriter.java:264)
> [smoker] [junit4] at com.carrotsearch.ant.tasks.junit4.dependencies.com.google.common.io.Closeables.close(Closeables.java:79)
> [smoker] [junit4] at com.carrotsearch.ant.tasks.junit4.listeners.TextReport.onQuit(TextReport.java:409)
> [smoker] [junit4] at sun.reflect.NativeMethodAccessorImpl.invoke0(Native Method)
> [smoker] [junit4] at sun.reflect.NativeMethodAccessorImpl.invoke(NativeMethodAc
> [smoker]
> [smoker] Traceback (most recent call last):
> [smoker] File "/x1/jenkins/jenkins-slave/workspace/Lucene-Solr-SmokeRelease-5.x/dev-tools/scripts/smokeTestRelease.py", line 1454, in <module>
> [smoker] main()
> [smoker] File "/x1/jenkins/jenkins-slave/workspace/Lucene-Solr-SmokeRelease-5.x/dev-tools/scripts/smokeTestRelease.py", line 1399, in main
> [smoker] smokeTest(c.java, c.url, c.revision, c.version, c.tmp_dir, c.is_signed, ' '.join(c.test_args))
> [smoker] File "/x1/jenkins/jenkins-slave/workspace/Lucene-Solr-SmokeRelease-5.x/dev-tools/scripts/smokeTestRelease.py", line 1437, in smokeTest
> [smoker] unpackAndVerify(java, 'lucene', tmpDir, 'lucene-%s-src.tgz' % version, svnRevision, version, testArgs, baseURL)
> [smoker] File "/x1/jenkins/jenkins-slave/workspace/Lucene-Solr-SmokeRelease-5.x/dev-tools/scripts/smokeTestRelease.py", line 588, in unpackAndVerify
> [smoker] verifyUnpacked(java, project, artifact, unpackPath, svnRevision, version, testArgs, tmpDir, baseURL)
> [smoker] File "/x1/jenkins/jenkins-slave/workspace/Lucene-Solr-SmokeRelease-5.x/dev-tools/scripts/smokeTestRelease.py", line 680, in verifyUnpacked
> [smoker] java.run_java7('ant clean test %s' % testArgs, '%s/test.log' % unpackPath)
> [smoker] File "/x1/jenkins/jenkins-slave/workspace/Lucene-Solr-SmokeRelease-5.x/dev-tools/scripts/smokeTestRelease.py", line 1231, in run_java
> [smoker] run('%s; %s' % (cmd_prefix, cmd), logfile)
> [smoker] File "/x1/jenkins/jenkins-slave/workspace/Lucene-Solr-SmokeRelease-5.x/dev-tools/scripts/smokeTestRelease.py", line 513, in run
> [smoker] raise RuntimeError('command "%s" failed; see log file %s' % (command, logPath))
> [smoker] RuntimeError: command "export JAVA_HOME="/home/jenkins/jenkins-slave/tools/hudson.model.JDK/latest1.7" PATH="/home/jenkins/jenkins-slave/tools/hudson.model.JDK/latest1.7/bin:$PATH" JAVACMD="/home/jenkins/jenkins-slave/tools/hudson.model.JDK/latest1.7/bin/java"; ant clean test -Dtests.slow=false" failed; see log file /x1/jenkins/jenkins-slave/workspace/Lucene-Solr-SmokeRelease-5.x/lucene/build/smokeTestRelease/tmp/unpack/lucene-5.5.0/test.log
>
> BUILD FAILED
> /x1/jenkins/jenkins-slave/workspace/Lucene-Solr-SmokeRelease-5.x/build.xml:545: exec returned: 1
>
> Total time: 17 minutes 30 seconds
> Build step 'Invoke Ant' marked build as failure
> Email was triggered for: Failure - Any
> Sending email for trigger: Failure - Any
> Setting LATEST1_8_HOME=/home/jenkins/jenkins-slave/tools/hudson.model.JDK/latest1.8
> Setting LATEST1_8_HOME=/home/jenkins/jenkins-slave/tools/hudson.model.JDK/latest1.8
>
>
>
> ---------------------------------------------------------------------
> To unsubscribe, e-mail: dev-unsubscribe@lucene.apache.org
> For additional commands, e-mail: dev-help@lucene.apache.org
---------------------------------------------------------------------
To unsubscribe, e-mail: dev-unsubscribe@lucene.apache.org
For additional commands, e-mail: dev-help@lucene.apache.org
[JENKINS] Lucene-Solr-SmokeRelease-5.x - Build # 430 - Still
Failing
Posted by Apache Jenkins Server <je...@builds.apache.org>.
Build: https://builds.apache.org/job/Lucene-Solr-SmokeRelease-5.x/430/
No tests ran.
Build Log:
[...truncated 53145 lines...]
prepare-release-no-sign:
[mkdir] Created dir: /x1/jenkins/jenkins-slave/workspace/Lucene-Solr-SmokeRelease-5.x/lucene/build/smokeTestRelease/dist
[copy] Copying 461 files to /x1/jenkins/jenkins-slave/workspace/Lucene-Solr-SmokeRelease-5.x/lucene/build/smokeTestRelease/dist/lucene
[copy] Copying 245 files to /x1/jenkins/jenkins-slave/workspace/Lucene-Solr-SmokeRelease-5.x/lucene/build/smokeTestRelease/dist/solr
[smoker] Java 1.7 JAVA_HOME=/home/jenkins/jenkins-slave/tools/hudson.model.JDK/latest1.7
[smoker] Java 1.8 JAVA_HOME=/home/jenkins/jenkins-slave/tools/hudson.model.JDK/latest1.8
[smoker] NOTE: output encoding is UTF-8
[smoker]
[smoker] Load release URL "file:/x1/jenkins/jenkins-slave/workspace/Lucene-Solr-SmokeRelease-5.x/lucene/build/smokeTestRelease/dist/"...
[smoker]
[smoker] Test Lucene...
[smoker] test basics...
[smoker] get KEYS
[smoker] 0.2 MB in 0.01 sec (10.3 MB/sec)
[smoker] check changes HTML...
[smoker] download lucene-5.5.0-src.tgz...
[smoker] 28.7 MB in 0.04 sec (644.7 MB/sec)
[smoker] verify md5/sha1 digests
[smoker] download lucene-5.5.0.tgz...
[smoker] 63.4 MB in 0.10 sec (648.5 MB/sec)
[smoker] verify md5/sha1 digests
[smoker] download lucene-5.5.0.zip...
[smoker] 73.8 MB in 0.12 sec (624.1 MB/sec)
[smoker] verify md5/sha1 digests
[smoker] unpack lucene-5.5.0.tgz...
[smoker] verify JAR metadata/identity/no javax.* or java.* classes...
[smoker] test demo with 1.7...
[smoker] got 6174 hits for query "lucene"
[smoker] checkindex with 1.7...
[smoker] test demo with 1.8...
[smoker] got 6174 hits for query "lucene"
[smoker] checkindex with 1.8...
[smoker] check Lucene's javadoc JAR
[smoker] unpack lucene-5.5.0.zip...
[smoker] verify JAR metadata/identity/no javax.* or java.* classes...
[smoker] test demo with 1.7...
[smoker] got 6174 hits for query "lucene"
[smoker] checkindex with 1.7...
[smoker] test demo with 1.8...
[smoker] got 6174 hits for query "lucene"
[smoker] checkindex with 1.8...
[smoker] check Lucene's javadoc JAR
[smoker] unpack lucene-5.5.0-src.tgz...
[smoker] make sure no JARs/WARs in src dist...
[smoker] run "ant validate"
[smoker] run tests w/ Java 7 and testArgs='-Dtests.slow=false'...
[smoker]
[smoker] command "export JAVA_HOME="/home/jenkins/jenkins-slave/tools/hudson.model.JDK/latest1.7" PATH="/home/jenkins/jenkins-slave/tools/hudson.model.JDK/latest1.7/bin:$PATH" JAVACMD="/home/jenkins/jenkins-slave/tools/hudson.model.JDK/latest1.7/bin/java"; ant clean test -Dtests.slow=false" failed:
[smoker] Buildfile: /x1/jenkins/jenkins-slave/workspace/Lucene-Solr-SmokeRelease-5.x/lucene/build/smokeTestRelease/tmp/unpack/lucene-5.5.0/build.xml
[smoker]
[smoker] clean:
[smoker] [delete] Deleting directory /x1/jenkins/jenkins-slave/workspace/Lucene-Solr-SmokeRelease-5.x/lucene/build/smokeTestRelease/tmp/unpack/lucene-5.5.0/build
[smoker]
[smoker] ivy-availability-check:
[smoker]
[smoker] ivy-fail:
[smoker]
[smoker] ivy-configure:
[smoker] [ivy:configure] :: Apache Ivy 2.3.0 - 20130110142753 :: http://ant.apache.org/ivy/ ::
[smoker] [ivy:configure] :: loading settings :: file = /x1/jenkins/jenkins-slave/workspace/Lucene-Solr-SmokeRelease-5.x/lucene/build/smokeTestRelease/tmp/unpack/lucene-5.5.0/ivy-settings.xml
[smoker]
[smoker] -clover.load:
[smoker]
[smoker] resolve-groovy:
[smoker] [ivy:cachepath] :: resolving dependencies :: org.codehaus.groovy#groovy-all-caller;working
[smoker] [ivy:cachepath] confs: [default]
[smoker] [ivy:cachepath] found org.codehaus.groovy#groovy-all;2.4.4 in public
[smoker] [ivy:cachepath] :: resolution report :: resolve 291ms :: artifacts dl 3ms
[smoker] ---------------------------------------------------------------------
[smoker] | | modules || artifacts |
[smoker] | conf | number| search|dwnlded|evicted|| number|dwnlded|
[smoker] ---------------------------------------------------------------------
[smoker] | default | 1 | 0 | 0 | 0 || 1 | 0 |
[smoker] ---------------------------------------------------------------------
[smoker]
[smoker] -init-totals:
[smoker]
[smoker] test-core:
[smoker]
[smoker] -clover.disable:
[smoker]
[smoker] ivy-availability-check:
[smoker]
[smoker] ivy-fail:
[smoker]
[smoker] ivy-configure:
[smoker] [ivy:configure] :: loading settings :: file = /x1/jenkins/jenkins-slave/workspace/Lucene-Solr-SmokeRelease-5.x/lucene/build/smokeTestRelease/tmp/unpack/lucene-5.5.0/ivy-settings.xml
[smoker]
[smoker] -clover.load:
[smoker]
[smoker] -clover.classpath:
[smoker]
[smoker] -clover.setup:
[smoker]
[smoker] clover:
[smoker]
[smoker] resolve:
[smoker]
[smoker] init:
[smoker]
[smoker] compile-core:
[smoker] [mkdir] Created dir: /x1/jenkins/jenkins-slave/workspace/Lucene-Solr-SmokeRelease-5.x/lucene/build/smokeTestRelease/tmp/unpack/lucene-5.5.0/build/core/classes/java
[smoker] [javac] Compiling 733 source files to /x1/jenkins/jenkins-slave/workspace/Lucene-Solr-SmokeRelease-5.x/lucene/build/smokeTestRelease/tmp/unpack/lucene-5.5.0/build/core/classes/java
[smoker] [javac] Note: Some input files use or override a deprecated API.
[smoker] [javac] Note: Recompile with -Xlint:deprecation for details.
[smoker] [javac] Creating empty /x1/jenkins/jenkins-slave/workspace/Lucene-Solr-SmokeRelease-5.x/lucene/build/smokeTestRelease/tmp/unpack/lucene-5.5.0/build/core/classes/java/org/apache/lucene/codecs/blocktree/package-info.class
[smoker] [javac] Creating empty /x1/jenkins/jenkins-slave/workspace/Lucene-Solr-SmokeRelease-5.x/lucene/build/smokeTestRelease/tmp/unpack/lucene-5.5.0/build/core/classes/java/org/apache/lucene/codecs/lucene54/package-info.class
[smoker] [javac] Creating empty /x1/jenkins/jenkins-slave/workspace/Lucene-Solr-SmokeRelease-5.x/lucene/build/smokeTestRelease/tmp/unpack/lucene-5.5.0/build/core/classes/java/org/apache/lucene/util/packed/package-info.class
[smoker] [javac] Creating empty /x1/jenkins/jenkins-slave/workspace/Lucene-Solr-SmokeRelease-5.x/lucene/build/smokeTestRelease/tmp/unpack/lucene-5.5.0/build/core/classes/java/org/apache/lucene/analysis/package-info.class
[smoker] [javac] Creating empty /x1/jenkins/jenkins-slave/workspace/Lucene-Solr-SmokeRelease-5.x/lucene/build/smokeTestRelease/tmp/unpack/lucene-5.5.0/build/core/classes/java/org/apache/lucene/document/package-info.class
[smoker] [javac] Creating empty /x1/jenkins/jenkins-slave/workspace/Lucene-Solr-SmokeRelease-5.x/lucene/build/smokeTestRelease/tmp/unpack/lucene-5.5.0/build/core/classes/java/org/apache/lucene/util/package-info.class
[smoker] [javac] Creating empty /x1/jenkins/jenkins-slave/workspace/Lucene-Solr-SmokeRelease-5.x/lucene/build/smokeTestRelease/tmp/unpack/lucene-5.5.0/build/core/classes/java/org/apache/lucene/analysis/tokenattributes/package-info.class
[smoker] [javac] Creating empty /x1/jenkins/jenkins-slave/workspace/Lucene-Solr-SmokeRelease-5.x/lucene/build/smokeTestRelease/tmp/unpack/lucene-5.5.0/build/core/classes/java/org/apache/lucene/codecs/lucene50/package-info.class
[smoker] [javac] Creating empty /x1/jenkins/jenkins-slave/workspace/Lucene-Solr-SmokeRelease-5.x/lucene/build/smokeTestRelease/tmp/unpack/lucene-5.5.0/build/core/classes/java/org/apache/lucene/index/package-info.class
[smoker] [javac] Creating empty /x1/jenkins/jenkins-slave/workspace/Lucene-Solr-SmokeRelease-5.x/lucene/build/smokeTestRelease/tmp/unpack/lucene-5.5.0/build/core/classes/java/org/apache/lucene/codecs/compressing/package-info.class
[smoker] [javac] Creating empty /x1/jenkins/jenkins-slave/workspace/Lucene-Solr-SmokeRelease-5.x/lucene/build/smokeTestRelease/tmp/unpack/lucene-5.5.0/build/core/classes/java/org/apache/lucene/codecs/lucene53/package-info.class
[smoker] [javac] Creating empty /x1/jenkins/jenkins-slave/workspace/Lucene-Solr-SmokeRelease-5.x/lucene/build/smokeTestRelease/tmp/unpack/lucene-5.5.0/build/core/classes/java/org/apache/lucene/util/automaton/package-info.class
[smoker] [javac] Creating empty /x1/jenkins/jenkins-slave/workspace/Lucene-Solr-SmokeRelease-5.x/lucene/build/smokeTestRelease/tmp/unpack/lucene-5.5.0/build/core/classes/java/org/apache/lucene/util/fst/package-info.class
[smoker] [javac] Creating empty /x1/jenkins/jenkins-slave/workspace/Lucene-Solr-SmokeRelease-5.x/lucene/build/smokeTestRelease/tmp/unpack/lucene-5.5.0/build/core/classes/java/org/apache/lucene/util/mutable/package-info.class
[smoker] [javac] Creating empty /x1/jenkins/jenkins-slave/workspace/Lucene-Solr-SmokeRelease-5.x/lucene/build/smokeTestRelease/tmp/unpack/lucene-5.5.0/build/core/classes/java/org/apache/lucene/search/similarities/package-info.class
[smoker] [javac] Creating empty /x1/jenkins/jenkins-slave/workspace/Lucene-Solr-SmokeRelease-5.x/lucene/build/smokeTestRelease/tmp/unpack/lucene-5.5.0/build/core/classes/java/org/apache/lucene/codecs/perfield/package-info.class
[smoker] [javac] Creating empty /x1/jenkins/jenkins-slave/workspace/Lucene-Solr-SmokeRelease-5.x/lucene/build/smokeTestRelease/tmp/unpack/lucene-5.5.0/build/core/classes/java/org/apache/lucene/store/package-info.class
[smoker] [javac] Creating empty /x1/jenkins/jenkins-slave/workspace/Lucene-Solr-SmokeRelease-5.x/lucene/build/smokeTestRelease/tmp/unpack/lucene-5.5.0/build/core/classes/java/org/apache/lucene/package-info.class
[smoker] [javac] Creating empty /x1/jenkins/jenkins-slave/workspace/Lucene-Solr-SmokeRelease-5.x/lucene/build/smokeTestRelease/tmp/unpack/lucene-5.5.0/build/core/classes/java/org/apache/lucene/search/package-info.class
[smoker] [javac] Creating empty /x1/jenkins/jenkins-slave/workspace/Lucene-Solr-SmokeRelease-5.x/lucene/build/smokeTestRelease/tmp/unpack/lucene-5.5.0/build/core/classes/java/org/apache/lucene/codecs/package-info.class
[smoker] [javac] Creating empty /x1/jenkins/jenkins-slave/workspace/Lucene-Solr-SmokeRelease-5.x/lucene/build/smokeTestRelease/tmp/unpack/lucene-5.5.0/build/core/classes/java/org/apache/lucene/search/spans/package-info.class
[smoker] [copy] Copying 3 files to /x1/jenkins/jenkins-slave/workspace/Lucene-Solr-SmokeRelease-5.x/lucene/build/smokeTestRelease/tmp/unpack/lucene-5.5.0/build/core/classes/java
[smoker]
[smoker] compile-test-framework:
[smoker]
[smoker] ivy-availability-check:
[smoker]
[smoker] ivy-fail:
[smoker]
[smoker] ivy-configure:
[smoker] [ivy:configure] :: loading settings :: file = /x1/jenkins/jenkins-slave/workspace/Lucene-Solr-SmokeRelease-5.x/lucene/build/smokeTestRelease/tmp/unpack/lucene-5.5.0/ivy-settings.xml
[smoker]
[smoker] resolve:
[smoker]
[smoker] init:
[smoker]
[smoker] compile-lucene-core:
[smoker]
[smoker] ivy-availability-check:
[smoker]
[smoker] ivy-fail:
[smoker]
[smoker] ivy-configure:
[smoker] [ivy:configure] :: loading settings :: file = /x1/jenkins/jenkins-slave/workspace/Lucene-Solr-SmokeRelease-5.x/lucene/build/smokeTestRelease/tmp/unpack/lucene-5.5.0/ivy-settings.xml
[smoker]
[smoker] resolve:
[smoker]
[smoker] init:
[smoker]
[smoker] -clover.disable:
[smoker]
[smoker] -clover.load:
[smoker]
[smoker] -clover.classpath:
[smoker]
[smoker] -clover.setup:
[smoker]
[smoker] clover:
[smoker]
[smoker] compile-core:
[smoker]
[smoker] compile-codecs:
[smoker]
[smoker] ivy-availability-check:
[smoker]
[smoker] ivy-fail:
[smoker]
[smoker] ivy-configure:
[smoker] [ivy:configure] :: loading settings :: file = /x1/jenkins/jenkins-slave/workspace/Lucene-Solr-SmokeRelease-5.x/lucene/build/smokeTestRelease/tmp/unpack/lucene-5.5.0/ivy-settings.xml
[smoker]
[smoker] resolve:
[smoker]
[smoker] common.init:
[smoker]
[smoker] compile-lucene-core:
[smoker]
[smoker] init:
[smoker]
[smoker] -clover.disable:
[smoker]
[smoker] -clover.load:
[smoker]
[smoker] -clover.classpath:
[smoker]
[smoker] -clover.setup:
[smoker]
[smoker] clover:
[smoker]
[smoker] compile-core:
[smoker] [mkdir] Created dir: /x1/jenkins/jenkins-slave/workspace/Lucene-Solr-SmokeRelease-5.x/lucene/build/smokeTestRelease/tmp/unpack/lucene-5.5.0/build/codecs/classes/java
[smoker] [javac] Compiling 64 source files to /x1/jenkins/jenkins-slave/workspace/Lucene-Solr-SmokeRelease-5.x/lucene/build/smokeTestRelease/tmp/unpack/lucene-5.5.0/build/codecs/classes/java
[smoker] [javac] Note: Some input files use or override a deprecated API.
[smoker] [javac] Note: Recompile with -Xlint:deprecation for details.
[smoker] [javac] Creating empty /x1/jenkins/jenkins-slave/workspace/Lucene-Solr-SmokeRelease-5.x/lucene/build/smokeTestRelease/tmp/unpack/lucene-5.5.0/build/codecs/classes/java/org/apache/lucene/codecs/blocktreeords/package-info.class
[smoker] [javac] Creating empty /x1/jenkins/jenkins-slave/workspace/Lucene-Solr-SmokeRelease-5.x/lucene/build/smokeTestRelease/tmp/unpack/lucene-5.5.0/build/codecs/classes/java/org/apache/lucene/codecs/memory/package-info.class
[smoker] [javac] Creating empty /x1/jenkins/jenkins-slave/workspace/Lucene-Solr-SmokeRelease-5.x/lucene/build/smokeTestRelease/tmp/unpack/lucene-5.5.0/build/codecs/classes/java/org/apache/lucene/codecs/simpletext/package-info.class
[smoker] [javac] Creating empty /x1/jenkins/jenkins-slave/workspace/Lucene-Solr-SmokeRelease-5.x/lucene/build/smokeTestRelease/tmp/unpack/lucene-5.5.0/build/codecs/classes/java/org/apache/lucene/codecs/blockterms/package-info.class
[smoker] [javac] Creating empty /x1/jenkins/jenkins-slave/workspace/Lucene-Solr-SmokeRelease-5.x/lucene/build/smokeTestRelease/tmp/unpack/lucene-5.5.0/build/codecs/classes/java/org/apache/lucene/codecs/bloom/package-info.class
[smoker] [javac] Creating empty /x1/jenkins/jenkins-slave/workspace/Lucene-Solr-SmokeRelease-5.x/lucene/build/smokeTestRelease/tmp/unpack/lucene-5.5.0/build/codecs/classes/java/org/apache/lucene/codecs/autoprefix/package-info.class
[smoker] [copy] Copying 3 files to /x1/jenkins/jenkins-slave/workspace/Lucene-Solr-SmokeRelease-5.x/lucene/build/smokeTestRelease/tmp/unpack/lucene-5.5.0/build/codecs/classes/java
[smoker]
[smoker] -clover.disable:
[smoker]
[smoker] -clover.load:
[smoker]
[smoker] -clover.classpath:
[smoker]
[smoker] -clover.setup:
[smoker]
[smoker] clover:
[smoker]
[smoker] common.compile-core:
[smoker] [mkdir] Created dir: /x1/jenkins/jenkins-slave/workspace/Lucene-Solr-SmokeRelease-5.x/lucene/build/smokeTestRelease/tmp/unpack/lucene-5.5.0/build/test-framework/classes/java
[smoker] [javac] Compiling 174 source files to /x1/jenkins/jenkins-slave/workspace/Lucene-Solr-SmokeRelease-5.x/lucene/build/smokeTestRelease/tmp/unpack/lucene-5.5.0/build/test-framework/classes/java
[smoker] [javac] Note: Some input files use or override a deprecated API.
[smoker] [javac] Note: Recompile with -Xlint:deprecation for details.
[smoker] [javac] Creating empty /x1/jenkins/jenkins-slave/workspace/Lucene-Solr-SmokeRelease-5.x/lucene/build/smokeTestRelease/tmp/unpack/lucene-5.5.0/build/test-framework/classes/java/org/apache/lucene/mockfile/package-info.class
[smoker] [javac] Creating empty /x1/jenkins/jenkins-slave/workspace/Lucene-Solr-SmokeRelease-5.x/lucene/build/smokeTestRelease/tmp/unpack/lucene-5.5.0/build/test-framework/classes/java/org/apache/lucene/codecs/cranky/package-info.class
[smoker] [javac] Creating empty /x1/jenkins/jenkins-slave/workspace/Lucene-Solr-SmokeRelease-5.x/lucene/build/smokeTestRelease/tmp/unpack/lucene-5.5.0/build/test-framework/classes/java/org/apache/lucene/codecs/compressing/dummy/package-info.class
[smoker] [javac] Creating empty /x1/jenkins/jenkins-slave/workspace/Lucene-Solr-SmokeRelease-5.x/lucene/build/smokeTestRelease/tmp/unpack/lucene-5.5.0/build/test-framework/classes/java/org/apache/lucene/codecs/asserting/package-info.class
[smoker] [javac] Creating empty /x1/jenkins/jenkins-slave/workspace/Lucene-Solr-SmokeRelease-5.x/lucene/build/smokeTestRelease/tmp/unpack/lucene-5.5.0/build/test-framework/classes/java/org/apache/lucene/codecs/ramonly/package-info.class
[smoker] [javac] Creating empty /x1/jenkins/jenkins-slave/workspace/Lucene-Solr-SmokeRelease-5.x/lucene/build/smokeTestRelease/tmp/unpack/lucene-5.5.0/build/test-framework/classes/java/org/apache/lucene/codecs/cheapbastard/package-info.class
[smoker] [javac] Creating empty /x1/jenkins/jenkins-slave/workspace/Lucene-Solr-SmokeRelease-5.x/lucene/build/smokeTestRelease/tmp/unpack/lucene-5.5.0/build/test-framework/classes/java/org/apache/lucene/codecs/mockrandom/package-info.class
[smoker] [copy] Copying 4 files to /x1/jenkins/jenkins-slave/workspace/Lucene-Solr-SmokeRelease-5.x/lucene/build/smokeTestRelease/tmp/unpack/lucene-5.5.0/build/test-framework/classes/java
[smoker]
[smoker] compile-core:
[smoker]
[smoker] compile-test:
[smoker] [mkdir] Created dir: /x1/jenkins/jenkins-slave/workspace/Lucene-Solr-SmokeRelease-5.x/lucene/build/smokeTestRelease/tmp/unpack/lucene-5.5.0/build/core/classes/test
[smoker] [javac] Compiling 423 source files to /x1/jenkins/jenkins-slave/workspace/Lucene-Solr-SmokeRelease-5.x/lucene/build/smokeTestRelease/tmp/unpack/lucene-5.5.0/build/core/classes/test
[smoker] [javac] Note: Some input files use or override a deprecated API.
[smoker] [javac] Note: Recompile with -Xlint:deprecation for details.
[smoker] [copy] Copying 3 files to /x1/jenkins/jenkins-slave/workspace/Lucene-Solr-SmokeRelease-5.x/lucene/build/smokeTestRelease/tmp/unpack/lucene-5.5.0/build/core/classes/test
[smoker]
[smoker] install-junit4-taskdef:
[smoker]
[smoker] validate:
[smoker]
[smoker] resolve-groovy:
[smoker]
[smoker] -init-totals:
[smoker]
[smoker] -test:
[smoker] [mkdir] Created dir: /x1/jenkins/jenkins-slave/workspace/Lucene-Solr-SmokeRelease-5.x/lucene/build/smokeTestRelease/tmp/unpack/lucene-5.5.0/build/core/test
[smoker] [loadresource] Do not set property tests.explicitclass as its length is 0.
[smoker] [mkdir] Created dir: /x1/jenkins/jenkins-slave/workspace/Lucene-Solr-SmokeRelease-5.x/lucene/build/smokeTestRelease/tmp/unpack/lucene-5.5.0/build/core/test/temp
[smoker] [mkdir] Created dir: /x1/jenkins/jenkins-slave/workspace/Lucene-Solr-SmokeRelease-5.x/lucene/build/smokeTestRelease/tmp/unpack/.caches/test-stats/core
[smoker] [junit4] <JUnit4> says Привет! Master seed: 7D958AF1623A040A
[smoker] [junit4] Executing 415 suites with 3 JVMs.
[smoker] [junit4]
[smoker] [junit4] Started J2 PID(5848@localhost).
[smoker] [junit4] Started J1 PID(5851@localhost).
[smoker] [junit4] Started J0 PID(5849@localhost).
[smoker] [junit4] Suite: org.apache.lucene.search.TestMultiset
[smoker] [junit4] Completed [2/415] on J0 in 1.28s, 2 tests
[smoker] [junit4]
[smoker] [junit4] Suite: org.apache.lucene.search.TestTopDocsCollector
[smoker] [junit4] Completed [3/415] on J2 in 2.09s, 8 tests
[smoker] [junit4]
[smoker] [junit4] Suite: org.apache.lucene.store.TestWindowsMMap
[smoker] [junit4] Completed [4/415] on J2 in 1.08s, 1 test
[smoker] [junit4]
[smoker] [junit4] Suite: org.apache.lucene.store.TestBufferedChecksum
[smoker] [junit4] Completed [5/415] on J2 in 0.23s, 2 tests
[smoker] [junit4]
[smoker] [junit4] Suite: org.apache.lucene.index.TestOmitTf
[smoker] [junit4] Completed [6/415] on J2 in 2.06s, 6 tests
[smoker] [junit4]
[smoker] [junit4] Suite: org.apache.lucene.search.TestPositionIncrement
[smoker] [junit4] Completed [7/415] on J2 in 0.28s, 2 tests
[smoker] [junit4]
[smoker] [junit4] Suite: org.apache.lucene.search.TestQueryWrapperFilter
[smoker] [junit4] Completed [8/415] on J2 in 3.51s, 6 tests
[smoker] [junit4]
[smoker] [junit4] Suite: org.apache.lucene.search.TestFieldValueQuery
[smoker] [junit4] Completed [9/415] on J1 in 9.41s, 6 tests
[smoker] [junit4]
[smoker] [junit4] Suite: org.apache.lucene.util.TestPagedBytes
[smoker] [junit4] Completed [10/415] on J2 in 3.28s, 4 tests, 1 skipped
[smoker] [junit4]
[smoker] [junit4] Suite: org.apache.lucene.search.TestSloppyPhraseQuery
[smoker] [junit4] Completed [11/415] on J2 in 4.54s, 9 tests
[smoker] [junit4]
[smoker] [junit4] Suite: org.apache.lucene.search.TestQueryCachingPolicy
[smoker] [junit4] Completed [12/415] on J2 in 0.12s, 1 test
[smoker] [junit4]
[smoker] [junit4] Suite: org.apache.lucene.codecs.lucene50.TestBlockPostingsFormat
[smoker] [junit4] IGNOR/A 0.02s J1 | TestBlockPostingsFormat.testRamBytesUsed
[smoker] [junit4] > Assumption #1: 'slow' test group is disabled (@Slow())
[smoker] [junit4] Completed [13/415] on J1 in 13.71s, 32 tests, 1 skipped
[smoker] [junit4]
[smoker] [junit4] Suite: org.apache.lucene.index.TestFlex
[smoker] [junit4] Completed [14/415] on J1 in 0.30s, 2 tests
[smoker] [junit4]
[smoker] [junit4] Suite: org.apache.lucene.index.TestConcurrentMergeScheduler
[smoker] [junit4] Completed [15/415] on J2 in 10.43s, 16 tests
[smoker] [junit4]
[smoker] [junit4] Suite: org.apache.lucene.index.TestIndexWriterReader
[smoker] [junit4] IGNOR/A 0.01s J2 | TestIndexWriterReader.testDuringAddIndexes
[smoker] [junit4] > Assumption #1: 'nightly' test group is disabled (@Nightly())
[smoker] [junit4] IGNOR/A 0.00s J2 | TestIndexWriterReader.testAddIndexesAndDoDeletesThreads
[smoker] [junit4] > Assumption #1: 'slow' test group is disabled (@Slow())
[smoker] [junit4] Completed [16/415] on J2 in 10.16s, 23 tests, 2 skipped
[smoker] [junit4]
[smoker] [junit4] Suite: org.apache.lucene.index.TestIndexWriterExceptions
[smoker] [junit4] IGNOR/A 0.00s J1 | TestIndexWriterExceptions.testTooManyTokens
[smoker] [junit4] > Assumption #1: 'nightly' test group is disabled (@Nightly())
[smoker] [junit4] Completed [17/415] on J1 in 19.20s, 36 tests, 1 skipped
[smoker] [junit4]
[smoker] [junit4] Suite: org.apache.lucene.TestMergeSchedulerExternal
[smoker] [junit4] Completed [18/415] on J1 in 0.62s, 2 tests
[smoker] [junit4]
[smoker] [junit4] Suite: org.apache.lucene.util.TestCloseableThreadLocal
[smoker] [junit4] Completed [19/415] on J1 in 0.04s, 3 tests
[smoker] [junit4]
[smoker] [junit4] Suite: org.apache.lucene.index.TestIndexWriterMerging
[smoker] [junit4] IGNOR/A 0.00s J2 | TestIndexWriterMerging.testNoWaitClose
[smoker] [junit4] > Assumption #1: 'slow' test group is disabled (@Slow())
[smoker] [junit4] Completed [20/415] on J2 in 7.72s, 6 tests, 1 skipped
[smoker] [junit4]
[smoker] [junit4] Suite: org.apache.lucene.index.TestStressIndexing
[smoker] [junit4] Completed [21/415] on J1 in 2.42s, 1 test
[smoker] [junit4]
[smoker] [junit4] Suite: org.apache.lucene.index.TestSegmentTermDocs
[smoker] [junit4] Completed [22/415] on J1 in 1.03s, 4 tests
[smoker] [junit4]
[smoker] [junit4] Suite: org.apache.lucene.index.TestTerms
[smoker] [junit4] Completed [23/415] on J2 in 1.65s, 8 tests
[smoker] [junit4]
[smoker] [junit4] Suite: org.apache.lucene.util.TestBitDocIdSetBuilder
[smoker] [junit4] Completed [24/415] on J1 in 0.50s, 6 tests
[smoker] [junit4]
[smoker] [junit4] Suite: org.apache.lucene.search.spans.TestFieldMaskingSpanQuery
[smoker] [junit4] Completed [25/415] on J1 in 2.35s, 11 tests
[smoker] [junit4]
[smoker] [junit4] Suite: org.apache.lucene.search.TestBooleanOr
[smoker] [junit4] Completed [26/415] on J2 in 6.68s, 7 tests
[smoker] [junit4]
[smoker] [junit4] Suite: org.apache.lucene.store.TestNRTCachingDirectory
[smoker] [junit4] IGNOR/A 0.01s J1 | TestNRTCachingDirectory.testFsyncDoesntCreateNewFiles
[smoker] [junit4] > Assumption #1: test only works for FSDirectory subclasses
[smoker] [junit4] Completed [27/415] on J1 in 4.40s, 41 tests, 1 skipped
[smoker] [junit4]
[smoker] [junit4] Suite: org.apache.lucene.util.TestVersion
[smoker] [junit4] Completed [28/415] on J1 in 0.16s, 11 tests
[smoker] [junit4]
[smoker] [junit4] Suite: org.apache.lucene.util.TestRoaringDocIdSet
[smoker] [junit4] Completed [29/415] on J2 in 0.60s, 5 tests
[smoker] [junit4]
[smoker] [junit4] Suite: org.apache.lucene.search.TestTopDocsMerge
[smoker] [junit4] Completed [30/415] on J2 in 2.48s, 2 tests
[smoker] [junit4]
[smoker] [junit4] Suite: org.apache.lucene.index.TestIndexWriterConfig
[smoker] [junit4] Completed [31/415] on J2 in 0.18s, 8 tests
[smoker] [junit4]
[smoker] [junit4] Suite: org.apache.lucene.index.TestCodecHoldsOpenFiles
[smoker] [junit4] Completed [32/415] on J2 in 0.09s, 1 test
[smoker] [junit4]
[smoker] [junit4] Suite: org.apache.lucene.index.TestAddIndexes
[smoker] [junit4] Completed [33/415] on J1 in 4.76s, 23 tests
[smoker] [junit4]
[smoker] [junit4] Suite: org.apache.lucene.analysis.TestNumericTokenStream
[smoker] [junit4] Completed [34/415] on J1 in 0.09s, 5 tests
[smoker] [junit4]
[smoker] [junit4] Suite: org.apache.lucene.index.TestByteSlices
[smoker] [junit4] Completed [35/415] on J1 in 5.09s, 1 test
[smoker] [junit4]
[smoker] [junit4] Suite: org.apache.lucene.util.automaton.TestOperations
[smoker] [junit4] Completed [36/415] on J1 in 0.65s, 5 tests
[smoker] [junit4]
[smoker] [junit4] Suite: org.apache.lucene.search.TestDisjunctionMaxQuery
[smoker] [junit4] Completed [37/415] on J1 in 2.44s, 12 tests
[smoker] [junit4]
[smoker] [junit4] Suite: org.apache.lucene.document.TestFieldType
[smoker] [junit4] Completed [38/415] on J1 in 0.14s, 2 tests
[smoker] [junit4]
[smoker] [junit4] Suite: org.apache.lucene.analysis.TestCharFilter
[smoker] [junit4] Completed [39/415] on J1 in 0.06s, 4 tests
[smoker] [junit4]
[smoker] [junit4] HEARTBEAT J0 PID(5849@localhost): 2016-01-07T17:53:44, stalled for 69.5s at: TestGrowableByteArrayDataOutput.testWriteLargeStrings
[smoker] [junit4] Suite: org.apache.lucene.codecs.perfield.TestPerFieldPostingsFormat
[smoker] [junit4] IGNOR/A 0.01s J2 | TestPerFieldPostingsFormat.testPostingsEnumReuse
[smoker] [junit4] > Assumption #1: The MockRandom PF randomizes content on the fly, so we can't check it
[smoker] [junit4] IGNOR/A 0.00s J2 | TestPerFieldPostingsFormat.testRamBytesUsed
[smoker] [junit4] > Assumption #1: 'slow' test group is disabled (@Slow())
[smoker] [junit4] IGNOR/A 0.01s J2 | TestPerFieldPostingsFormat.testMergeStability
[smoker] [junit4] > Assumption #1: The MockRandom PF randomizes content on the fly, so we can't check it
[smoker] [junit4] Completed [40/415] on J2 in 13.46s, 30 tests, 3 skipped
[smoker] [junit4]
[smoker] [junit4] Suite: org.apache.lucene.index.TestStressAdvance
[smoker] [junit4] Completed [41/415] on J1 in 4.00s, 1 test
[smoker] [junit4]
[smoker] [junit4] Suite: org.apache.lucene.search.spans.TestSpanCollection
[smoker] [junit4] Completed [42/415] on J1 in 0.12s, 3 tests
[smoker] [junit4]
[smoker] [junit4] Suite: org.apache.lucene.index.TestTransactionRollback
[smoker] [junit4] Completed [43/415] on J1 in 0.49s, 2 tests
[smoker] [junit4]
[smoker] [junit4] Suite: org.apache.lucene.search.TestTermRangeQuery
[smoker] [junit4] Completed [44/415] on J1 in 0.27s, 7 tests
[smoker] [junit4]
[smoker] [junit4] Suite: org.apache.lucene.index.TestAllFilesHaveChecksumFooter
[smoker] [junit4] Completed [45/415] on J1 in 0.18s, 1 test
[smoker] [junit4]
[smoker] [junit4] Suite: org.apache.lucene.index.TestIndexWriterLockRelease
[smoker] [junit4] Completed [46/415] on J1 in 0.09s, 1 test
[smoker] [junit4]
[smoker] [junit4] Suite: org.apache.lucene.index.TestTermdocPerf
[smoker] [junit4] Completed [47/415] on J1 in 0.23s, 1 test
[smoker] [junit4]
[smoker] [junit4] Suite: org.apache.lucene.util.TestUnicodeUtil
[smoker] [junit4] Completed [48/415] on J1 in 1.21s, 5 tests
[smoker] [junit4]
[smoker] [junit4] Suite: org.apache.lucene.search.TestTermRangeFilter
[smoker] [junit4] Completed [49/415] on J1 in 3.54s, 3 tests
[smoker] [junit4]
[smoker] [junit4] Suite: org.apache.lucene.util.TestSloppyMath
[smoker] [junit4] Completed [50/415] on J1 in 0.35s, 3 tests
[smoker] [junit4]
[smoker] [junit4] Suite: org.apache.lucene.search.TestSameScoresWithThreads
[smoker] [junit4] Completed [51/415] on J1 in 2.83s, 1 test
[smoker] [junit4]
[smoker] [junit4] Suite: org.apache.lucene.index.TestDuelingCodecs
[smoker] [junit4] IGNOR/A 0.00s J1 | TestDuelingCodecs.testCrazyReaderEquals
[smoker] [junit4] > Assumption #1: 'slow' test group is disabled (@Slow())
[smoker] [junit4] IGNOR/A 0.00s J1 | TestDuelingCodecs.testEquals
[smoker] [junit4] > Assumption #1: 'slow' test group is disabled (@Slow())
[smoker] [junit4] Completed [52/415] on J1 in 0.02s, 2 tests, 2 skipped
[smoker] [junit4]
[smoker] [junit4] Suite: org.apache.lucene.codecs.lucene50.TestLucene50StoredFieldsFormat
[smoker] [junit4] IGNOR/A 0.00s J2 | TestLucene50StoredFieldsFormat.testBigDocuments
[smoker] [junit4] > Assumption #1: 'nightly' test group is disabled (@Nightly())
[smoker] [junit4] IGNOR/A 0.00s J2 | TestLucene50StoredFieldsFormat.testRamBytesUsed
[smoker] [junit4] > Assumption #1: 'slow' test group is disabled (@Slow())
[smoker] [junit4] Completed [53/415] on J2 in 10.95s, 17 tests, 2 skipped
[smoker] [junit4]
[smoker] [junit4] Suite: org.apache.lucene.util.packed.TestDirectPacked
[smoker] [junit4] Completed [54/415] on J2 in 1.36s, 4 tests
[smoker] [junit4]
[smoker] [junit4] Suite: org.apache.lucene.codecs.compressing.TestGrowableByteArrayDataOutput
[smoker] [junit4] Completed [55/415] on J0 in 83.08s, 2 tests
[smoker] [junit4]
[smoker] [junit4] Suite: org.apache.lucene.index.TestLongPostings
[smoker] [junit4] Completed [56/415] on J2 in 3.50s, 2 tests
[smoker] [junit4]
[smoker] [junit4] Suite: org.apache.lucene.util.fst.TestBytesStore
[smoker] [junit4] Completed [57/415] on J2 in 1.31s, 1 test
[smoker] [junit4]
[smoker] [junit4] Suite: org.apache.lucene.index.TestManyFields
[smoker] [junit4] Completed [58/415] on J1 in 7.08s, 3 tests
[smoker] [junit4]
[smoker] [junit4] Suite: org.apache.lucene.util.TestBytesRef
[smoker] [junit4] Completed [59/415] on J1 in 0.07s, 3 tests
[smoker] [junit4]
[smoker] [junit4] Suite: org.apache.lucene.codecs.lucene50.TestForUtil
[smoker] [junit4] Completed [60/415] on J1 in 0.15s, 1 test
[smoker] [junit4]
[smoker] [junit4] Suite: org.apache.lucene.index.Test2BSortedDocValuesFixedSorted
[smoker] [junit4] IGNOR/A 0.00s J2 | Test2BSortedDocValuesFixedSorted.testFixedSorted
[smoker] [junit4] > Assumption #1: 'monster' test group is disabled (@Monster(value=Takes ~ 6 hours if the heap is 5gb))
[smoker] [junit4] Completed [61/415] on J2 in 0.04s, 1 test, 1 skipped
[smoker] [junit4]
[smoker] [junit4] Suite: org.apache.lucene.search.TestReqExclBulkScorer
[smoker] [junit4] Completed [62/415] on J1 in 0.05s, 1 test
[smoker] [junit4]
[smoker] [junit4] Suite: org.apache.lucene.index.TestIndexCommit
[smoker] [junit4] Completed [63/415] on J1 in 0.09s, 1 test
[smoker] [junit4]
[smoker] [junit4] Suite: org.apache.lucene.search.TestComplexExplanationsOfNonMatches
[smoker] [junit4] Completed [64/415] on J2 in 0.33s, 21 tests
[smoker] [junit4]
[smoker] [junit4] Suite: org.apache.lucene.search.TestIndexSearcher
[smoker] [junit4] Completed [65/415] on J2 in 0.90s, 5 tests
[smoker] [junit4]
[smoker] [junit4] Suite: org.apache.lucene.index.TestNorms
[smoker] [junit4] IGNOR/A 0.00s J2 | TestNorms.testCustomEncoder
[smoker] [junit4] > Assumption #1: 'slow' test group is disabled (@Slow())
[smoker] [junit4] IGNOR/A 0.00s J2 | TestNorms.testMaxByteNorms
[smoker] [junit4] > Assumption #1: 'slow' test group is disabled (@Slow())
[smoker] [junit4] Completed [66/415] on J2 in 0.00s, 2 tests, 2 skipped
[smoker] [junit4]
[smoker] [junit4] Suite: org.apache.lucene.search.TestSearchAfter
[smoker] [junit4] Completed [67/415] on J1 in 2.49s, 1 test
[smoker] [junit4]
[smoker] [junit4] Suite: org.apache.lucene.search.TestFilteredSearch
[smoker] [junit4] Completed [68/415] on J1 in 0.08s, 1 test
[smoker] [junit4]
[smoker] [junit4] Suite: org.apache.lucene.index.TestIndexWriterCommit
[smoker] [junit4] Completed [69/415] on J0 in 7.02s, 13 tests
[smoker] [junit4]
[smoker] [junit4] Suite: org.apache.lucene.index.TestForceMergeForever
[smoker] [junit4] Completed [70/415] on J1 in 0.47s, 1 test
[smoker] [junit4]
[smoker] [junit4] Suite: org.apache.lucene.index.TestIndexWriterWithThreads
[smoker] [junit4] IGNOR/A 0.02s J0 | TestIndexWriterWithThreads.testIOExceptionDuringWriteSegment
[smoker] [junit4] > Assumption #1: 'slow' test group is disabled (@Slow())
[smoker] [junit4] IGNOR/A 0.00s J0 | TestIndexWriterWithThreads.testIOExceptionDuringAbortWithThreadsOnlyOnce
[smoker] [junit4] > Assumption #1: 'slow' test group is disabled (@Slow())
[smoker] [junit4] IGNOR/A 0.00s J0 | TestIndexWriterWithThreads.testImmediateDiskFullWithThreads
[smoker] [junit4] > Assumption #1: 'slow' test group is disabled (@Slow())
[smoker] [junit4] IGNOR/A 0.02s J0 | TestIndexWriterWithThreads.testIOExceptionDuringWriteSegmentWithThreads
[smoker] [junit4] > Assumption #1: 'slow' test group is disabled (@Slow())
[smoker] [junit4] IGNOR/A 0.00s J0 | TestIndexWriterWithThreads.testIOExceptionDuringWriteSegmentWithThreadsOnlyOnce
[smoker] [junit4] > Assumption #1: 'slow' test group is disabled (@Slow())
[smoker] [junit4] IGNOR/A 0.00s J0 | TestIndexWriterWithThreads.testCloseWithThreads
[smoker] [junit4] > Assumption #1: 'slow' test group is disabled (@Slow())
[smoker] [junit4] IGNOR/A 0.00s J0 | TestIndexWriterWithThreads.testIOExceptionDuringWriteSegmentOnlyOnce
[smoker] [junit4] > Assumption #1: 'slow' test group is disabled (@Slow())
[smoker] [junit4] IGNOR/A 0.00s J0 | TestIndexWriterWithThreads.testIOExceptionDuringAbortWithThreads
[smoker] [junit4] > Assumption #1: 'slow' test group is disabled (@Slow())
[smoker] [junit4] IGNOR/A 0.00s J0 | TestIndexWriterWithThreads.testRollbackAndCommitWithThreads
[smoker] [junit4] > Assumption #1: 'slow' test group is disabled (@Slow())
[smoker] [junit4] IGNOR/A 0.00s J0 | TestIndexWriterWithThreads.testIOExceptionDuringAbortOnlyOnce
[smoker] [junit4] > Assumption #1: 'slow' test group is disabled (@Slow())
[smoker] [junit4] IGNOR/A 0.00s J0 | TestIndexWriterWithThreads.testOpenTwoIndexWritersOnDifferentThreads
[smoker] [junit4] > Assumption #1: 'slow' test group is disabled (@Slow())
[smoker] [junit4] IGNOR/A 0.00s J0 | TestIndexWriterWithThreads.testIOExceptionDuringAbort
[smoker] [junit4] > Assumption #1: 'slow' test group is disabled (@Slow())
[smoker] [junit4] Completed [71/415] on J0 in 0.10s, 12 tests, 12 skipped
[smoker] [junit4]
[smoker] [junit4] Suite: org.apache.lucene.search.TestMultiTermQueryRewrites
[smoker] [junit4] Completed [72/415] on J1 in 0.33s, 3 tests
[smoker] [junit4]
[smoker] [junit4] Suite: org.apache.lucene.index.TestNewestSegment
[smoker] [junit4] Completed [73/415] on J1 in 0.07s, 1 test
[smoker] [junit4]
[smoker] [junit4] Suite: org.apache.lucene.document.TestDateTools
[smoker] [junit4] Completed [74/415] on J1 in 0.12s, 5 tests
[smoker] [junit4]
[smoker] [junit4] Suite: org.apache.lucene.TestDemo
[smoker] [junit4] Completed [75/415] on J0 in 0.48s, 1 test
[smoker] [junit4]
[smoker] [junit4] Suite: org.apache.lucene.util.Test2BPagedBytes
[smoker] [junit4] IGNOR/A 0.00s J0 | Test2BPagedBytes.test
[smoker] [junit4] > Assumption #1: 'monster' test group is disabled (@Monster(value=You must increase heap to > 2 G to run this))
[smoker] [junit4] Completed [76/415] on J0 in 0.03s, 1 test, 1 skipped
[smoker] [junit4]
[smoker] [junit4] Suite: org.apache.lucene.index.TestFieldReuse
[smoker] [junit4] Completed [77/415] on J1 in 0.08s, 3 tests
[smoker] [junit4]
[smoker] [junit4] Suite: org.apache.lucene.search.TestMultiCollector
[smoker] [junit4] Completed [78/415] on J1 in 0.34s, 1 test
[smoker] [junit4]
[smoker] [junit4] Suite: org.apache.lucene.index.TestIndexWriterUnicode
[smoker] [junit4] Completed [79/415] on J2 in 7.85s, 5 tests
[smoker] [junit4]
[smoker] [junit4] Suite: org.apache.lucene.index.TestIndexInput
[smoker] [junit4] Completed [80/415] on J1 in 5.69s, 2 tests
[smoker] [junit4]
[smoker] [junit4] Suite: org.apache.lucene.search.TestCachingWrapperQuery
[smoker] [junit4] Completed [81/415] on J2 in 0.97s, 7 tests
[smoker] [junit4]
[smoker] [junit4] Suite: org.apache.lucene.util.TestByteBlockPool
[smoker] [junit4] Completed [82/415] on J2 in 0.16s, 1 test
[smoker] [junit4]
[smoker] [junit4] Suite: org.apache.lucene.store.TestRateLimiter
[smoker] [junit4] Completed [83/415] on J1 in 0.39s, 2 tests
[smoker] [junit4]
[smoker] [junit4] Suite: org.apache.lucene.util.TestNotDocIdSet
[smoker] [junit4] Completed [84/415] on J2 in 1.19s, 6 tests
[smoker] [junit4]
[smoker] [junit4] Suite: org.apache.lucene.util.automaton.FiniteStringsIteratorTest
[smoker] [junit4] Completed [85/415] on J1 in 1.28s, 7 tests
[smoker] [junit4]
[smoker] [junit4] Suite: org.apache.lucene.search.TestCachingWrapperFilter
[smoker] [junit4] Completed [86/415] on J2 in 1.59s, 11 tests
[smoker] [junit4]
[smoker] [junit4] Suite: org.apache.lucene.search.spans.TestFilterSpans
[smoker] [junit4] Completed [87/415] on J2 in 0.05s, 1 test
[smoker] [junit4]
[smoker] [junit4] Suite: org.apache.lucene.index.TestTermVectors
[smoker] [junit4] Completed [88/415] on J1 in 2.02s, 3 tests
[smoker] [junit4]
[smoker] [junit4] Suite: org.apache.lucene.store.TestLockFactory
[smoker] [junit4] Completed [89/415] on J1 in 0.09s, 2 tests
[smoker] [junit4]
[smoker] [junit4] Suite: org.apache.lucene.index.TestStressNRT
[smoker] [junit4] Completed [90/415] on J0 in 15.47s, 1 test
[smoker] [junit4]
[smoker] [junit4] Suite: org.apache.lucene.index.TestSnapshotDeletionPolicy
[smoker] [junit4] Completed [91/415] on J0 in 1.84s, 7 tests
[smoker] [junit4]
[smoker] [junit4] Could not serialize report for suite org.apache.lucene.index.TestSnapshotDeletionPolicy: java.io.IOException: No space left on device
[smoker] [junit4] Suite: org.apache.lucene.search.spans.TestBasics
[smoker] [junit4] Completed [92/415] on J1 in 8.39s, 25 tests
[smoker] [junit4]
[smoker] [junit4] Could not serialize report for suite org.apache.lucene.search.spans.TestBasics: java.io.IOException: No space left on device
[smoker] [junit4] Suite: org.apache.lucene.index.TestAllFilesHaveCodecHeader
[smoker] [junit4] Completed [93/415] on J1 in 0.23s, 1 test
[smoker] [junit4]
[smoker] [junit4] Could not serialize report for suite org.apache.lucene.index.TestAllFilesHaveCodecHeader: java.io.IOException: No space left on device
[smoker] [junit4] Jan 07, 2016 5:54:29 PM com.carrotsearch.ant.tasks.junit4.dependencies.com.google.common.io.Closeables close
[smoker] [junit4] WARNING: IOException thrown while closing Closeable.
[smoker] [junit4] java.io.IOException: No space left on device
[smoker] [junit4] at java.io.FileOutputStream.writeBytes(Native Method)
[smoker] [junit4] at java.io.FileOutputStream.write(FileOutputStream.java:345)
[smoker] [junit4] at sun.nio.cs.StreamEncoder.writeBytes(StreamEncoder.java:221)
[smoker] [junit4] at sun.nio.cs.StreamEncoder.implWrite(StreamEncoder.java:282)
[smoker] [junit4] at sun.nio.cs.StreamEncoder.write(StreamEncoder.java:125)
[smoker] [junit4] at java.io.OutputStreamWriter.write(OutputStreamWriter.java:207)
[smoker] [junit4] at java.io.BufferedWriter.flushBuffer(BufferedWriter.java:129)
[smoker] [junit4] at java.io.BufferedWriter.close(BufferedWriter.java:264)
[smoker] [junit4] at com.carrotsearch.ant.tasks.junit4.dependencies.com.google.common.io.Closeables.close(Closeables.java:79)
[smoker] [junit4] at com.carrotsearch.ant.tasks.junit4.listeners.TextReport.onQuit(TextReport.java:409)
[smoker] [junit4] at sun.reflect.NativeMethodAccessorImpl.invoke0(Native Method)
[smoker] [junit4] at sun.reflect.NativeMethodAccessorImpl.invoke(NativeMethodAc
[smoker]
[smoker] Traceback (most recent call last):
[smoker] File "/x1/jenkins/jenkins-slave/workspace/Lucene-Solr-SmokeRelease-5.x/dev-tools/scripts/smokeTestRelease.py", line 1454, in <module>
[smoker] main()
[smoker] File "/x1/jenkins/jenkins-slave/workspace/Lucene-Solr-SmokeRelease-5.x/dev-tools/scripts/smokeTestRelease.py", line 1399, in main
[smoker] smokeTest(c.java, c.url, c.revision, c.version, c.tmp_dir, c.is_signed, ' '.join(c.test_args))
[smoker] File "/x1/jenkins/jenkins-slave/workspace/Lucene-Solr-SmokeRelease-5.x/dev-tools/scripts/smokeTestRelease.py", line 1437, in smokeTest
[smoker] unpackAndVerify(java, 'lucene', tmpDir, 'lucene-%s-src.tgz' % version, svnRevision, version, testArgs, baseURL)
[smoker] File "/x1/jenkins/jenkins-slave/workspace/Lucene-Solr-SmokeRelease-5.x/dev-tools/scripts/smokeTestRelease.py", line 588, in unpackAndVerify
[smoker] verifyUnpacked(java, project, artifact, unpackPath, svnRevision, version, testArgs, tmpDir, baseURL)
[smoker] File "/x1/jenkins/jenkins-slave/workspace/Lucene-Solr-SmokeRelease-5.x/dev-tools/scripts/smokeTestRelease.py", line 680, in verifyUnpacked
[smoker] java.run_java7('ant clean test %s' % testArgs, '%s/test.log' % unpackPath)
[smoker] File "/x1/jenkins/jenkins-slave/workspace/Lucene-Solr-SmokeRelease-5.x/dev-tools/scripts/smokeTestRelease.py", line 1231, in run_java
[smoker] run('%s; %s' % (cmd_prefix, cmd), logfile)
[smoker] File "/x1/jenkins/jenkins-slave/workspace/Lucene-Solr-SmokeRelease-5.x/dev-tools/scripts/smokeTestRelease.py", line 513, in run
[smoker] raise RuntimeError('command "%s" failed; see log file %s' % (command, logPath))
[smoker] RuntimeError: command "export JAVA_HOME="/home/jenkins/jenkins-slave/tools/hudson.model.JDK/latest1.7" PATH="/home/jenkins/jenkins-slave/tools/hudson.model.JDK/latest1.7/bin:$PATH" JAVACMD="/home/jenkins/jenkins-slave/tools/hudson.model.JDK/latest1.7/bin/java"; ant clean test -Dtests.slow=false" failed; see log file /x1/jenkins/jenkins-slave/workspace/Lucene-Solr-SmokeRelease-5.x/lucene/build/smokeTestRelease/tmp/unpack/lucene-5.5.0/test.log
BUILD FAILED
/x1/jenkins/jenkins-slave/workspace/Lucene-Solr-SmokeRelease-5.x/build.xml:545: exec returned: 1
Total time: 17 minutes 30 seconds
Build step 'Invoke Ant' marked build as failure
Email was triggered for: Failure - Any
Sending email for trigger: Failure - Any
Setting LATEST1_8_HOME=/home/jenkins/jenkins-slave/tools/hudson.model.JDK/latest1.8
Setting LATEST1_8_HOME=/home/jenkins/jenkins-slave/tools/hudson.model.JDK/latest1.8