You are viewing a plain text version of this content. The canonical link for it is here.
Posted to builds@cassandra.apache.org by Apache Jenkins Server <je...@builds.apache.org> on 2023/01/13 05:49:17 UTC

Build complete: Cassandra-4.0 #516 [UNSTABLE] a83de9bcd21a032c1dbc6dc323c7e53f828b2cb6

-------------------------------------------------------------------------------
Build Cassandra-4.0 #516 Still Unstable
URL: https://ci-cassandra.apache.org/job/Cassandra-4.0/516/
-------------------------------------------------------------------------------
Changes:
No changes

-------------------------------------------------------------------------------
Failed Tests:
7 tests failed.
FAILED:  dtest-large-novnode.materialized_views_test.TestMaterializedViews.test_throttled_partition_update
FAILED:  dtest-offheap.repair_tests.repair_test.TestRepair.test_local_dc_repair
FAILED:  dtest-upgrade.upgrade_tests.upgrade_through_versions_test.TestUpgrade_indev_4_0_x_To_indev_4_1_x.test_parallel_upgrade
FAILED:  org.apache.cassandra.cql3.MemtableSizeTest.testTruncationReleasesLogSpace-cdc
FAILED:  org.apache.cassandra.cql3.MemtableSizeTest.testTruncationReleasesLogSpace
FAILED:  org.apache.cassandra.net.ProxyHandlerConnectionsTest.testExpireSome
FAILED:  org.apache.cassandra.net.proxy.ProxyHandlerTest.testNormalDelivery

-------------------------------------------------------------------------------
For complete test report and logs see https://nightlies.apache.org/cassandra/Cassandra-4.0/516/