You are viewing a plain text version of this content. The canonical link for it is here.
Posted to builds@lucene.apache.org by Apache Jenkins Server <je...@builds.apache.org> on 2020/04/07 08:42:20 UTC

[JENKINS] Lucene-Solr-BadApples-Tests-8.x - Build # 411 - Unstable

Build: https://builds.apache.org/job/Lucene-Solr-BadApples-Tests-8.x/411/

1 tests failed.
FAILED:  org.apache.solr.client.solrj.impl.Http2SolrClientTest.testRedirect

Error Message:
Captured an uncaught exception in thread: Thread[id=9816, name=h2sc-3518-thread-13, state=RUNNABLE, group=TGRP-Http2SolrClientTest]

Stack Trace:
com.carrotsearch.randomizedtesting.UncaughtExceptionError: Captured an uncaught exception in thread: Thread[id=9816, name=h2sc-3518-thread-13, state=RUNNABLE, group=TGRP-Http2SolrClientTest]
	at __randomizedtesting.SeedInfo.seed([C1856BF8244BA09C:51182AC5F06F5BC3]:0)
Caused by: java.util.concurrent.RejectedExecutionException: Task java.util.concurrent.ScheduledThreadPoolExecutor$ScheduledFutureTask@67df25d9 rejected from java.util.concurrent.ScheduledThreadPoolExecutor@6918d752[Shutting down, pool size = 1, active threads = 0, queued tasks = 0, completed tasks = 0]
	at __randomizedtesting.SeedInfo.seed([C1856BF8244BA09C]:0)
	at java.util.concurrent.ThreadPoolExecutor$AbortPolicy.rejectedExecution(ThreadPoolExecutor.java:2063)
	at java.util.concurrent.ThreadPoolExecutor.reject(ThreadPoolExecutor.java:830)
	at java.util.concurrent.ScheduledThreadPoolExecutor.delayedExecute(ScheduledThreadPoolExecutor.java:326)
	at java.util.concurrent.ScheduledThreadPoolExecutor.schedule(ScheduledThreadPoolExecutor.java:533)
	at org.eclipse.jetty.util.thread.ScheduledExecutorScheduler.schedule(ScheduledExecutorScheduler.java:122)
	at org.eclipse.jetty.util.SocketAddressResolver$Async.lambda$resolve$1(SocketAddressResolver.java:157)
	at org.apache.solr.common.util.ExecutorUtil$MDCAwareThreadPoolExecutor.lambda$execute$0(ExecutorUtil.java:210)
	at java.util.concurrent.ThreadPoolExecutor.runWorker(ThreadPoolExecutor.java:1149)
	at java.util.concurrent.ThreadPoolExecutor$Worker.run(ThreadPoolExecutor.java:624)
	at java.lang.Thread.run(Thread.java:748)




Build Log:
[...truncated 17156 lines...]
   [junit4] Suite: org.apache.solr.client.solrj.impl.Http2SolrClientTest
   [junit4]   2> 268434 INFO  (SUITE-Http2SolrClientTest-seed#[C1856BF8244BA09C]-worker) [     ] o.a.s.SolrTestCase Setting 'solr.default.confdir' system property to test-framework derived value of '/home/jenkins/jenkins-slave/workspace/Lucene-Solr-BadApples-Tests-8.x/solr/server/solr/configsets/_default/conf'
   [junit4]   2> 268434 INFO  (SUITE-Http2SolrClientTest-seed#[C1856BF8244BA09C]-worker) [     ] o.a.s.SolrTestCaseJ4 Created dataDir: /home/jenkins/jenkins-slave/workspace/Lucene-Solr-BadApples-Tests-8.x/solr/build/solr-solrj/test/J0/temp/solr.client.solrj.impl.Http2SolrClientTest_C1856BF8244BA09C-001/data-dir-17-001
   [junit4]   2> 268434 WARN  (SUITE-Http2SolrClientTest-seed#[C1856BF8244BA09C]-worker) [     ] o.a.s.SolrTestCaseJ4 startTrackingSearchers: numOpens=89 numCloses=89
   [junit4]   2> 268434 INFO  (SUITE-Http2SolrClientTest-seed#[C1856BF8244BA09C]-worker) [     ] o.a.s.SolrTestCaseJ4 Using TrieFields (NUMERIC_POINTS_SYSPROP=false) w/NUMERIC_DOCVALUES_SYSPROP=true
   [junit4]   2> 268435 INFO  (SUITE-Http2SolrClientTest-seed#[C1856BF8244BA09C]-worker) [     ] o.a.s.SolrTestCaseJ4 Randomized ssl (true) and clientAuth (true) via: @org.apache.solr.util.RandomizeSSL(reason=, ssl=NaN, value=NaN, clientAuth=NaN)
   [junit4]   2> 268436 INFO  (SUITE-Http2SolrClientTest-seed#[C1856BF8244BA09C]-worker) [     ] o.a.s.SolrTestCaseJ4 SecureRandom sanity checks: test.solr.allowed.securerandom=null & java.security.egd=file:/dev/./urandom
   [junit4]   2> 268455 INFO  (SUITE-Http2SolrClientTest-seed#[C1856BF8244BA09C]-worker) [     ] o.a.s.SolrTestCaseJ4 ####initCore
   [junit4]   2> 268455 INFO  (SUITE-Http2SolrClientTest-seed#[C1856BF8244BA09C]-worker) [     ] o.a.s.SolrTestCaseJ4 ####initCore end
   [junit4]   2> 268455 INFO  (SUITE-Http2SolrClientTest-seed#[C1856BF8244BA09C]-worker) [     ] o.a.s.SolrTestCaseJ4 Writing core.properties file to /home/jenkins/jenkins-slave/workspace/Lucene-Solr-BadApples-Tests-8.x/solr/build/solr-solrj/test/J0/temp/solr.client.solrj.impl.Http2SolrClientTest_C1856BF8244BA09C-001/tempDir-002/cores/core
   [junit4]   2> 268459 WARN  (SUITE-Http2SolrClientTest-seed#[C1856BF8244BA09C]-worker) [     ] o.e.j.s.h.g.GzipHandler minGzipSize of 0 is inefficient for short content, break even is size 23
   [junit4]   2> 268459 INFO  (SUITE-Http2SolrClientTest-seed#[C1856BF8244BA09C]-worker) [     ] o.a.s.c.s.e.JettySolrRunner Start Jetty (configured port=0, binding port=0)
   [junit4]   2> 268459 INFO  (SUITE-Http2SolrClientTest-seed#[C1856BF8244BA09C]-worker) [     ] o.a.s.c.s.e.JettySolrRunner Trying to start Jetty on port 0 try number 1 ...
   [junit4]   2> 268459 INFO  (SUITE-Http2SolrClientTest-seed#[C1856BF8244BA09C]-worker) [     ] o.e.j.s.Server jetty-9.4.27.v20200227; built: 2020-02-27T18:37:21.340Z; git: a304fd9f351f337e7c0e2a7c28878dd536149c6c; jvm 1.8.0_191-b12
   [junit4]   2> 268459 INFO  (SUITE-Http2SolrClientTest-seed#[C1856BF8244BA09C]-worker) [     ] o.e.j.s.session DefaultSessionIdManager workerName=node0
   [junit4]   2> 268459 INFO  (SUITE-Http2SolrClientTest-seed#[C1856BF8244BA09C]-worker) [     ] o.e.j.s.session No SessionScavenger set, using defaults
   [junit4]   2> 268459 INFO  (SUITE-Http2SolrClientTest-seed#[C1856BF8244BA09C]-worker) [     ] o.e.j.s.session node0 Scavenging every 660000ms
   [junit4]   2> 268460 INFO  (SUITE-Http2SolrClientTest-seed#[C1856BF8244BA09C]-worker) [     ] o.e.j.s.h.ContextHandler Started o.e.j.s.ServletContextHandler@45e22871{/solr,null,AVAILABLE}
   [junit4]   2> 268460 INFO  (SUITE-Http2SolrClientTest-seed#[C1856BF8244BA09C]-worker) [     ] o.e.j.s.AbstractConnector Started ServerConnector@ff9b85c{SSL, (ssl, http/1.1)}{127.0.0.1:42549}
   [junit4]   2> 268460 INFO  (SUITE-Http2SolrClientTest-seed#[C1856BF8244BA09C]-worker) [     ] o.e.j.s.Server Started @268493ms
   [junit4]   2> 268460 INFO  (SUITE-Http2SolrClientTest-seed#[C1856BF8244BA09C]-worker) [     ] o.a.s.c.s.e.JettySolrRunner Jetty properties: {hostContext=/solr, hostPort=42549, configSetBaseDir=/home/jenkins/jenkins-slave/workspace/Lucene-Solr-BadApples-Tests-8.x/solr/build/solr-solrj/test/J0/temp/solr.client.solrj.impl.Http2SolrClientTest_C1856BF8244BA09C-001/tempDir-001, coreRootDirectory=/home/jenkins/jenkins-slave/workspace/Lucene-Solr-BadApples-Tests-8.x/solr/build/solr-solrj/test/J0/temp/solr.client.solrj.impl.Http2SolrClientTest_C1856BF8244BA09C-001/tempDir-002/cores}
   [junit4]   2> 268461 ERROR (SUITE-Http2SolrClientTest-seed#[C1856BF8244BA09C]-worker) [     ] o.a.s.u.StartupLoggingUtils Missing Java Option solr.log.dir. Logging may be missing or incomplete.
   [junit4]   2> 268461 INFO  (SUITE-Http2SolrClientTest-seed#[C1856BF8244BA09C]-worker) [     ] o.a.s.s.SolrDispatchFilter Using logger factory org.apache.logging.slf4j.Log4jLoggerFactory
   [junit4]   2> 268461 INFO  (SUITE-Http2SolrClientTest-seed#[C1856BF8244BA09C]-worker) [     ] o.a.s.s.SolrDispatchFilter  ___      _       Welcome to Apache Solr™ version 8.6.0
   [junit4]   2> 268461 INFO  (SUITE-Http2SolrClientTest-seed#[C1856BF8244BA09C]-worker) [     ] o.a.s.s.SolrDispatchFilter / __| ___| |_ _   Starting in standalone mode on port null
   [junit4]   2> 268461 INFO  (SUITE-Http2SolrClientTest-seed#[C1856BF8244BA09C]-worker) [     ] o.a.s.s.SolrDispatchFilter \__ \/ _ \ | '_|  Install dir: /home/jenkins/jenkins-slave/workspace/Lucene-Solr-BadApples-Tests-8.x/solr
   [junit4]   2> 268461 INFO  (SUITE-Http2SolrClientTest-seed#[C1856BF8244BA09C]-worker) [     ] o.a.s.s.SolrDispatchFilter |___/\___/_|_|    Start time: 2020-04-07T08:29:12.928Z
   [junit4]   2> 268461 INFO  (SUITE-Http2SolrClientTest-seed#[C1856BF8244BA09C]-worker) [     ] o.a.s.c.SolrXmlConfig Loading container configuration from /home/jenkins/jenkins-slave/workspace/Lucene-Solr-BadApples-Tests-8.x/solr/build/solr-solrj/test/J0/temp/solr.client.solrj.impl.Http2SolrClientTest_C1856BF8244BA09C-001/tempDir-001/solr.xml
   [junit4]   2> 268465 INFO  (SUITE-Http2SolrClientTest-seed#[C1856BF8244BA09C]-worker) [     ] o.a.s.c.SolrXmlConfig MBean server found: com.sun.jmx.mbeanserver.JmxMBeanServer@184673c0, but no JMX reporters were configured - adding default JMX reporter.
   [junit4]   2> 269009 INFO  (SUITE-Http2SolrClientTest-seed#[C1856BF8244BA09C]-worker) [     ] o.a.s.h.c.HttpShardHandlerFactory Host whitelist initialized: WhitelistHostChecker [whitelistHosts=null, whitelistHostCheckingEnabled=true]
   [junit4]   2> 269010 WARN  (SUITE-Http2SolrClientTest-seed#[C1856BF8244BA09C]-worker) [     ] o.a.s.c.s.i.Http2SolrClient Create Http2SolrClient with HTTP/1.1 transport since Java 8 or lower versions does not support SSL + HTTP/2
   [junit4]   2> 269011 WARN  (SUITE-Http2SolrClientTest-seed#[C1856BF8244BA09C]-worker) [     ] o.e.j.u.s.S.config Trusting all certificates configured for Client@6445078e[provider=null,keyStore=null,trustStore=null]
   [junit4]   2> 269011 WARN  (SUITE-Http2SolrClientTest-seed#[C1856BF8244BA09C]-worker) [     ] o.e.j.u.s.S.config No Client EndPointIdentificationAlgorithm configured for Client@6445078e[provider=null,keyStore=null,trustStore=null]
   [junit4]   2> 269013 WARN  (SUITE-Http2SolrClientTest-seed#[C1856BF8244BA09C]-worker) [     ] o.a.s.c.s.i.Http2SolrClient Create Http2SolrClient with HTTP/1.1 transport since Java 8 or lower versions does not support SSL + HTTP/2
   [junit4]   2> 269014 WARN  (SUITE-Http2SolrClientTest-seed#[C1856BF8244BA09C]-worker) [     ] o.e.j.u.s.S.config Trusting all certificates configured for Client@5abaf446[provider=null,keyStore=null,trustStore=null]
   [junit4]   2> 269014 WARN  (SUITE-Http2SolrClientTest-seed#[C1856BF8244BA09C]-worker) [     ] o.e.j.u.s.S.config No Client EndPointIdentificationAlgorithm configured for Client@5abaf446[provider=null,keyStore=null,trustStore=null]
   [junit4]   2> 269015 WARN  (SUITE-Http2SolrClientTest-seed#[C1856BF8244BA09C]-worker) [     ] o.a.s.c.CoreContainer Not all security plugins configured!  authentication=disabled authorization=disabled.  Solr is only as secure as you make it. Consider configuring authentication/authorization before exposing Solr to users internal or external.  See https://s.apache.org/solrsecurity for more info
   [junit4]   2> 269031 INFO  (SUITE-Http2SolrClientTest-seed#[C1856BF8244BA09C]-worker) [     ] o.a.s.c.TransientSolrCoreCacheDefault Allocating transient cache for 2147483647 transient cores
   [junit4]   2> 269031 INFO  (SUITE-Http2SolrClientTest-seed#[C1856BF8244BA09C]-worker) [     ] o.a.s.h.a.MetricsHistoryHandler No .system collection, keeping metrics history in memory.
   [junit4]   2> 269048 INFO  (SUITE-Http2SolrClientTest-seed#[C1856BF8244BA09C]-worker) [     ] o.a.s.m.r.SolrJmxReporter JMX monitoring for 'solr.node' (registry 'solr.node') enabled at server: com.sun.jmx.mbeanserver.JmxMBeanServer@184673c0
   [junit4]   2> 269055 INFO  (SUITE-Http2SolrClientTest-seed#[C1856BF8244BA09C]-worker) [     ] o.a.s.m.r.SolrJmxReporter JMX monitoring for 'solr.jvm' (registry 'solr.jvm') enabled at server: com.sun.jmx.mbeanserver.JmxMBeanServer@184673c0
   [junit4]   2> 269055 INFO  (SUITE-Http2SolrClientTest-seed#[C1856BF8244BA09C]-worker) [     ] o.a.s.m.r.SolrJmxReporter JMX monitoring for 'solr.jetty' (registry 'solr.jetty') enabled at server: com.sun.jmx.mbeanserver.JmxMBeanServer@184673c0
   [junit4]   2> 269060 INFO  (SUITE-Http2SolrClientTest-seed#[C1856BF8244BA09C]-worker) [     ] o.a.s.c.CorePropertiesLocator Found 1 core definitions underneath /home/jenkins/jenkins-slave/workspace/Lucene-Solr-BadApples-Tests-8.x/solr/build/solr-solrj/test/J0/temp/solr.client.solrj.impl.Http2SolrClientTest_C1856BF8244BA09C-001/tempDir-001
   [junit4]   2> 269060 INFO  (SUITE-Http2SolrClientTest-seed#[C1856BF8244BA09C]-worker) [     ] o.a.s.c.CorePropertiesLocator Cores are: [collection1]
   [junit4]   2> 269071 WARN  (coreLoadExecutor-2034-thread-1) [    x:collection1 ] o.a.s.c.SolrConfig Couldn't add files from /home/jenkins/jenkins-slave/workspace/Lucene-Solr-BadApples-Tests-8.x/solr/contrib/extraction/lib filtered by .*\.jar to classpath: /home/jenkins/jenkins-slave/workspace/Lucene-Solr-BadApples-Tests-8.x/solr/contrib/extraction/lib
   [junit4]   2> 269071 WARN  (coreLoadExecutor-2034-thread-1) [    x:collection1 ] o.a.s.c.SolrConfig Couldn't add files from /home/jenkins/jenkins-slave/workspace/Lucene-Solr-BadApples-Tests-8.x/solr/dist filtered by solr-cell-\d.*\.jar to classpath: /home/jenkins/jenkins-slave/workspace/Lucene-Solr-BadApples-Tests-8.x/solr/dist
   [junit4]   2> 269071 WARN  (coreLoadExecutor-2034-thread-1) [    x:collection1 ] o.a.s.c.SolrConfig Couldn't add files from /home/jenkins/jenkins-slave/workspace/Lucene-Solr-BadApples-Tests-8.x/solr/contrib/clustering/lib filtered by .*\.jar to classpath: /home/jenkins/jenkins-slave/workspace/Lucene-Solr-BadApples-Tests-8.x/solr/contrib/clustering/lib
   [junit4]   2> 269071 WARN  (coreLoadExecutor-2034-thread-1) [    x:collection1 ] o.a.s.c.SolrConfig Couldn't add files from /home/jenkins/jenkins-slave/workspace/Lucene-Solr-BadApples-Tests-8.x/solr/dist filtered by solr-clustering-\d.*\.jar to classpath: /home/jenkins/jenkins-slave/workspace/Lucene-Solr-BadApples-Tests-8.x/solr/dist
   [junit4]   2> 269071 WARN  (coreLoadExecutor-2034-thread-1) [    x:collection1 ] o.a.s.c.SolrConfig Couldn't add files from /home/jenkins/jenkins-slave/workspace/Lucene-Solr-BadApples-Tests-8.x/solr/contrib/langid/lib filtered by .*\.jar to classpath: /home/jenkins/jenkins-slave/workspace/Lucene-Solr-BadApples-Tests-8.x/solr/contrib/langid/lib
   [junit4]   2> 269071 WARN  (coreLoadExecutor-2034-thread-1) [    x:collection1 ] o.a.s.c.SolrConfig Couldn't add files from /home/jenkins/jenkins-slave/workspace/Lucene-Solr-BadApples-Tests-8.x/solr/dist filtered by solr-langid-\d.*\.jar to classpath: /home/jenkins/jenkins-slave/workspace/Lucene-Solr-BadApples-Tests-8.x/solr/dist
   [junit4]   2> 269071 WARN  (coreLoadExecutor-2034-thread-1) [    x:collection1 ] o.a.s.c.SolrConfig Couldn't add files from /home/jenkins/jenkins-slave/workspace/Lucene-Solr-BadApples-Tests-8.x/solr/dist filtered by solr-ltr-\d.*\.jar to classpath: /home/jenkins/jenkins-slave/workspace/Lucene-Solr-BadApples-Tests-8.x/solr/dist
   [junit4]   2> 269071 WARN  (coreLoadExecutor-2034-thread-1) [    x:collection1 ] o.a.s.c.SolrConfig Couldn't add files from /home/jenkins/jenkins-slave/workspace/Lucene-Solr-BadApples-Tests-8.x/solr/contrib/velocity/lib filtered by .*\.jar to classpath: /home/jenkins/jenkins-slave/workspace/Lucene-Solr-BadApples-Tests-8.x/solr/contrib/velocity/lib
   [junit4]   2> 269071 WARN  (coreLoadExecutor-2034-thread-1) [    x:collection1 ] o.a.s.c.SolrConfig Couldn't add files from /home/jenkins/jenkins-slave/workspace/Lucene-Solr-BadApples-Tests-8.x/solr/dist filtered by solr-velocity-\d.*\.jar to classpath: /home/jenkins/jenkins-slave/workspace/Lucene-Solr-BadApples-Tests-8.x/solr/dist
   [junit4]   2> 269072 INFO  (coreLoadExecutor-2034-thread-1) [    x:collection1 ] o.a.s.c.SolrConfig Using Lucene MatchVersion: 8.6.0
   [junit4]   2> 269079 INFO  (coreLoadExecutor-2034-thread-1) [    x:collection1 ] o.a.s.u.SolrIndexConfig IndexWriter infoStream solr logging is enabled
   [junit4]   2> 269104 INFO  (coreLoadExecutor-2034-thread-1) [    x:collection1 ] o.a.s.s.IndexSchema Schema name=example
   [junit4]   2> 269250 INFO  (coreLoadExecutor-2034-thread-1) [    x:collection1 ] o.a.s.r.RestManager Registered ManagedResource impl org.apache.solr.rest.schema.analysis.ManagedWordSetResource for path /schema/analysis/stopwords/english
   [junit4]   2> 269250 INFO  (coreLoadExecutor-2034-thread-1) [    x:collection1 ] o.a.s.r.RestManager Registered ManagedResource impl org.apache.solr.rest.schema.analysis.ManagedSynonymGraphFilterFactory$SynonymManager for path /schema/analysis/synonyms/english
   [junit4]   2> 269250 INFO  (coreLoadExecutor-2034-thread-1) [    x:collection1 ] o.a.s.r.RestManager Added observer of type org.apache.solr.rest.schema.analysis.ManagedStopFilterFactory to existing ManagedResource /schema/analysis/stopwords/english
   [junit4]   2> 269250 INFO  (coreLoadExecutor-2034-thread-1) [    x:collection1 ] o.a.s.r.RestManager Added observer of type org.apache.solr.rest.schema.analysis.ManagedSynonymGraphFilterFactory to existing ManagedResource /schema/analysis/synonyms/english
   [junit4]   2> 269252 INFO  (coreLoadExecutor-2034-thread-1) [    x:collection1 ] o.a.s.s.IndexSchema Loaded schema example/1.6 with uniqueid field id
   [junit4]   2> 269252 INFO  (coreLoadExecutor-2034-thread-1) [    x:collection1 ] o.a.s.r.RestManager Added observer of type org.apache.solr.rest.schema.analysis.ManagedStopFilterFactory to existing ManagedResource /schema/analysis/stopwords/english
   [junit4]   2> 269252 INFO  (coreLoadExecutor-2034-thread-1) [    x:collection1 ] o.a.s.r.RestManager Added observer of type org.apache.solr.rest.schema.analysis.ManagedSynonymGraphFilterFactory to existing ManagedResource /schema/analysis/synonyms/english
   [junit4]   2> 269252 INFO  (coreLoadExecutor-2034-thread-1) [    x:collection1 ] o.a.s.r.RestManager Added observer of type org.apache.solr.rest.schema.analysis.ManagedStopFilterFactory to existing ManagedResource /schema/analysis/stopwords/english
   [junit4]   2> 269252 INFO  (coreLoadExecutor-2034-thread-1) [    x:collection1 ] o.a.s.r.RestManager Added observer of type org.apache.solr.rest.schema.analysis.ManagedSynonymGraphFilterFactory to existing ManagedResource /schema/analysis/synonyms/english
   [junit4]   2> 269265 INFO  (coreLoadExecutor-2034-thread-1) [    x:collection1 ] o.a.s.c.CoreContainer Creating SolrCore 'collection1' using configuration from instancedir /home/jenkins/jenkins-slave/workspace/Lucene-Solr-BadApples-Tests-8.x/solr/build/solr-solrj/test/J0/temp/solr.client.solrj.impl.Http2SolrClientTest_C1856BF8244BA09C-001/tempDir-001/collection1, trusted=true
   [junit4]   2> 269265 INFO  (coreLoadExecutor-2034-thread-1) [    x:collection1 ] o.a.s.m.r.SolrJmxReporter JMX monitoring for 'solr.core.collection1' (registry 'solr.core.collection1') enabled at server: com.sun.jmx.mbeanserver.JmxMBeanServer@184673c0
   [junit4]   2> 269265 INFO  (coreLoadExecutor-2034-thread-1) [    x:collection1 ] o.a.s.c.SolrCore [[collection1] ] Opening new SolrCore at [/home/jenkins/jenkins-slave/workspace/Lucene-Solr-BadApples-Tests-8.x/solr/build/solr-solrj/test/J0/temp/solr.client.solrj.impl.Http2SolrClientTest_C1856BF8244BA09C-001/tempDir-001/collection1], dataDir=[/home/jenkins/jenkins-slave/workspace/Lucene-Solr-BadApples-Tests-8.x/solr/build/solr-solrj/test/J0/temp/solr.client.solrj.impl.Http2SolrClientTest_C1856BF8244BA09C-001/tempDir-001/collection1/data/]
   [junit4]   2> 269266 INFO  (coreLoadExecutor-2034-thread-1) [    x:collection1 ] o.a.s.u.LoggingInfoStream [IFD][coreLoadExecutor-2034-thread-1]: init: current segments file is "segments"; deletionPolicy=org.apache.solr.core.IndexDeletionPolicyWrapper@190a82aa
   [junit4]   2> 269266 INFO  (coreLoadExecutor-2034-thread-1) [    x:collection1 ] o.a.s.u.LoggingInfoStream [IFD][coreLoadExecutor-2034-thread-1]: now checkpoint "" [0 segments ; isCommit = false]
   [junit4]   2> 269266 INFO  (coreLoadExecutor-2034-thread-1) [    x:collection1 ] o.a.s.u.LoggingInfoStream [IFD][coreLoadExecutor-2034-thread-1]: 0 msec to checkpoint
   [junit4]   2> 269266 INFO  (coreLoadExecutor-2034-thread-1) [    x:collection1 ] o.a.s.u.LoggingInfoStream [IW][coreLoadExecutor-2034-thread-1]: init: create=true reader=null
   [junit4]   2> 269266 INFO  (coreLoadExecutor-2034-thread-1) [    x:collection1 ] o.a.s.u.LoggingInfoStream [IW][coreLoadExecutor-2034-thread-1]: 
   [junit4]   2> dir=MockDirectoryWrapper(RAMDirectory@76cb29a4 lockFactory=org.apache.lucene.store.SingleInstanceLockFactory@641257b1)
   [junit4]   2> index=
   [junit4]   2> version=8.6.0
   [junit4]   2> analyzer=org.apache.solr.update.SolrIndexConfig$DelayedSchemaAnalyzer
   [junit4]   2> ramBufferSizeMB=100.0
   [junit4]   2> maxBufferedDocs=-1
   [junit4]   2> mergedSegmentWarmer=null
   [junit4]   2> delPolicy=org.apache.solr.core.IndexDeletionPolicyWrapper
   [junit4]   2> commit=null
   [junit4]   2> openMode=CREATE
   [junit4]   2> similarity=org.apache.solr.search.similarities.SchemaSimilarityFactory$SchemaSimilarity
   [junit4]   2> mergeScheduler=ConcurrentMergeScheduler: maxThreadCount=-1, maxMergeCount=-1, ioThrottle=true
   [junit4]   2> codec=Lucene84
   [junit4]   2> infoStream=org.apache.solr.update.LoggingInfoStream
   [junit4]   2> mergePolicy=[TieredMergePolicy: maxMergeAtOnce=10, maxMergeAtOnceExplicit=30, maxMergedSegmentMB=5120.0, floorSegmentMB=2.0, forceMergeDeletesPctAllowed=10.0, segmentsPerTier=10.0, maxCFSSegmentSizeMB=8.796093022207999E12, noCFSRatio=0.1, deletesPctAllowed=33.0
   [junit4]   2> indexerThreadPool=org.apache.lucene.index.DocumentsWriterPerThreadPool@47144435
   [junit4]   2> readerPooling=true
   [junit4]   2> perThreadHardLimitMB=1945
   [junit4]   2> useCompoundFile=false
   [junit4]   2> commitOnClose=true
   [junit4]   2> indexSort=null
   [junit4]   2> checkPendingFlushOnUpdate=true
   [junit4]   2> softDeletesField=null
   [junit4]   2> writer=org.apache.solr.update.SolrIndexWriter@a4691af
   [junit4]   2> 
   [junit4]   2> 269266 INFO  (coreLoadExecutor-2034-thread-1) [    x:collection1 ] o.a.s.u.LoggingInfoStream [IW][coreLoadExecutor-2034-thread-1]: MMapDirectory.UNMAP_SUPPORTED=true
   [junit4]   2> 269266 INFO  (coreLoadExecutor-2034-thread-1) [    x:collection1 ] o.a.s.u.LoggingInfoStream [IW][coreLoadExecutor-2034-thread-1]: now flush at close
   [junit4]   2> 269266 INFO  (coreLoadExecutor-2034-thread-1) [    x:collection1 ] o.a.s.u.LoggingInfoStream [IW][coreLoadExecutor-2034-thread-1]:   start flush: applyAllDeletes=true
   [junit4]   2> 269266 INFO  (coreLoadExecutor-2034-thread-1) [    x:collection1 ] o.a.s.u.LoggingInfoStream [IW][coreLoadExecutor-2034-thread-1]:   index before flush 
   [junit4]   2> 269266 INFO  (coreLoadExecutor-2034-thread-1) [    x:collection1 ] o.a.s.u.LoggingInfoStream [DW][coreLoadExecutor-2034-thread-1]: startFullFlush
   [junit4]   2> 269266 INFO  (coreLoadExecutor-2034-thread-1) [    x:collection1 ] o.a.s.u.LoggingInfoStream [DW][coreLoadExecutor-2034-thread-1]: coreLoadExecutor-2034-thread-1 finishFullFlush success=true
   [junit4]   2> 269266 INFO  (coreLoadExecutor-2034-thread-1) [    x:collection1 ] o.a.s.u.LoggingInfoStream [IW][coreLoadExecutor-2034-thread-1]: now apply all deletes for all segments buffered updates bytesUsed=0 reader pool bytesUsed=0
   [junit4]   2> 269266 INFO  (coreLoadExecutor-2034-thread-1) [    x:collection1 ] o.a.s.u.LoggingInfoStream [BD][coreLoadExecutor-2034-thread-1]: waitApply: no deletes to apply
   [junit4]   2> 269267 INFO  (coreLoadExecutor-2034-thread-1) [    x:collection1 ] o.a.s.u.LoggingInfoStream [MS][coreLoadExecutor-2034-thread-1]: initDynamicDefaults spins=false maxThreadCount=1 maxMergeCount=6
   [junit4]   2> 269267 INFO  (coreLoadExecutor-2034-thread-1) [    x:collection1 ] o.a.s.u.LoggingInfoStream [MS][coreLoadExecutor-2034-thread-1]: updateMergeThreads ioThrottle=true targetMBPerSec=10240.0 MB/sec
   [junit4]   2> 269267 INFO  (coreLoadExecutor-2034-thread-1) [    x:collection1 ] o.a.s.u.LoggingInfoStream [MS][coreLoadExecutor-2034-thread-1]: now merge
   [junit4]   2> 269267 INFO  (coreLoadExecutor-2034-thread-1) [    x:collection1 ] o.a.s.u.LoggingInfoStream [MS][coreLoadExecutor-2034-thread-1]:   index: 
   [junit4]   2> 269267 INFO  (coreLoadExecutor-2034-thread-1) [    x:collection1 ] o.a.s.u.LoggingInfoStream [MS][coreLoadExecutor-2034-thread-1]:   no more merges pending; now return
   [junit4]   2> 269267 INFO  (coreLoadExecutor-2034-thread-1) [    x:collection1 ] o.a.s.u.LoggingInfoStream [IW][coreLoadExecutor-2034-thread-1]: waitForMerges
   [junit4]   2> 269267 INFO  (coreLoadExecutor-2034-thread-1) [    x:collection1 ] o.a.s.u.LoggingInfoStream [IW][coreLoadExecutor-2034-thread-1]: waitForMerges done
   [junit4]   2> 269267 INFO  (coreLoadExecutor-2034-thread-1) [    x:collection1 ] o.a.s.u.LoggingInfoStream [IW][coreLoadExecutor-2034-thread-1]: commit: start
   [junit4]   2> 269267 INFO  (coreLoadExecutor-2034-thread-1) [    x:collection1 ] o.a.s.u.LoggingInfoStream [IW][coreLoadExecutor-2034-thread-1]: commit: enter lock
   [junit4]   2> 269267 INFO  (coreLoadExecutor-2034-thread-1) [    x:collection1 ] o.a.s.u.LoggingInfoStream [IW][coreLoadExecutor-2034-thread-1]: commit: now prepare
   [junit4]   2> 269267 INFO  (coreLoadExecutor-2034-thread-1) [    x:collection1 ] o.a.s.u.LoggingInfoStream [IW][coreLoadExecutor-2034-thread-1]: prepareCommit: flush
   [junit4]   2> 269267 INFO  (coreLoadExecutor-2034-thread-1) [    x:collection1 ] o.a.s.u.LoggingInfoStream [IW][coreLoadExecutor-2034-thread-1]:   index before flush 
   [junit4]   2> 269267 INFO  (coreLoadExecutor-2034-thread-1) [    x:collection1 ] o.a.s.u.LoggingInfoStream [DW][coreLoadExecutor-2034-thread-1]: startFullFlush
   [junit4]   2> 269267 INFO  (coreLoadExecutor-2034-thread-1) [    x:collection1 ] o.a.s.u.LoggingInfoStream [IW][coreLoadExecutor-2034-thread-1]: now apply all deletes for all segments buffered updates bytesUsed=0 reader pool bytesUsed=0
   [junit4]   2> 269267 INFO  (coreLoadExecutor-2034-thread-1) [    x:collection1 ] o.a.s.u.LoggingInfoStream [BD][coreLoadExecutor-2034-thread-1]: waitApply: no deletes to apply
   [junit4]   2> 269267 INFO  (coreLoadExecutor-2034-thread-1) [    x:collection1 ] o.a.s.u.LoggingInfoStream [DW][coreLoadExecutor-2034-thread-1]: coreLoadExecutor-2034-thread-1 finishFullFlush success=true
   [junit4]   2> 269267 INFO  (coreLoadExecutor-2034-thread-1) [    x:collection1 ] o.a.s.u.LoggingInfoStream [IW][coreLoadExecutor-2034-thread-1]: startCommit(): start
   [junit4]   2> 269267 INFO  (coreLoadExecutor-2034-thread-1) [    x:collection1 ] o.a.s.u.LoggingInfoStream [IW][coreLoadExecutor-2034-thread-1]: startCommit index= changeCount=2
   [junit4]   2> 269267 INFO  (coreLoadExecutor-2034-thread-1) [    x:collection1 ] o.a.s.u.LoggingInfoStream [IW][coreLoadExecutor-2034-thread-1]: startCommit: wrote pending segments file "pending_segments_1"
   [junit4]   2> 269267 INFO  (coreLoadExecutor-2034-thread-1) [    x:collection1 ] o.a.s.u.LoggingInfoStream [IW][coreLoadExecutor-2034-thread-1]: done all syncs: []
   [junit4]   2> 269267 INFO  (coreLoadExecutor-2034-thread-1) [    x:collection1 ] o.a.s.u.LoggingInfoStream [IW][coreLoadExecutor-2034-thread-1]: commit: pendingCommit != null
   [junit4]   2> 269267 INFO  (coreLoadExecutor-2034-thread-1) [    x:collection1 ] o.a.s.u.LoggingInfoStream [IW][coreLoadExecutor-2034-thread-1]: commit: done writing segments file "segments_1"
   [junit4]   2> 269267 INFO  (coreLoadExecutor-2034-thread-1) [    x:collection1 ] o.a.s.u.LoggingInfoStream [IFD][coreLoadExecutor-2034-thread-1]: now checkpoint "" [0 segments ; isCommit = true]
   [junit4]   2> 269267 INFO  (coreLoadExecutor-2034-thread-1) [    x:collection1 ] o.a.s.u.LoggingInfoStream [IFD][coreLoadExecutor-2034-thread-1]: 0 msec to checkpoint
   [junit4]   2> 269267 INFO  (coreLoadExecutor-2034-thread-1) [    x:collection1 ] o.a.s.u.LoggingInfoStream [IW][coreLoadExecutor-2034-thread-1]: commit: took 0.2 msec
   [junit4]   2> 269267 INFO  (coreLoadExecutor-2034-thread-1) [    x:collection1 ] o.a.s.u.LoggingInfoStream [IW][coreLoadExecutor-2034-thread-1]: commit: done
   [junit4]   2> 269267 INFO  (coreLoadExecutor-2034-thread-1) [    x:collection1 ] o.a.s.u.LoggingInfoStream [IW][coreLoadExecutor-2034-thread-1]: rollback
   [junit4]   2> 269267 INFO  (coreLoadExecutor-2034-thread-1) [    x:collection1 ] o.a.s.u.LoggingInfoStream [IW][coreLoadExecutor-2034-thread-1]: all running merges have aborted
   [junit4]   2> 269267 INFO  (coreLoadExecutor-2034-thread-1) [    x:collection1 ] o.a.s.u.LoggingInfoStream [IW][coreLoadExecutor-2034-thread-1]: rollback: done finish merges
   [junit4]   2> 269267 INFO  (coreLoadExecutor-2034-thread-1) [    x:collection1 ] o.a.s.u.LoggingInfoStream [DW][coreLoadExecutor-2034-thread-1]: abort
   [junit4]   2> 269267 INFO  (coreLoadExecutor-2034-thread-1) [    x:collection1 ] o.a.s.u.LoggingInfoStream [DW][coreLoadExecutor-2034-thread-1]: done abort success=true
   [junit4]   2> 269267 INFO  (coreLoadExecutor-2034-thread-1) [    x:collection1 ] o.a.s.u.LoggingInfoStream [IW][coreLoadExecutor-2034-thread-1]: rollback: infos=
   [junit4]   2> 269267 INFO  (coreLoadExecutor-2034-thread-1) [    x:collection1 ] o.a.s.u.LoggingInfoStream [IFD][coreLoadExecutor-2034-thread-1]: now checkpoint "" [0 segments ; isCommit = false]
   [junit4]   2> 269267 INFO  (coreLoadExecutor-2034-thread-1) [    x:collection1 ] o.a.s.u.LoggingInfoStream [IFD][coreLoadExecutor-2034-thread-1]: 0 msec to checkpoint
   [junit4]   2> 269267 INFO  (coreLoadExecutor-2034-thread-1) [    x:collection1 ] o.a.s.r.XSLTResponseWriter xsltCacheLifetimeSeconds=5
   [junit4]   2> 269311 INFO  (coreLoadExecutor-2034-thread-1) [    x:collection1 ] o.a.s.u.UpdateHandler Using UpdateLog implementation: org.apache.solr.update.UpdateLog
   [junit4]   2> 269311 INFO  (coreLoadExecutor-2034-thread-1) [    x:collection1 ] o.a.s.u.UpdateLog Initializing UpdateLog: dataDir= defaultSyncLevel=FLUSH numRecordsToKeep=100 maxNumLogsToKeep=10 numVersionBuckets=65536
   [junit4]   2> 269312 INFO  (coreLoadExecutor-2034-thread-1) [    x:collection1 ] o.a.s.u.CommitTracker Hard AutoCommit: if uncommitted for 15000ms; 
   [junit4]   2> 269312 INFO  (coreLoadExecutor-2034-thread-1) [    x:collection1 ] o.a.s.u.CommitTracker Soft AutoCommit: disabled
   [junit4]   2> 269313 INFO  (coreLoadExecutor-2034-thread-1) [    x:collection1 ] o.a.s.u.LoggingInfoStream [IFD][coreLoadExecutor-2034-thread-1]: init: current segments file is "segments_1"; deletionPolicy=org.apache.solr.core.IndexDeletionPolicyWrapper@190a82aa
   [junit4]   2> 269313 INFO  (coreLoadExecutor-2034-thread-1) [    x:collection1 ] o.a.s.u.LoggingInfoStream [IFD][coreLoadExecutor-2034-thread-1]: init: load commit "segments_1"
   [junit4]   2> 269313 INFO  (coreLoadExecutor-2034-thread-1) [    x:collection1 ] o.a.s.u.LoggingInfoStream [IFD][coreLoadExecutor-2034-thread-1]: now checkpoint "" [0 segments ; isCommit = false]
   [junit4]   2> 269313 INFO  (coreLoadExecutor-2034-thread-1) [    x:collection1 ] o.a.s.u.LoggingInfoStream [IFD][coreLoadExecutor-2034-thread-1]: 0 msec to checkpoint
   [junit4]   2> 269313 INFO  (coreLoadExecutor-2034-thread-1) [    x:collection1 ] o.a.s.u.LoggingInfoStream [IW][coreLoadExecutor-2034-thread-1]: init: create=false reader=null
   [junit4]   2> 269313 INFO  (coreLoadExecutor-2034-thread-1) [    x:collection1 ] o.a.s.u.LoggingInfoStream [IW][coreLoadExecutor-2034-thread-1]: 
   [junit4]   2> dir=MockDirectoryWrapper(RAMDirectory@76cb29a4 lockFactory=org.apache.lucene.store.SingleInstanceLockFactory@641257b1)
   [junit4]   2> index=
   [junit4]   2> version=8.6.0
   [junit4]   2> analyzer=org.apache.solr.update.SolrIndexConfig$DelayedSchemaAnalyzer
   [junit4]   2> ramBufferSizeMB=100.0
   [junit4]   2> maxBufferedDocs=-1
   [junit4]   2> mergedSegmentWarmer=null
   [junit4]   2> delPolicy=org.apache.solr.core.IndexDeletionPolicyWrapper
   [junit4]   2> commit=null
   [junit4]   2> openMode=APPEND
   [junit4]   2> similarity=org.apache.solr.search.similarities.SchemaSimilarityFactory$SchemaSimilarity
   [junit4]   2> mergeScheduler=ConcurrentMergeScheduler: maxThreadCount=-1, maxMergeCount=-1, ioThrottle=true
   [junit4]   2> codec=Lucene84
   [junit4]   2> infoStream=org.apache.solr.update.LoggingInfoStream
   [junit4]   2> mergePolicy=[TieredMergePolicy: maxMergeAtOnce=10, maxMergeAtOnceExplicit=30, maxMergedSegmentMB=5120.0, floorSegmentMB=2.0, forceMergeDeletesPctAllowed=10.0, segmentsPerTier=10.0, maxCFSSegmentSizeMB=8.796093022207999E12, noCFSRatio=0.1, deletesPctAllowed=33.0
   [junit4]   2> indexerThreadPool=org.apache.lucene.index.DocumentsWriterPerThreadPool@5c47784f
   [junit4]   2> readerPooling=true
   [junit4]   2> perThreadHardLimitMB=1945
   [junit4]   2> useCompoundFile=false
   [junit4]   2> commitOnClose=true
   [junit4]   2> indexSort=null
   [junit4]   2> checkPendingFlushOnUpdate=true
   [junit4]   2> softDeletesField=null
   [junit4]   2> writer=org.apache.solr.update.SolrIndexWriter@67676fe2
   [junit4]   2> 
   [junit4]   2> 269313 INFO  (coreLoadExecutor-2034-thread-1) [    x:collection1 ] o.a.s.u.LoggingInfoStream [IW][coreLoadExecutor-2034-thread-1]: MMapDirectory.UNMAP_SUPPORTED=true
   [junit4]   2> 269313 INFO  (coreLoadExecutor-2034-thread-1) [    x:collection1 ] o.a.s.u.LoggingInfoStream [IW][coreLoadExecutor-2034-thread-1]: flush at getReader
   [junit4]   2> 269313 INFO  (coreLoadExecutor-2034-thread-1) [    x:collection1 ] o.a.s.u.LoggingInfoStream [DW][coreLoadExecutor-2034-thread-1]: startFullFlush
   [junit4]   2> 269313 INFO  (coreLoadExecutor-2034-thread-1) [    x:collection1 ] o.a.s.u.LoggingInfoStream [IW][coreLoadExecutor-2034-thread-1]: now apply all deletes for all segments buffered updates bytesUsed=0 reader pool bytesUsed=0
   [junit4]   2> 269313 INFO  (coreLoadExecutor-2034-thread-1) [    x:collection1 ] o.a.s.u.LoggingInfoStream [BD][coreLoadExecutor-2034-thread-1]: waitApply: no deletes to apply
   [junit4]   2> 269313 INFO  (coreLoadExecutor-2034-thread-1) [    x:collection1 ] o.a.s.u.LoggingInfoStream [IW][coreLoadExecutor-2034-thread-1]: incRefDeleter for NRT reader version=2 segments=
   [junit4]   2> 269313 INFO  (coreLoadExecutor-2034-thread-1) [    x:collection1 ] o.a.s.u.LoggingInfoStream [IW][coreLoadExecutor-2034-thread-1]: return reader version=2 reader=StandardDirectoryReader(segments_1:2:nrt)
   [junit4]   2> 269313 INFO  (coreLoadExecutor-2034-thread-1) [    x:collection1 ] o.a.s.u.LoggingInfoStream [DW][coreLoadExecutor-2034-thread-1]: coreLoadExecutor-2034-thread-1 finishFullFlush success=true
   [junit4]   2> 269313 INFO  (coreLoadExecutor-2034-thread-1) [    x:collection1 ] o.a.s.u.LoggingInfoStream [IW][coreLoadExecutor-2034-thread-1]: getReader took 0 msec
   [junit4]   2> 269313 INFO  (coreLoadExecutor-2034-thread-1) [    x:collection1 ] o.a.s.s.SolrIndexSearcher Opening [Searcher@6e06e790[collection1] main]
   [junit4]   2> 269314 INFO  (coreLoadExecutor-2034-thread-1) [    x:collection1 ] o.a.s.r.ManagedResourceStorage File-based storage initialized to use dir: /home/jenkins/jenkins-slave/workspace/Lucene-Solr-BadApples-Tests-8.x/solr/build/solr-solrj/test/J0/temp/solr.client.solrj.impl.Http2SolrClientTest_C1856BF8244BA09C-001/tempDir-001/collection1/conf
   [junit4]   2> 269314 INFO  (coreLoadExecutor-2034-thread-1) [    x:collection1 ] o.a.s.r.ManagedResourceStorage Loaded LinkedHashMap at path _rest_managed.json using file:dir=/home/jenkins/jenkins-slave/workspace/Lucene-Solr-BadApples-Tests-8.x/solr/build/solr-solrj/test/J0/temp/solr.client.solrj.impl.Http2SolrClientTest_C1856BF8244BA09C-001/tempDir-001/collection1/conf
   [junit4]   2> 269314 INFO  (coreLoadExecutor-2034-thread-1) [    x:collection1 ] o.a.s.r.ManagedResource Loaded initArgs {} for /rest/managed
   [junit4]   2> 269314 INFO  (coreLoadExecutor-2034-thread-1) [    x:collection1 ] o.a.s.r.ManagedResourceStorage Loaded LinkedHashMap at path _schema_analysis_stopwords_english.json using file:dir=/home/jenkins/jenkins-slave/workspace/Lucene-Solr-BadApples-Tests-8.x/solr/build/solr-solrj/test/J0/temp/solr.client.solrj.impl.Http2SolrClientTest_C1856BF8244BA09C-001/tempDir-001/collection1/conf
   [junit4]   2> 269314 INFO  (coreLoadExecutor-2034-thread-1) [    x:collection1 ] o.a.s.r.ManagedResource Loaded initArgs {ignoreCase=true} for /schema/analysis/stopwords/english
   [junit4]   2> 269314 INFO  (coreLoadExecutor-2034-thread-1) [    x:collection1 ] o.a.s.r.s.a.ManagedWordSetResource Loaded 35 words for /schema/analysis/stopwords/english
   [junit4]   2> 269314 INFO  (coreLoadExecutor-2034-thread-1) [    x:collection1 ] o.a.s.r.ManagedResource Notified 2 observers of /schema/analysis/stopwords/english
   [junit4]   2> 269314 INFO  (coreLoadExecutor-2034-thread-1) [    x:collection1 ] o.a.s.r.ManagedResourceStorage Loaded LinkedHashMap at path _schema_analysis_synonyms_english.json using file:dir=/home/jenkins/jenkins-slave/workspace/Lucene-Solr-BadApples-Tests-8.x/solr/build/solr-solrj/test/J0/temp/solr.client.solrj.impl.Http2SolrClientTest_C1856BF8244BA09C-001/tempDir-001/collection1/conf
   [junit4]   2> 269314 INFO  (coreLoadExecutor-2034-thread-1) [    x:collection1 ] o.a.s.r.ManagedResource Loaded initArgs {ignoreCase=true,format=solr} for /schema/analysis/synonyms/english
   [junit4]   2> 269314 INFO  (coreLoadExecutor-2034-thread-1) [    x:collection1 ] o.a.s.r.s.a.ManagedSynonymGraphFilterFactory Loaded 3 synonym mappings for /schema/analysis/synonyms/english
   [junit4]   2> 269314 INFO  (coreLoadExecutor-2034-thread-1) [    x:collection1 ] o.a.s.r.ManagedResource Notified 2 observers of /schema/analysis/synonyms/english
   [junit4]   2> 269314 INFO  (coreLoadExecutor-2034-thread-1) [    x:collection1 ] o.a.s.h.c.SpellCheckComponent Initializing spell checkers
   [junit4]   2> 269314 INFO  (coreLoadExecutor-2034-thread-1) [    x:collection1 ] o.a.s.s.DirectSolrSpellChecker init: {name=default,field=text,classname=solr.DirectSolrSpellChecker,distanceMeasure=internal,accuracy=0.5,maxEdits=2,minPrefix=1,maxInspections=5,minQueryLength=4,maxQueryFrequency=0.01}
   [junit4]   2> 269315 INFO  (coreLoadExecutor-2034-thread-1) [    x:collection1 ] o.a.s.h.c.SuggestComponent Initializing SuggestComponent
   [junit4]   2> 269315 INFO  (coreLoadExecutor-2034-thread-1) [    x:collection1 ] o.a.s.s.s.SolrSuggester init: {name=mySuggester,lookupImpl=FuzzyLookupFactory,dictionaryImpl=DocumentDictionaryFactory,field=cat,weightField=price,suggestAnalyzerFieldType=string,buildOnStartup=false}
   [junit4]   2> 269315 INFO  (coreLoadExecutor-2034-thread-1) [    x:collection1 ] o.a.s.s.s.SolrSuggester Dictionary loaded with params: {name=mySuggester,lookupImpl=FuzzyLookupFactory,dictionaryImpl=DocumentDictionaryFactory,field=cat,weightField=price,suggestAnalyzerFieldType=string,buildOnStartup=false}
   [junit4]   2> 269315 INFO  (coreLoadExecutor-2034-thread-1) [    x:collection1 ] o.a.s.h.c.QueryElevationComponent Loading QueryElevation from: /home/jenkins/jenkins-slave/workspace/Lucene-Solr-BadApples-Tests-8.x/solr/build/solr-solrj/test/J0/temp/solr.client.solrj.impl.Http2SolrClientTest_C1856BF8244BA09C-001/tempDir-001/collection1/conf/elevate.xml
   [junit4]   2> 269318 INFO  (coreLoadExecutor-2034-thread-1) [    x:collection1 ] o.a.s.h.ReplicationHandler Commits will be reserved for 10000ms.
   [junit4]   2> 269319 INFO  (coreLoadExecutor-2034-thread-1) [    x:collection1 ] o.a.s.u.UpdateLog Could not find max version in index or recent updates, using new clock 1663301744104308736
   [junit4]   2> 269320 INFO  (searcherExecutor-2035-thread-1-processing-x:collection1) [    x:collection1 ] o.a.s.c.QuerySenderListener QuerySenderListener sending requests to Searcher@6e06e790[collection1] main{ExitableDirectoryReader(UninvertingDirectoryReader())}
   [junit4]   2> 269320 INFO  (SUITE-Http2SolrClientTest-seed#[C1856BF8244BA09C]-worker) [     ] o.a.s.SolrJettyTestBase Jetty Assigned Port#42549
   [junit4]   2> 269322 INFO  (searcherExecutor-2035-thread-1-processing-x:collection1) [    x:collection1 ] o.a.s.c.S.Request [collection1]  webapp=null path=null params={q=static+firstSearcher+warming+in+solrconfig.xml&distrib=false&event=firstSearcher} hits=0 status=0 QTime=0
   [junit4]   2> 269322 INFO  (searcherExecutor-2035-thread-1-processing-x:collection1) [    x:collection1 ] o.a.s.c.QuerySenderListener QuerySenderListener done.
   [junit4]   2> 269322 INFO  (searcherExecutor-2035-thread-1-processing-x:collection1) [    x:collection1 ] o.a.s.h.c.SpellCheckComponent Loading spell index for spellchecker: default
   [junit4]   2> 269322 INFO  (searcherExecutor-2035-thread-1-processing-x:collection1) [    x:collection1 ] o.a.s.h.c.SpellCheckComponent Loading spell index for spellchecker: wordbreak
   [junit4]   2> 269323 INFO  (searcherExecutor-2035-thread-1-processing-x:collection1) [    x:collection1 ] o.a.s.c.SolrCore [collection1] Registered new searcher Searcher@6e06e790[collection1] main{ExitableDirectoryReader(UninvertingDirectoryReader())}
   [junit4]   2> 269324 ERROR (coreZkRegister-2026-thread-1) [    x:collection1 ] o.a.s.c.ZkContainer 
   [junit4]   2>           => java.lang.NullPointerException
   [junit4]   2> 	at org.apache.solr.core.ZkContainer.lambda$registerInZk$0(ZkContainer.java:204)
   [junit4]   2> java.lang.NullPointerException: null
   [junit4]   2> 	at org.apache.solr.core.ZkContainer.lambda$registerInZk$0(ZkContainer.java:204) ~[java/:?]
   [junit4]   2> 	at org.apache.solr.common.util.ExecutorUtil$MDCAwareThreadPoolExecutor.lambda$execute$0(ExecutorUtil.java:210) ~[java/:?]
   [junit4]   2> 	at java.util.concurrent.ThreadPoolExecutor.runWorker(ThreadPoolExecutor.java:1149) ~[?:1.8.0_191]
   [junit4]   2> 	at java.util.concurrent.ThreadPoolExecutor$Worker.run(ThreadPoolExecutor.java:624) ~[?:1.8.0_191]
   [junit4]   2> 	at java.lang.Thread.run(Thread.java:748) [?:1.8.0_191]
   [junit4]   2> 269324 ERROR (coreZkRegister-2026-thread-1) [    x:collection1 ] o.a.s.c.ZkContainer :java.lang.NullPointerException
   [junit4]   2> 	at org.apache.solr.core.ZkContainer.lambda$registerInZk$0(ZkContainer.java:192)
   [junit4]   2> 	at org.apache.solr.common.util.ExecutorUtil$MDCAwareThreadPoolExecutor.lambda$execute$0(ExecutorUtil.java:210)
   [junit4]   2> 	at java.util.concurrent.ThreadPoolExecutor.runWorker(ThreadPoolExecutor.java:1149)
   [junit4]   2> 	at java.util.concurrent.ThreadPoolExecutor$Worker.run(ThreadPoolExecutor.java:624)
   [junit4]   2> 	at java.lang.Thread.run(Thread.java:748)
   [junit4]   2> 
   [junit4]   2> 269327 INFO  (TEST-Http2SolrClientTest.testSolrExceptionCodeNotFromSolr-seed#[C1856BF8244BA09C]) [     ] o.a.s.SolrTestCaseJ4 ###Starting testSolrExceptionCodeNotFromSolr
   [junit4]   2> 269328 WARN  (TEST-Http2SolrClientTest.testSolrExceptionCodeNotFromSolr-seed#[C1856BF8244BA09C]) [     ] o.a.s.c.s.i.Http2SolrClient Create Http2SolrClient with HTTP/1.1 transport since Java 8 or lower versions does not support SSL + HTTP/2
   [junit4]   2> 269331 WARN  (TEST-Http2SolrClientTest.testSolrExceptionCodeNotFromSolr-seed#[C1856BF8244BA09C]) [     ] o.e.j.u.s.S.config Trusting all certificates configured for Client@244d0106[provider=null,keyStore=null,trustStore=null]
   [junit4]   2> 269331 WARN  (TEST-Http2SolrClientTest.testSolrExceptionCodeNotFromSolr-seed#[C1856BF8244BA09C]) [     ] o.e.j.u.s.S.config No Client EndPointIdentificationAlgorithm configured for Client@244d0106[provider=null,keyStore=null,trustStore=null]
   [junit4]   2> 269386 INFO  (TEST-Http2SolrClientTest.testSolrExceptionCodeNotFromSolr-seed#[C1856BF8244BA09C]) [     ] o.a.s.SolrTestCaseJ4 ###Ending testSolrExceptionCodeNotFromSolr
   [junit4]   2> 269390 INFO  (TEST-Http2SolrClientTest.testUpdate-seed#[C1856BF8244BA09C]) [     ] o.a.s.SolrTestCaseJ4 ###Starting testUpdate
   [junit4]   2> 269390 WARN  (TEST-Http2SolrClientTest.testUpdate-seed#[C1856BF8244BA09C]) [     ] o.a.s.c.s.i.Http2SolrClient Create Http2SolrClient with HTTP/1.1 transport since Java 8 or lower versions does not support SSL + HTTP/2
   [junit4]   2> 269391 WARN  (TEST-Http2SolrClientTest.testUpdate-seed#[C1856BF8244BA09C]) [     ] o.e.j.u.s.S.config Trusting all certificates configured for Client@575f3eda[provider=null,keyStore=null,trustStore=null]
   [junit4]   2> 269391 WARN  (TEST-Http2SolrClientTest.testUpdate-seed#[C1856BF8244BA09C]) [     ] o.e.j.u.s.S.config No Client EndPointIdentificationAlgorithm configured for Client@575f3eda[provider=null,keyStore=null,trustStore=null]
   [junit4]   2> 269449 INFO  (TEST-Http2SolrClientTest.testUpdate-seed#[C1856BF8244BA09C]) [     ] o.a.s.SolrTestCaseJ4 ###Ending testUpdate
   [junit4]   2> 269453 INFO  (TEST-Http2SolrClientTest.testQueryString-seed#[C1856BF8244BA09C]) [     ] o.a.s.SolrTestCaseJ4 ###Starting testQueryString
   [junit4]   2> 269454 WARN  (TEST-Http2SolrClientTest.testQueryString-seed#[C1856BF8244BA09C]) [     ] o.a.s.c.s.i.Http2SolrClient Create Http2SolrClient with HTTP/1.1 transport since Java 8 or lower versions does not support SSL + HTTP/2
   [junit4]   2> 269455 WARN  (TEST-Http2SolrClientTest.testQueryString-seed#[C1856BF8244BA09C]) [     ] o.e.j.u.s.S.config Trusting all certificates configured for Client@73d40cff[provider=null,keyStore=null,trustStore=null]
   [junit4]   2> 269455 WARN  (TEST-Http2SolrClientTest.testQueryString-seed#[C1856BF8244BA09C]) [     ] o.e.j.u.s.S.config No Client EndPointIdentificationAlgorithm configured for Client@73d40cff[provider=null,keyStore=null,trustStore=null]
   [junit4]   2> 269533 INFO  (TEST-Http2SolrClientTest.testQueryString-seed#[C1856BF8244BA09C]) [     ] o.a.s.SolrTestCaseJ4 ###Ending testQueryString
   [junit4]   2> 269538 INFO  (TEST-Http2SolrClientTest.testTimeout-seed#[C1856BF8244BA09C]) [     ] o.a.s.SolrTestCaseJ4 ###Starting testTimeout
   [junit4]   2> 269538 WARN  (TEST-Http2SolrClientTest.testTimeout-seed#[C1856BF8244BA09C]) [     ] o.a.s.c.s.i.Http2SolrClient Create Http2SolrClient with HTTP/1.1 transport since Java 8 or lower versions does not support SSL + HTTP/2
   [junit4]   2> 269539 WARN  (TEST-Http2SolrClientTest.testTimeout-seed#[C1856BF8244BA09C]) [     ] o.e.j.u.s.S.config Trusting all certificates configured for Client@65775321[provider=null,keyStore=null,trustStore=null]
   [junit4]   2> 269539 WARN  (TEST-Http2SolrClientTest.testTimeout-seed#[C1856BF8244BA09C]) [     ] o.e.j.u.s.S.config No Client EndPointIdentificationAlgorithm configured for Client@65775321[provider=null,keyStore=null,trustStore=null]
   [junit4]   2> 271542 INFO  (TEST-Http2SolrClientTest.testTimeout-seed#[C1856BF8244BA09C]) [     ] o.a.s.SolrTestCaseJ4 ###Ending testTimeout
   [junit4]   2> 271547 INFO  (TEST-Http2SolrClientTest.testDelete-seed#[C1856BF8244BA09C]) [     ] o.a.s.SolrTestCaseJ4 ###Starting testDelete
   [junit4]   2> 271547 WARN  (TEST-Http2SolrClientTest.testDelete-seed#[C1856BF8244BA09C]) [     ] o.a.s.c.s.i.Http2SolrClient Create Http2SolrClient with HTTP/1.1 transport since Java 8 or lower versions does not support SSL + HTTP/2
   [junit4]   2> 271548 WARN  (TEST-Http2SolrClientTest.testDelete-seed#[C1856BF8244BA09C]) [     ] o.e.j.u.s.S.config Trusting all certificates configured for Client@3fb9a0c4[provider=null,keyStore=null,trustStore=null]
   [junit4]   2> 271548 WARN  (TEST-Http2SolrClientTest.testDelete-seed#[C1856BF8244BA09C]) [     ] o.e.j.u.s.S.config No Client EndPointIdentificationAlgorithm configured for Client@3fb9a0c4[provider=null,keyStore=null,trustStore=null]
   [junit4]   2> 271587 INFO  (TEST-Http2SolrClientTest.testDelete-seed#[C1856BF8244BA09C]) [     ] o.a.s.SolrTestCaseJ4 ###Ending testDelete
   [junit4]   2> 271592 INFO  (TEST-Http2SolrClientTest.test0IdleTimeout-seed#[C1856BF8244BA09C]) [     ] o.a.s.SolrTestCaseJ4 ###Starting test0IdleTimeout
   [junit4]   2> 271592 WARN  (TEST-Http2SolrClientTest.test0IdleTimeout-seed#[C1856BF8244BA09C]) [     ] o.a.s.c.s.i.Http2SolrClient Create Http2SolrClient with HTTP/1.1 transport since Java 8 or lower versions does not support SSL + HTTP/2
   [junit4]   2> 271593 WARN  (TEST-Http2SolrClientTest.test0IdleTimeout-seed#[C1856BF8244BA09C]) [     ] o.e.j.u.s.S.config Trusting all certificates configured for Client@28a3d267[provider=null,keyStore=null,trustStore=null]
   [junit4]   2> 271593 WARN  (TEST-Http2SolrClientTest.test0IdleTimeout-seed#[C1856BF8244BA09C]) [     ] o.e.j.u.s.S.config No Client EndPointIdentificationAlgorithm configured for Client@28a3d267[provider=null,keyStore=null,trustStore=null]
   [junit4]   2> 271629 INFO  (TEST-Http2SolrClientTest.test0IdleTimeout-seed#[C1856BF8244BA09C]) [     ] o.a.s.SolrTestCaseJ4 ###Ending test0IdleTimeout
   [junit4]   2> 271633 INFO  (TEST-Http2SolrClientTest.testGetDefaultSslContextFactory-seed#[C1856BF8244BA09C]) [     ] o.a.s.SolrTestCaseJ4 ###Starting testGetDefaultSslContextFactory
   [junit4]   2> 271634 INFO  (TEST-Http2SolrClientTest.testGetDefaultSslContextFactory-seed#[C1856BF8244BA09C]) [     ] o.a.s.SolrTestCaseJ4 ###Ending testGetDefaultSslContextFactory
   [junit4]   2> 271637 INFO  (TEST-Http2SolrClientTest.testQuery-seed#[C1856BF8244BA09C]) [     ] o.a.s.SolrTestCaseJ4 ###Starting testQuery
   [junit4]   2> 271638 WARN  (TEST-Http2SolrClientTest.testQuery-seed#[C1856BF8244BA09C]) [     ] o.a.s.c.s.i.Http2SolrClient Create Http2SolrClient with HTTP/1.1 transport since Java 8 or lower versions does not support SSL + HTTP/2
   [junit4]   2> 271640 WARN  (TEST-Http2SolrClientTest.testQuery-seed#[C1856BF8244BA09C]) [     ] o.e.j.u.s.S.config Trusting all certificates configured for Client@34bf6fe7[provider=null,keyStore=null,trustStore=null]
   [junit4]   2> 271640 WARN  (TEST-Http2SolrClientTest.testQuery-seed#[C1856BF8244BA09C]) [     ] o.e.j.u.s.S.config No Client EndPointIdentificationAlgorithm configured for Client@34bf6fe7[provider=null,keyStore=null,trustStore=null]
   [junit4]   2> 271694 INFO  (TEST-Http2SolrClientTest.testQuery-seed#[C1856BF8244BA09C]) [     ] o.a.s.SolrTestCaseJ4 ###Ending testQuery
   [junit4]   2> 271698 INFO  (TEST-Http2SolrClientTest.testGetById-seed#[C1856BF8244BA09C]) [     ] o.a.s.SolrTestCaseJ4 ###Starting testGetById
   [junit4]   2> 271699 WARN  (TEST-Http2SolrClientTest.testGetById-seed#[C1856BF8244BA09C]) [     ] o.a.s.c.s.i.Http2SolrClient Create Http2SolrClient with HTTP/1.1 transport since Java 8 or lower versions does not support SSL + HTTP/2
   [junit4]   2> 271699 WARN  (TEST-Http2SolrClientTest.testGetById-seed#[C1856BF8244BA09C]) [     ] o.e.j.u.s.S.config Trusting all certificates configured for Client@2066a400[provider=null,keyStore=null,trustStore=null]
   [junit4]   2> 271699 WARN  (TEST-Http2SolrClientTest.testGetById-seed#[C1856BF8244BA09C]) [     ] o.e.j.u.s.S.config No Client EndPointIdentificationAlgorithm configured for Client@2066a400[provider=null,keyStore=null,trustStore=null]
   [junit4]   2> 271749 INFO  (TEST-Http2SolrClientTest.testGetById-seed#[C1856BF8244BA09C]) [     ] o.a.s.SolrTestCaseJ4 ###Ending testGetById
   [junit4]   2> 271753 INFO  (TEST-Http2SolrClientTest.testCollectionParameters-seed#[C1856BF8244BA09C]) [     ] o.a.s.SolrTestCaseJ4 ###Starting testCollectionParameters
   [junit4]   2> 271753 WARN  (TEST-Http2SolrClientTest.testCollectionParameters-seed#[C1856BF8244BA09C]) [     ] o.a.s.c.s.i.Http2SolrClient Create Http2SolrClient with HTTP/1.1 transport since Java 8 or lower versions does not support SSL + HTTP/2
   [junit4]   2> 271754 WARN  (TEST-Http2SolrClientTest.testCollectionParameters-seed#[C1856BF8244BA09C]) [     ] o.e.j.u.s.S.config Trusting all certificates configured for Client@479550d9[provider=null,keyStore=null,trustStore=null]
   [junit4]   2> 271754 WARN  (TEST-Http2SolrClientTest.testCollectionParameters-seed#[C1856BF8244BA09C]) [     ] o.e.j.u.s.S.config No Client EndPointIdentificationAlgorithm configured for Client@479550d9[provider=null,keyStore=null,trustStore=null]
   [junit4]   2> 271790 INFO  (qtp789838357-9642) [    x:collection1 ] o.a.s.u.p.LogUpdateProcessorFactory [collection1]  webapp=/solr path=/update params={wt=javabin&version=2}{add=[collection (1663301746693242880)]} 0 1
   [junit4]   2> 271791 INFO  (qtp789838357-9640) [    x:collection1 ] o.a.s.u.DirectUpdateHandler2 start commit{_version_=1663301746696388608,optimize=false,openSearcher=true,waitSearcher=true,expungeDeletes=false,softCommit=false,prepareCommit=false}
   [junit4]   2> 271791 INFO  (qtp789838357-9640) [    x:collection1 ] o.a.s.u.SolrIndexWriter Calling setCommitData with IW:org.apache.solr.update.SolrIndexWriter@67676fe2 commitCommandVersion:1663301746696388608
   [junit4]   2> 271791 INFO  (qtp789838357-9640) [    x:collection1 ] o.a.s.u.LoggingInfoStream [IW][qtp789838357-9640]: commit: start
   [junit4]   2> 271791 INFO  (qtp789838357-9640) [    x:collection1 ] o.a.s.u.LoggingInfoStream [IW][qtp789838357-9640]: commit: enter lock
   [junit4]   2> 271791 INFO  (qtp789838357-9640) [    x:collection1 ] o.a.s.u.LoggingInfoStream [IW][qtp789838357-9640]: commit: now prepare
   [junit4]   2> 271791 INFO  (qtp789838357-9640) [    x:collection1 ] o.a.s.u.LoggingInfoStream [IW][qtp789838357-9640]: prepareCommit: flush
   [junit4]   2> 271791 INFO  (qtp789838357-9640) [    x:collection1 ] o.a.s.u.LoggingInfoStream [IW][qtp789838357-9640]:   index before flush 
   [junit4]   2> 271791 INFO  (qtp789838357-9640) [    x:collection1 ] o.a.s.u.LoggingInfoStream [DW][qtp789838357-9640]: startFullFlush
   [junit4]   2> 271791 INFO  (qtp789838357-9640) [    x:collection1 ] o.a.s.u.LoggingInfoStream [DW][qtp789838357-9640]: anyChanges? numDocsInRam=1 deletes=true hasTickets:false pendingChangesInFullFlush: false
   [junit4]   2> 271791 INFO  (qtp789838357-9640) [    x:collection1 ] o.a.s.u.LoggingInfoStream [DWFC][qtp789838357-9640]: addFlushableState DocumentsWriterPerThread [pendingDeletes=gen=0 1 deleted terms (unique count=1) bytesUsed=182, segment=_0, aborted=false, numDocsInRAM=1, deleteQueue=DWDQ: [ generation: 1 ]]
   [junit4]   2> 271791 INFO  (qtp789838357-9640) [    x:collection1 ] o.a.s.u.LoggingInfoStream [BD][qtp789838357-9640]: compressed 182 to 1040 bytes (571.43%) for deletes/updates; private segment null
   [junit4]   2> 271791 INFO  (qtp789838357-9640) [    x:collection1 ] o.a.s.u.LoggingInfoStream [DWPT][qtp789838357-9640]: flush postings as segment _0 numDocs=1
   [junit4]   2> 271791 INFO  (qtp789838357-9640) [    x:collection1 ] o.a.s.u.LoggingInfoStream [IW][qtp789838357-9640]: 0 msec to write norms
   [junit4]   2> 271791 INFO  (qtp789838357-9640) [    x:collection1 ] o.a.s.u.LoggingInfoStream [IW][qtp789838357-9640]: 0 msec to write docValues
   [junit4]   2> 271791 INFO  (qtp789838357-9640) [    x:collection1 ] o.a.s.u.LoggingInfoStream [IW][qtp789838357-9640]: 0 msec to write points
   [junit4]   2> 271791 INFO  (qtp789838357-9640) [    x:collection1 ] o.a.s.u.LoggingInfoStream [IW][qtp789838357-9640]: 0 msec to finish stored fields
   [junit4]   2> 271792 INFO  (qtp789838357-9640) [    x:collection1 ] o.a.s.u.LoggingInfoStream [IW][qtp789838357-9640]: 0 msec to write postings and finish vectors
   [junit4]   2> 271792 INFO  (qtp789838357-9640) [    x:collection1 ] o.a.s.u.LoggingInfoStream [IW][qtp789838357-9640]: 0 msec to write fieldInfos
   [junit4]   2> 271792 INFO  (qtp789838357-9640) [    x:collection1 ] o.a.s.u.LoggingInfoStream [DWPT][qtp789838357-9640]: new segment has 0 deleted docs
   [junit4]   2> 271792 INFO  (qtp789838357-9640) [    x:collection1 ] o.a.s.u.LoggingInfoStream [DWPT][qtp789838357-9640]: new segment has 0 soft-deleted docs
   [junit4]   2> 271792 INFO  (qtp789838357-9640) [    x:collection1 ] o.a.s.u.LoggingInfoStream [DWPT][qtp789838357-9640]: new segment has no vectors; no norms; docValues; no prox; freqs
   [junit4]   2> 271792 INFO  (qtp789838357-9640) [    x:collection1 ] o.a.s.u.LoggingInfoStream [DWPT][qtp789838357-9640]: flushedFiles=[_0_Lucene80_0.dvd, _0.fdm, _0_Lucene84_0.doc, _0_Lucene84_0.tim, _0_Lucene84_0.tip, _0.fdx, _0.fdt, _0_Lucene80_0.dvm, _0.fnm]
   [junit4]   2> 271792 INFO  (qtp789838357-9640) [    x:collection1 ] o.a.s.u.LoggingInfoStream [DWPT][qtp789838357-9640]: flushed codec=Lucene84
   [junit4]   2> 271792 INFO  (qtp789838357-9640) [    x:collection1 ] o.a.s.u.LoggingInfoStream [DWPT][qtp789838357-9640]: flushed: segment=_0 ramUsed=0.087 MB newFlushedSize=0.001 MB docs/MB=795.581
   [junit4]   2> 271792 INFO  (qtp789838357-9640) [    x:collection1 ] o.a.s.u.LoggingInfoStream [DWPT][qtp789838357-9640]: flush time 1.092313 msec
   [junit4]   2> 271792 INFO  (qtp789838357-9640) [    x:collection1 ] o.a.s.u.LoggingInfoStream [IW][qtp789838357-9640]: publishFlushedSegment seg-private updates=null
   [junit4]   2> 271792 INFO  (qtp789838357-9640) [    x:collection1 ] o.a.s.u.LoggingInfoStream [IW][qtp789838357-9640]: publishFlushedSegment _0(8.6.0):C1:[diagnostics={os=Linux, java.vendor=Oracle Corporation, java.version=1.8.0_191, java.vm.version=25.191-b12, lucene.version=8.6.0, os.arch=amd64, java.runtime.version=1.8.0_191-b12, source=flush, os.version=4.15.0-54-generic, timestamp=1586248156259}]:[attributes={Lucene50StoredFieldsFormat.mode=BEST_SPEED}]
   [junit4]   2> 271792 INFO  (qtp789838357-9640) [    x:collection1 ] o.a.s.u.LoggingInfoStream [BD][qtp789838357-9640]: push new packet (delGen=1 numDeleteTerms=1 bytesUsed=1040), packetCount=1, bytesUsed=0.001 MB
   [junit4]   2> 271792 INFO  (qtp789838357-9640) [    x:collection1 ] o.a.s.u.LoggingInfoStream [BD][qtp789838357-9640]: finished packet delGen=2 now completedDelGen=0
   [junit4]   2> 271792 INFO  (qtp789838357-9640) [    x:collection1 ] o.a.s.u.LoggingInfoStream [IW][qtp789838357-9640]: publish sets newSegment delGen=2 seg=_0(8.6.0):C1:[diagnostics={os=Linux, java.vendor=Oracle Corporation, java.version=1.8.0_191, java.vm.version=25.191-b12, lucene.version=8.6.0, os.arch=amd64, java.runtime.version=1.8.0_191-b12, source=flush, os.version=4.15.0-54-generic, timestamp=1586248156259}]:[attributes={Lucene50StoredFieldsFormat.mode=BEST_SPEED}]
   [junit4]   2> 271792 INFO  (qtp789838357-9640) [    x:collection1 ] o.a.s.u.LoggingInfoStream [IFD][qtp789838357-9640]: now checkpoint "_0(8.6.0):C1:[diagnostics={os=Linux, java.vendor=Oracle Corporation, java.version=1.8.0_191, java.vm.version=25.191-b12, lucene.version=8.6.0, os.arch=amd64, java.runtime.version=1.8.0_191-b12, source=flush, os.version=4.15.0-54-generic, timestamp=1586248156259}]:[attributes={Lucene50StoredFieldsFormat.mode=BEST_SPEED}]" [1 segments ; isCommit = false]
   [junit4]   2> 271792 INFO  (qtp789838357-9640) [    x:collection1 ] o.a.s.u.LoggingInfoStream [IFD][qtp789838357-9640]: 0 msec to checkpoint
   [junit4]   2> 271792 INFO  (qtp789838357-9640) [    x:collection1 ] o.a.s.u.LoggingInfoStream [BD][qtp789838357-9640]: packet matches no segments
   [junit4]   2> 271792 INFO  (qtp789838357-9640) [    x:collection1 ] o.a.s.u.LoggingInfoStream [BD][qtp789838357-9640]: finished packet delGen=1 now completedDelGen=2
   [junit4]   2> 271792 INFO  (qtp789838357-9640) [    x:collection1 ] o.a.s.u.LoggingInfoStream [BD][qtp789838357-9640]: done apply del packet (delGen=1 numDeleteTerms=1 bytesUsed=1040) to 0 segments; 0 new deletes/updates; took 0.000 sec; 0 packets remain
   [junit4]   2> 271792 INFO  (qtp789838357-9640) [    x:collection1 ] o.a.s.u.LoggingInfoStream [IW][qtp789838357-9640]: now apply all deletes for all segments buffered updates bytesUsed=0 reader pool bytesUsed=0
   [junit4]   2> 271792 INFO  (qtp789838357-9640) [    x:collection1 ] o.a.s.u.LoggingInfoStream [BD][qtp789838357-9640]: waitApply: no deletes to apply
   [junit4]   2> 271792 INFO  (qtp789838357-9640) [    x:collection1 ] o.a.s.u.LoggingInfoStream [DW][qtp789838357-9640]: qtp789838357-9640 finishFullFlush success=true
   [junit4]   2> 271792 INFO  (qtp789838357-9640) [    x:collection1 ] o.a.s.u.LoggingInfoStream [IW][qtp789838357-9640]: startCommit(): start
   [junit4]   2> 271792 INFO  (qtp789838357-9640) [    x:collection1 ] o.a.s.u.LoggingInfoStream [IW][qtp789838357-9640]: startCommit index=_0(8.6.0):C1:[diagnostics={os=Linux, java.vendor=Oracle Corporation, java.version=1.8.0_191, java.vm.version=25.191-b12, lucene.version=8.6.0, os.arch=amd64, java.runtime.version=1.8.0_191-b12, source=flush, os.version=4.15.0-54-generic, timestamp=1586248156259}]:[attributes={Lucene50StoredFieldsFormat.mode=BEST_SPEED}] changeCount=4
   [junit4]   2> 271792 INFO  (qtp789838357-9640) [    x:collection1 ] o.a.s.u.LoggingInfoStream [IW][qtp789838357-9640]: startCommit: wrote pending segments file "pending_segments_2"
   [junit4]   2> 271792 INFO  (qtp789838357-9640) [    x:collection1 ] o.a.s.u.LoggingInfoStream [IW][qtp789838357-9640]: done all syncs: [_0.si, _0_Lucene80_0.dvd, _0.fdm, _0_Lucene84_0.doc, _0_Lucene84_0.tim, _0_Lucene84_0.tip, _0.fdx, _0.fdt, _0_Lucene80_0.dvm, _0.fnm]
   [junit4]   2> 271792 INFO  (qtp789838357-9640) [    x:collection1 ] o.a.s.u.LoggingInfoStream [IW][qtp789838357-9640]: commit: pendingCommit != null
   [junit4]   2> 271792 INFO  (qtp789838357-9640) [    x:collection1 ] o.a.s.u.LoggingInfoStream [IW][qtp789838357-9640]: commit: done writing segments file "segments_2"
   [junit4]   2> 271792 INFO  (qtp789838357-9640) [    x:collection1 ] o.a.s.u.LoggingInfoStream [IFD][qtp789838357-9640]: now checkpoint "_0(8.6.0):C1:[diagnostics={os=Linux, java.vendor=Oracle Corporation, java.version=1.8.0_191, java.vm.version=25.191-b12, lucene.version=8.6.0, os.arch=amd64, java.runtime.version=1.8.0_191-b12, source=flush, os.version=4.15.0-54-generic, timestamp=1586248156259}]:[attributes={Lucene50StoredFieldsFormat.mode=BEST_SPEED}]" [1 segments ; isCommit = true]
   [junit4]   2> 271792 INFO  (qtp789838357-9640) [    x:collection1 ] o.a.s.u.LoggingInfoStream [IFD][qtp789838357-9640]: deleteCommits: now decRef commit "segments_1"
   [junit4]   2> 271793 INFO  (qtp789838357-9640) [    x:collection1 ] o.a.s.u.LoggingInfoStream [IFD][qtp789838357-9640]: delete [segments_1]
   [junit4]   2> 271793 INFO  (qtp789838357-9640) [    x:collection1 ] o.a.s.u.LoggingInfoStream [IFD][qtp789838357-9640]: 0 msec to checkpoint
   [junit4]   2> 271793 INFO  (qtp789838357-9640) [    x:collection1 ] o.a.s.u.LoggingInfoStream [IW][qtp789838357-9640]: commit: took 2.0 msec
   [junit4]   2> 271793 INFO  (qtp789838357-9640) [    x:collection1 ] o.a.s.u.LoggingInfoStream [IW][qtp789838357-9640]: commit: done
   [junit4]   2> 271793 INFO  (qtp789838357-9640) [    x:collection1 ] o.a.s.u.LoggingInfoStream [MP][qtp789838357-9640]:   seg=_0(8.6.0):C1:[diagnostics={os=Linux, java.vendor=Oracle Corporation, java.version=1.8.0_191, java.vm.version=25.191-b12, lucene.version=8.6.0, os.arch=amd64, java.runtime.version=1.8.0_191-b12, source=flush, os.version=4.15.0-54-generic, timestamp=1586248156259}]:[attributes={Lucene50StoredFieldsFormat.mode=BEST_SPEED}] size=0.001 MB [floored]
   [junit4]   2> 271793 INFO  (qtp789838357-9640) [    x:collection1 ] o.a.s.u.LoggingInfoStream [MP][qtp789838357-9640]: findMerges: 1 segments
   [junit4]   2> 271793 INFO  (qtp789838357-9640) [    x:collection1 ] o.a.s.u.LoggingInfoStream [MP][qtp789838357-9640]:   allowedSegmentCount=10 vs count=1 (eligible count=1)
   [junit4]   2> 271793 INFO  (qtp789838357-9640) [    x:collection1 ] o.a.s.u.LoggingInfoStream [MS][qtp789838357-9640]: initDynamicDefaults spins=false maxThreadCount=1 maxMergeCount=6
   [junit4]   2> 271793 INFO  (qtp789838357-9640) [    x:collection1 ] o.a.s.u.LoggingInfoStream [MS][qtp789838357-9640]: now merge
   [junit4]   2> 271793 INFO  (qtp789838357-9640) [    x:collection1 ] o.a.s.u.LoggingInfoStream [MS][qtp789838357-9640]:   index: _0(8.6.0):C1:[diagnostics={os=Linux, java.vendor=Oracle Corporation, java.version=1.8.0_191, java.vm.version=25.191-b12, lucene.version=8.6.0, os.arch=amd64, java.runtime.version=1.8.0_191-b12, source=flush, os.version=4.15.0-54-generic, timestamp=1586248156259}]:[attributes={Lucene50StoredFieldsFormat.mode=BEST_SPEED}]
   [junit4]   2> 271793 INFO  (qtp789838357-9640) [    x:collection1 ] o.a.s.u.LoggingInfoStream [MS][qtp789838357-9640]:   no more merges pending; now return
   [junit4]   2> 271793 INFO  (qtp789838357-9640) [    x:collection1 ] o.a.s.u.LoggingInfoStream [IW][qtp789838357-9640]: nrtIsCurrent: infoVersion matches: false; DW changes: false; BD changes: false
   [junit4]   2> 271793 INFO  (qtp789838357-9640) [    x:collection1 ] o.a.s.u.LoggingInfoStream [IW][qtp789838357-9640]: flush at getReader
   [junit4]   2> 271793 INFO  (qtp789838357-9640) [    x:collection1 ] o.a.s.u.LoggingInfoStream [DW][qtp789838357-9640]: startFullFlush
   [junit4]   2> 271793 INFO  (qtp789838357-9640) [    x:collection1 ] o.a.s.u.LoggingInfoStream [IW][qtp789838357-9640]: now apply all deletes for all segments buffered updates bytesUsed=0 reader pool bytesUsed=0
   [junit4]   2> 271793 INFO  (qtp789838357-9640) [    x:collection1 ] o.a.s.u.LoggingInfoStream [BD][qtp789838357-9640]: waitApply: no deletes to apply
   [junit4]   2> 271793 INFO  (qtp789838357-9640) [    x:collection1 ] o.a.s.u.LoggingInfoStream [IW][qtp789838357-9640]: incRefDeleter for NRT reader version=6 segments=_0(8.6.0):C1:[diagnostics={os=Linux, java.vendor=Oracle Corporation, java.version=1.8.0_191, java.vm.version=25.191-b12, lucene.version=8.6.0, os.arch=amd64, java.runtime.version=1.8.0_191-b12, source=flush, os.version=4.15.0-54-generic, timestamp=1586248156259}]:[attributes={Lucene50StoredFieldsFormat.mode=BEST_SPEED}]
   [junit4]   2> 271793 INFO  (qtp789838357-9640) [    x:collection1 ] o.a.s.u.LoggingInfoStream [IW][qtp789838357-9640]: return reader version=6 reader=StandardDirectoryReader(segments_2:6:nrt _0(8.6.0):C1:[diagnostics={os=Linux, java.vendor=Oracle Corporation, java.version=1.8.0_191, java.vm.version=25.191-b12, lucene.version=8.6.0, os.arch=amd64, java.runtime.version=1.8.0_191-b12, source=flush, os.version=4.15.0-54-generic, timestamp=1586248156259}]:[attributes={Lucene50StoredFieldsFormat.mode=BEST_SPEED}])
   [junit4]   2> 271793 INFO  (qtp789838357-9640) [    x:collection1 ] o.a.s.u.LoggingInfoStream [DW][qtp789838357-9640]: qtp789838357-9640 finishFullFlush success=true
   [junit4]   2> 271793 INFO  (qtp789838357-9640) [    x:collection1 ] o.a.s.u.LoggingInfoStream [IW][qtp789838357-9640]: getReader took 0 msec
   [junit4]   2> 271793 INFO  (qtp789838357-9640) [    x:collection1 ] o.a.s.s.SolrIndexSearcher Opening [Searcher@3e66372a[collection1] main]
   [junit4]   2> 271794 INFO  (qtp789838357-9640) [    x:collection1 ] o.a.s.u.DirectUpdateHandler2 end_commit_flush
   [junit4]   2> 271794 INFO  (searcherExecutor-2035-thread-1-processing-x:collection1) [    x:collection1 ] o.a.s.c.QuerySenderListener QuerySenderListener sending requests to Searcher@3e66372a[collection1] main{ExitableDirectoryReader(UninvertingDirectoryReader(Uninverting(_0(8.6.0):C1:[diagnostics={os=Linux, java.vendor=Oracle Corporation, java.version=1.8.0_191, java.vm.version=25.191-b12, lucene.version=8.6.0, os.arch=amd64, java.runtime.version=1.8.0_191-b12, source=flush, os.version=4.15.0-54-generic, timestamp=1586248156259}]:[attributes={Lucene50StoredFieldsFormat.mode=BEST_SPEED}])))}
   [junit4]   2> 271794 INFO  (searcherExecutor-2035-thread-1-processing-x:collection1) [    x:collection1 ] o.a.s.c.QuerySenderListener QuerySenderListener done.
   [junit4]   2> 271799 INFO  (searcherExecutor-2035-thread-1-processing-x:collection1) [    x:collection1 ] o.a.s.c.SolrCore [collection1] Registered new searcher Searcher@3e66372a[collection1] main{ExitableDirectoryReader(UninvertingDirectoryReader(Uninverting(_0(8.6.0):C1:[diagnostics={os=Linux, java.vendor=Oracle Corporation, java.version=1.8.0_191, java.vm.version=25.191-b12, lucene.version=8.6.0, os.arch=amd64, java.runtime.version=1.8.0_191-b12, source=flush, os.version=4.15.0-54-generic, timestamp=1586248156259}]:[attributes={Lucene50StoredFieldsFormat.mode=BEST_SPEED}])))}
   [junit4]   2> 271799 INFO  (searcherExecutor-2035-thread-1-processing-x:collection1) [    x:collection1 ] o.a.s.u.LoggingInfoStream [IW][searcherExecutor-2035-thread-1-processing-x:collection1]: decRefDeleter for NRT reader version=2 segments=
   [junit4]   2> 271799 INFO  (qtp789838357-9640) [    x:collection1 ] o.a.s.u.p.LogUpdateProcessorFactory [collection1]  webapp=/solr path=/update params={waitSearcher=true&commit=true&softCommit=false&wt=javabin&version=2}{commit=} 0 8
   [junit4]   2> 271801 INFO  (qtp789838357-9638) [    x:collection1 ] o.a.s.c.S.Request [collection1]  webapp=/solr path=/select params={q=id:collection&wt=javabin&version=2} hits=1 status=0 QTime=0
   [junit4]   2> 271806 WARN  (TEST-Http2SolrClientTest.testCollectionParameters-seed#[C1856BF8244BA09C]) [     ] o.a.s.c.s.i.Http2SolrClient Create Http2SolrClient with HTTP/1.1 transport since Java 8 or lower versions does not support SSL + HTTP/2
   [junit4]   2> 271806 WARN  (TEST-Http2SolrClientTest.testCollectionParameters-seed#[C1856BF8244BA09C]) [     ] o.e.j.u.s.S.config Trusting all certificates configured for Client@205ec8a7[provider=null,keyStore=null,trustStore=null]
   [junit4]   2> 271806 WARN  (TEST-Http2SolrClientTest.testCollectionParameters-seed#[C1856BF8244BA09C]) [     ] o.e.j.u.s.S.config No Client EndPointIdentificationAlgorithm configured for Client@205ec8a7[provider=null,keyStore=null,trustStore=null]
   [junit4]   2> 271847 INFO  (qtp789838357-9642) [    x:collection1 ] o.a.s.c.S.Request [collection1]  webapp=/solr path=/select params={q=id:collection&wt=javabin&version=2} hits=1 status=0 QTime=0
   [junit4]   2> 271848 INFO  (TEST-Http2SolrClientTest.testCollectionParameters-seed#[C1856BF8244BA09C]) [     ] o.a.s.SolrTestCaseJ4 ###Ending testCollectionParameters
   [junit4]   2> 271852 INFO  (TEST-Http2SolrClientTest.testRedirect-seed#[C1856BF8244BA09C]) [     ] o.a.s.SolrTestCaseJ4 ###Starting testRedirect
   [junit4]   2> 271853 WARN  (TEST-Http2SolrClientTest.testRedirect-seed#[C1856BF8244BA09C]) [     ] o.a.s.c.s.i.Http2SolrClient Create Http2SolrClient with HTTP/1.1 transport since Java 8 or lower versions does not support SSL + HTTP/2
   [junit4]   2> 271853 WARN  (TEST-Http2SolrClientTest.testRedirect-seed#[C1856BF8244BA09C]) [     ] o.e.j.u.s.S.config Trusting all certificates configured for Client@679ff3bb[provider=null,keyStore=null,trustStore=null]
   [junit4]   2> 271853 WARN  (TEST-Http2SolrClientTest.testRedirect-seed#[C1856BF8244BA09C]) [     ] o.e.j.u.s.S.config No Client EndPointIdentificationAlgorithm configured for Client@679ff3bb[provider=null,keyStore=null,trustStore=null]
   [junit4]   2> 271890 INFO  (qtp789838357-9642) [    x:collection1 ] o.a.s.c.S.Request [collection1]  webapp=/solr path=/select params={q=*:*&wt=javabin&version=2} hits=1 status=0 QTime=0
   [junit4]   2> 271899 ERROR (h2sc-3518-thread-13) [     ] o.a.s.c.u.ExecutorUtil Uncaught exception java.util.concurrent.RejectedExecutionException: Task java.util.concurrent.ScheduledThreadPoolExecutor$ScheduledFutureTask@67df25d9 rejected from java.util.concurrent.ScheduledThreadPoolExecutor@6918d752[Shutting down, pool size = 1, active threads = 0, queued tasks = 0, completed tasks = 0] thrown by thread: h2sc-3518-thread-13
   [junit4]   2>           => java.lang.Exception: Submitter stack trace
   [junit4]   2> 	at org.apache.solr.common.util.ExecutorUtil$MDCAwareThreadPoolExecutor.execute(ExecutorUtil.java:185)
   [junit4]   2> java.lang.Exception: Submitter stack trace
   [junit4]   2> 	at org.apache.solr.common.util.ExecutorUtil$MDCAwareThreadPoolExecutor.execute(ExecutorUtil.java:185) ~[java/:?]
   [junit4]   2> 	at org.eclipse.jetty.util.SocketAddressResolver$Async.resolve(SocketAddressResolver.java:150) ~[jetty-util-9.4.27.v20200227.jar:9.4.27.v20200227]
   [junit4]   2> 	at org.eclipse.jetty.client.HttpClient.newConnection(HttpClient.java:589) ~[jetty-client-9.4.27.v20200227.jar:9.4.27.v20200227]
   [junit4]   2> 	at org.eclipse.jetty.client.HttpDestination.createConnection(HttpDestination.java:394) ~[jetty-client-9.4.27.v20200227.jar:9.4.27.v20200227]
   [junit4]   2> 	at org.eclipse.jetty.client.HttpDestination.newConnection(HttpDestination.java:389) ~[jetty-client-9.4.27.v20200227.jar:9.4.27.v20200227]
   [junit4]   2> 	at org.eclipse.jetty.client.AbstractConnectionPool.tryCreate(AbstractConnectionPool.java:133) ~[jetty-client-9.4.27.v20200227.jar:9.4.27.v20200227]
   [junit4]   2> 	at org.eclipse.jetty.client.AbstractConnectionPool.acquire(AbstractConnectionPool.java:105) ~[jetty-client-9.4.27.v20200227.jar:9.4.27.v20200227]
   [junit4]   2> 	at org.eclipse.jetty.client.HttpDestination.process(HttpDestination.java:320) ~[jetty-client-9.4.27.v20200227.jar:9.4.27.v20200227]
   [junit4]   2> 	at org.eclipse.jetty.client.HttpDestination.send(HttpDestination.java:313) ~[jetty-client-9.4.27.v20200227.jar:9.4.27.v20200227]
   [junit4]   2> 	at org.eclipse.jetty.client.HttpDestination.send(HttpDestination.java:288) ~[jetty-client-9.4.27.v20200227.jar:9.4.27.v20200227]
   [junit4]   2> 	at org.eclipse.jetty.client.HttpDestination.send(HttpDestination.java:265) ~[jetty-client-9.4.27.v20200227.jar:9.4.27.v20200227]
   [junit4]   2> 	at org.eclipse.jetty.client.HttpClient.send(HttpClient.java:583) ~[jetty-client-9.4.27.v20200227.jar:9.4.27.v20200227]
   [junit4]   2> 	at org.eclipse.jetty.client.HttpRequest.send(HttpRequest.java:756) ~[jetty-client-9.4.27.v20200227.jar:9.4.27.v20200227]
   [junit4]   2> 	at org.eclipse.jetty.client.HttpRequest.send(HttpRequest.java:748) ~[jetty-client-9.4.27.v20200227.jar:9.4.27.v20200227]
   [junit4]   2> 	at org.apache.solr.client.solrj.impl.Http2SolrClient.request(Http2SolrClient.java:397) ~[java/:?]
   [junit4]   2> 	at org.apache.solr.client.solrj.impl.Http2SolrClient.request(Http2SolrClient.java:753) ~[java/:?]
   [junit4]   2> 	at org.apache.solr.client.solrj.SolrRequest.process(SolrRequest.java:211) ~[java/:?]
   [junit4]   2> 	at org.apache.solr.client.solrj.SolrClient.query(SolrClient.java:1003) ~[java/:?]
   [junit4]   2> 	at org.apache.solr.client.solrj.SolrClient.query(SolrClient.java:1018) ~[java/:?]
   [junit4]   2> 	at org.apache.solr.client.solrj.impl.Http2SolrClientTest.testRedirect(Http2SolrClientTest.java:484) ~[test/:?]
   [junit4]   2> 	at sun.reflect.NativeMethodAccessorImpl.invoke0(Native Method) ~[?:1.8.0_191]
   [junit4]   2> 	at sun.reflect.NativeMethodAccessorImpl.invoke(NativeMethodAccessorImpl.java:62) ~[?:1.8.0_191]
   [junit4]   2> 	at sun.reflect.DelegatingMethodAccessorImpl.invoke(DelegatingMethodAccessorImpl.java:43) ~[?:1.8.0_191]
   [junit4]   2> 	at java.lang.reflect.Method.invoke(Method.java:498) ~[?:1.8.0_191]
   [junit4]   2> 	at com.carrotsearch.randomizedtesting.RandomizedRunner.invoke(RandomizedRunner.java:1750) ~[randomizedtesting-runner-2.7.2.jar:?]
   [junit4]   2> 	at com.carrotsearch.randomizedtesting.RandomizedRunner$8.evaluate(RandomizedRunner.java:938) ~[randomizedtesting-runner-2.7.2.jar:?]
   [junit4]   2> 	at com.carrotsearch.randomizedtesting.RandomizedRunner$9.evaluate(RandomizedRunner.java:974) ~[randomizedtesting-runner-2.7.2.jar:?]
   [junit4]   2> 	at com.carrotsearch.randomizedtesting.RandomizedRunner$10.evaluate(RandomizedRunner.java:988) ~[randomizedtesting-runner-2.7.2.jar:?]
   [junit4]   2> 	at com.carrotsearch.randomizedtesting.rules.SystemPropertiesRestoreRule$1.evaluate(SystemPropertiesRestoreRule.java:57) ~[randomizedtesting-runner-2.7.2.jar:?]
   [junit4]   2> 	at org.apache.lucene.util.TestRuleSetupTeardownChained$1.evaluate(TestRuleSetupTeardownChained.java:49) ~[java/:?]
   [junit4]   2> 	at org.apache.lucene.util.AbstractBeforeAfterRule$1.evaluate(AbstractBeforeAfterRule.java:45) ~[java/:?]
   [junit4]   2> 	at org.apache.lucene.util.TestRuleThreadAndTestName$1.evaluate(TestRuleThreadAndTestName.java:48) ~[java/:?]
   [junit4]   2> 	at org.apache.lucene.util.TestRuleIgnoreAfterMaxFailures$1.evaluate(TestRuleIgnoreAfterMaxFailures.java:64) ~[java/:?]
   [junit4]   2> 	at org.apache.lucene.util.TestRuleMarkFailure$1.evaluate(TestRuleMarkFailure.java:47) ~[java/:?]
   [junit4]   2> 	at com.carrotsearch.randomizedtesting.rules.StatementAdapter.evaluate(StatementAdapter.java:36) ~[randomizedtesting-runner-2.7.2.jar:?]
   [junit4]   2> 	at com.carrotsearch.randomizedtesting.ThreadLeakControl$StatementRunner.run(ThreadLeakControl.java:368) ~[randomizedtesting-runner-2.7.2.jar:?]
   [junit4]   2> 	at com.carrotsearch.randomizedtesting.ThreadLeakControl.forkTimeoutingTask(ThreadLeakControl.java:817) ~[randomizedtesting-runner-2.7.2.jar:?]
   [junit4]   2> 	at com.carrotsearch.randomizedtesting.ThreadLeakControl$3.evaluate(ThreadLeakControl.java:468) ~[randomizedtesting-runner-2.7.2.jar:?]
   [junit4]   2> 	at com.carrotsearch.randomizedtesting.RandomizedRunner.runSingleTest(RandomizedRunner.java:947) ~[randomizedtesting-runner-2.7.2.jar:?]
   [junit4]   2> 	at com.carrotsearch.randomizedtesting.RandomizedRunner$5.evaluate(RandomizedRunner.java:832) ~[randomizedtesting-runner-2.7.2.jar:?]
   [junit4]   2> 	at com.carrotsearch.randomizedtesting.RandomizedRunner$6.evaluate(RandomizedRunner.java:883) ~[randomizedtesting-runner-2.7.2.jar:?]
   [junit4]   2> 	at com.carrotsearch.randomizedtesting.RandomizedRunner$7.evaluate(RandomizedRunner.java:894) ~[randomizedtesting-runner-2.7.2.jar:?]
   [junit4]   2> 	at com.carrotsearch.randomizedtesting.rules.StatementAdapter.evaluate(StatementAdapter.java:36) ~[randomizedtesting-runner-2.7.2.jar:?]
   [junit4]   2> 	at com.carrotsearch.randomizedtesting.rules.SystemPropertiesRestoreRule$1.evaluate(SystemPropertiesRestoreRule.java:57) ~[randomizedtesting-runner-2.7.2.jar:?]
   [junit4]   2> 	at org.apache.lucene.util.AbstractBeforeAfterRule$1.evaluate(AbstractBeforeAfterRule.java:45) ~[java/:?]
   [junit4]   2> 	at com.carrotsearch.randomizedtesting.rules.StatementAdapter.evaluate(StatementAdapter.java:36) ~[randomizedtesting-runner-2.7.2.jar:?]
   [junit4]   2> 	at org.apache.lucene.util.TestRuleStoreClassName$1.evaluate(TestRuleStoreClassName.java:41) ~[java/:?]
   [junit4]   2> 	at com.carrotsearch.randomizedtesting.rules.NoShadowingOrOverridesOnMethodsRule$1.evaluate(NoShadowingOrOverridesOnMethodsRule.java:40) ~[randomizedtesting-runner-2.7.2.jar:?]
   [junit4]   2> 	at com.carrotsearch.randomizedtesting.rules.NoShadowingOrOverridesOnMethodsRule$1.evaluate(NoShadowingOrOverridesOnMethodsRule.java:40) ~[randomizedtesting-runner-2.7.2.jar:?]
   [junit4]   2> 	at com.carrotsearch.randomizedtesting.rules.StatementAdapter.evaluate(StatementAdapter.java:36) ~[randomizedtesting-runner-2.7.2.jar:?]
   [junit4]   2> 	at com.carrotsearch.randomizedtesting.rules.StatementAdapter.evaluate(StatementAdapter.java:36) ~[randomizedtesting-runner-2.7.2.jar:?]
   [junit4]   2> 	at com.carrotsearch.randomizedtesting.rules.StatementAdapter.evaluate(StatementAdapter.java:36) ~[randomizedtesting-runner-2.7.2.jar:?]
   [junit4]   2> 	at org.apache.lucene.util.TestRuleAssertionsRequired$1.evaluate(TestRuleAssertionsRequired.java:53) ~[java/:?]
   [junit4]   2> 	at org.apache.lucene.util.TestRuleMarkFailure$1.evaluate(TestRuleMarkFailure.java:47) ~[java/:?]
   [junit4]   2> 	at org.apache.lucene.util.TestRuleIgnoreAfterMaxFailures$1.evaluate(TestRuleIgnoreAfterMaxFailures.java:64) ~[java/:?]
   [junit4]   2> 	at org.apache.lucene.util.TestRuleIgnoreTestSuites$1.evaluate(TestRuleIgnoreTestSuites.java:54) ~[java/:?]
   [junit4]   2> 	at com.carrotsearch.randomizedtesting.rules.StatementAdapter.evaluate(StatementAdapter.java:36) ~[randomizedtesting-runner-2.7.2.jar:?]
   [junit4]   2> 	at com.carrotsearch.randomizedtesting.ThreadLeakControl$StatementRunner.run(ThreadLeakControl.java:368) ~[randomizedtesting-runner-2.7.2.jar:?]
   [junit4]   2> 	at java.lang.Thread.run(Thread.java:748) [?:1.8.0_191]
   [junit4]   2> 271902 INFO  (TEST-Http2SolrClientTest.testRedirect-seed#[C1856BF8244BA09C]) [     ] o.a.s.SolrTestCaseJ4 ###Ending testRedirect
   [junit4]   2> 4月 07, 2020 4:29:16 上午 com.carrotsearch.randomizedtesting.RandomizedRunner$QueueUncaughtExceptionsHandler uncaughtException
   [junit4]   2> 警告: Uncaught exception in thread: Thread[h2sc-3518-thread-13,5,TGRP-Http2SolrClientTest]
   [junit4]   2> java.util.concurrent.RejectedExecutionException: Task java.util.concurrent.ScheduledThreadPoolExecutor$ScheduledFutureTask@67df25d9 rejected from java.util.concurrent.ScheduledThreadPoolExecutor@6918d752[Shutting down, pool size = 1, active threads = 0, queued tasks = 0, completed tasks = 0]
   [junit4]   2> 	at __randomizedtesting.SeedInfo.seed([C1856BF8244BA09C]:0)
   [junit4]   2> 	at java.util.concurrent.ThreadPoolExecutor$AbortPolicy.rejectedExecution(ThreadPoolExecutor.java:2063)
   [junit4]   2> 	at java.util.concurrent.ThreadPoolExecutor.reject(ThreadPoolExecutor.java:830)
   [junit4]   2> 	at java.util.concurrent.ScheduledThreadPoolExecutor.delayedExecute(ScheduledThreadPoolExecutor.java:326)
   [junit4]   2> 	at java.util.concurrent.ScheduledThreadPoolExecutor.schedule(ScheduledThreadPoolExecutor.java:533)
   [junit4]   2> 	at org.eclipse.jetty.util.thread.ScheduledExecutorScheduler.schedule(ScheduledExecutorScheduler.java:122)
   [junit4]   2> 	at org.eclipse.jetty.util.SocketAddressResolver$Async.lambda$resolve$1(SocketAddressResolver.java:157)
   [junit4]   2> 	at org.apache.solr.common.util.ExecutorUtil$MDCAwareThreadPoolExecutor.lambda$execute$0(ExecutorUtil.java:210)
   [junit4]   2> 	at java.util.concurrent.ThreadPoolExecutor.runWorker(ThreadPoolExecutor.java:1149)
   [junit4]   2> 	at java.util.concurrent.ThreadPoolExecutor$Worker.run(ThreadPoolExecutor.java:624)
   [junit4]   2> 	at java.lang.Thread.run(Thread.java:748)
   [junit4]   2> 
   [junit4]   2> NOTE: reproduce with: ant test  -Dtestcase=Http2SolrClientTest -Dtests.method=testRedirect -Dtests.seed=C1856BF8244BA09C -Dtests.multiplier=2 -Dtests.slow=true -Dtests.badapples=true -Dtests.locale=zh-HK -Dtests.timezone=America/Indiana/Vincennes -Dtests.asserts=true -Dtests.file.encoding=UTF-8
   [junit4] ERROR   0.06s J0 | Http2SolrClientTest.testRedirect <<<
   [junit4]    > Throwable #1: com.carrotsearch.randomizedtesting.UncaughtExceptionError: Captured an uncaught exception in thread: Thread[id=9816, name=h2sc-3518-thread-13, state=RUNNABLE, group=TGRP-Http2SolrClientTest]
   [junit4]    > 	at __randomizedtesting.SeedInfo.seed([C1856BF8244BA09C:51182AC5F06F5BC3]:0)
   [junit4]    > Caused by: java.util.concurrent.RejectedExecutionException: Task java.util.concurrent.ScheduledThreadPoolExecutor$ScheduledFutureTask@67df25d9 rejected from java.util.concurrent.ScheduledThreadPoolExecutor@6918d752[Shutting down, pool size = 1, active threads = 0, queued tasks = 0, completed tasks = 0]
   [junit4]    > 	at __randomizedtesting.SeedInfo.seed([C1856BF8244BA09C]:0)
   [junit4]    > 	at java.util.concurrent.ThreadPoolExecutor$AbortPolicy.rejectedExecution(ThreadPoolExecutor.java:2063)
   [junit4]    > 	at java.util.concurrent.ThreadPoolExecutor.reject(ThreadPoolExecutor.java:830)
   [junit4]    > 	at java.util.concurrent.ScheduledThreadPoolExecutor.delayedExecute(ScheduledThreadPoolExecutor.java:326)
   [junit4]    > 	at java.util.concurrent.ScheduledThreadPoolExecutor.schedule(ScheduledThreadPoolExecutor.java:533)
   [junit4]    > 	at org.eclipse.jetty.util.thread.ScheduledExecutorScheduler.schedule(ScheduledExecutorScheduler.java:122)
   [junit4]    > 	at org.eclipse.jetty.util.SocketAddressResolver$Async.lambda$resolve$1(SocketAddressResolver.java:157)
   [junit4]    > 	at org.apache.solr.common.util.ExecutorUtil$MDCAwareThreadPoolExecutor.lambda$execute$0(ExecutorUtil.java:210)
   [junit4]    > 	at java.util.concurrent.ThreadPoolExecutor.runWorker(ThreadPoolExecutor.java:1149)
   [junit4]    > 	at java.util.concurrent.ThreadPoolExecutor$Worker.run(ThreadPoolExecutor.java:624)
   [junit4]    > 	at java.lang.Thread.run(Thread.java:748)
   [junit4]   2> 271907 INFO  (SUITE-Http2SolrClientTest-seed#[C1856BF8244BA09C]-worker) [     ] o.a.s.c.CoreContainer Shutting down CoreContainer instance=1021563119
   [junit4]   2> 271907 INFO  (coreCloseExecutor-2040-thread-1) [     ] o.a.s.c.SolrCore [collection1]  CLOSING SolrCore org.apache.solr.core.SolrCore@d4764af
   [junit4]   2> 271907 INFO  (coreCloseExecutor-2040-thread-1) [     ] o.a.s.m.SolrMetricManager Closing metric reporters for registry=solr.core.collection1, tag=SolrCore@d4764af
   [junit4]   2> 271907 INFO  (coreCloseExecutor-2040-thread-1) [     ] o.a.s.m.r.SolrJmxReporter Closing reporter [org.apache.solr.metrics.reporters.SolrJmxReporter@57503126: rootName = null, domain = solr.core.collection1, service url = null, agent id = null] for registry solr.core.collection1 / com.codahale.metrics.MetricRegistry@75683b40
   [junit4]   2> 271922 INFO  (coreCloseExecutor-2040-thread-1) [     ] o.a.s.u.DirectUpdateHandler2 Committing on IndexWriter.close()  ... SKIPPED (unnecessary).
   [junit4]   2> 271922 INFO  (coreCloseExecutor-2040-thread-1) [     ] o.a.s.u.LoggingInfoStream [IW][coreCloseExecutor-2040-thread-1]: now flush at close
   [junit4]   2> 271922 INFO  (coreCloseExecutor-2040-thread-1) [     ] o.a.s.u.LoggingInfoStream [IW][coreCloseExecutor-2040-thread-1]:   start flush: applyAllDeletes=true
   [junit4]   2> 271922 INFO  (coreCloseExecutor-2040-thread-1) [     ] o.a.s.u.LoggingInfoStream [IW][coreCloseExecutor-2040-thread-1]:   index before flush _0(8.6.0):C1:[diagnostics={os=Linux, java.vendor=Oracle Corporation, java.version=1.8.0_191, java.vm.version=25.191-b12, lucene.version=8.6.0, os.arch=amd64, java.runtime.version=1.8.0_191-b12, source=flush, os.version=4.15.0-54-generic, timestamp=1586248156259}]:[attributes={Lucene50StoredFieldsFormat.mode=BEST_SPEED}]
   [junit4]   2> 271922 INFO  (coreCloseExecutor-2040-thread-1) [     ] o.a.s.u.LoggingInfoStream [DW][coreCloseExecutor-2040-thread-1]: startFullFlush
   [junit4]   2> 271922 INFO  (coreCloseExecutor-2040-thread-1) [     ] o.a.s.u.LoggingInfoStream [DW][coreCloseExecutor-2040-thread-1]: coreCloseExecutor-2040-thread-1 finishFullFlush success=true
   [junit4]   2> 271922 INFO  (coreCloseExecutor-2040-thread-1) [     ] o.a.s.u.LoggingInfoStream [IW][coreCloseExecutor-2040-thread-1]: now apply all deletes for all segments buffered updates bytesUsed=0 reader pool bytesUsed=0
   [junit4]   2> 271922 INFO  (coreCloseExecutor-2040-thread-1) [     ] o.a.s.u.LoggingInfoStream [BD][coreCloseExecutor-2040-thread-1]: waitApply: no deletes to apply
   [junit4]   2> 271922 INFO  (coreCloseExecutor-2040-thread-1) [     ] o.a.s.u.LoggingInfoStream [MS][coreCloseExecutor-2040-thread-1]: updateMergeThreads ioThrottle=true targetMBPerSec=10240.0 MB/sec
   [junit4]   2> 271922 INFO  (coreCloseExecutor-2040-thread-1) [     ] o.a.s.u.LoggingInfoStream [MS][coreCloseExecutor-2040-thread-1]: now merge
   [junit4]   2> 271923 INFO  (coreCloseExecutor-2040-thread-1) [     ] o.a.s.u.LoggingInfoStream [MS][coreCloseExecutor-2040-thread-1]:   index: _0(8.6.0):C1:[diagnostics={os=Linux, java.vendor=Oracle Corporation, java.version=1.8.0_191, java.vm.version=25.191-b12, lucene.version=8.6.0, os.arch=amd64, java.runtime.version=1.8.0_191-b12, source=flush, os.version=4.15.0-54-generic, timestamp=1586248156259}]:[attributes={Lucene50StoredFieldsFormat.mode=BEST_SPEED}]
   [junit4]   2> 271923 INFO  (coreCloseExecutor-2040-thread-1) [     ] o.a.s.u.LoggingInfoStream [MS][coreCloseExecutor-2040-thread-1]:   no more merges pending; now return
   [junit4]   2> 271923 INFO  (coreCloseExecutor-2040-thread-1) [     ] o.a.s.u.LoggingInfoStream [IW][coreCloseExecutor-2040-thread-1]: waitForMerges
   [junit4]   2> 271923 INFO  (coreCloseExecutor-2040-thread-1) [     ] o.a.s.u.LoggingInfoStream [IW][coreCloseExecutor-2040-thread-1]: waitForMerges done
   [junit4]   2> 271923 INFO  (coreCloseExecutor-2040-thread-1) [     ] o.a.s.u.LoggingInfoStream [IW][coreCloseExecutor-2040-thread-1]: commit: start
   [junit4]   2> 271923 INFO  (coreCloseExecutor-2040-thread-1) [     ] o.a.s.u.LoggingInfoStream [IW][coreCloseExecutor-2040-thread-1]: commit: enter lock
   [junit4]   2> 271923 INFO  (coreCloseExecutor-2040-thread-1) [     ] o.a.s.u.LoggingInfoStream [IW][coreCloseExecutor-2040-thread-1]: commit: now prepare
   [junit4]   2> 271923 INFO  (coreCloseExecutor-2040-thread-1) [     ] o.a.s.u.LoggingInfoStream [IW][coreCloseExecutor-2040-thread-1]: prepareCommit: flush
   [junit4]   2> 271923 INFO  (coreCloseExecutor-2040-thread-1) [     ] o.a.s.u.LoggingInfoStream [IW][coreCloseExecutor-2040-thread-1]:   index before flush _0(8.6.0):C1:[diagnostics={os=Linux, java.vendor=Oracle Corporation, java.version=1.8.0_191, java.vm.version=25.191-b12, lucene.version=8.6.0, os.arch=amd64, java.runtime.version=1.8.0_191-b12, source=flush, os.version=4.15.0-54-generic, timestamp=1586248156259}]:[attributes={Lucene50StoredFieldsFormat.mode=BEST_SPEED}]
   [junit4]   2> 271923 INFO  (coreCloseExecutor-2040-thread-1) [     ] o.a.s.u.LoggingInfoStream [DW][coreCloseExecutor-2040-thread-1]: startFullFlush
   [junit4]   2> 271923 INFO  (coreCloseExecutor-2040-thread-1) [     ] o.a.s.u.LoggingInfoStream [IW][coreCloseExecutor-2040-thread-1]: now apply all deletes for all segments buffered updates bytesUsed=0 reader pool bytesUsed=0
   [junit4]   2> 271923 INFO  (coreCloseExecutor-2040-thread-1) [     ] o.a.s.u.LoggingInfoStream [BD][coreCloseExecutor-2040-thread-1]: waitApply: no deletes to apply
   [junit4]   2> 271923 INFO  (coreCloseExecutor-2040-thread-1) [     ] o.a.s.u.LoggingInfoStream [DW][coreCloseExecutor-2040-thread-1]: coreCloseExecutor-2040-thread-1 finishFullFlush success=true
   [junit4]   2> 271923 INFO  (coreCloseExecutor-2040-thread-1) [     ] o.a.s.u.LoggingInfoStream [IW][coreCloseExecutor-2040-thread-1]: startCommit(): start
   [junit4]   2> 271923 INFO  (coreCloseExecutor-2040-thread-1) [     ] o.a.s.u.LoggingInfoStream [IW][coreCloseExecutor-2040-thread-1]:   skip startCommit(): no changes pending
   [junit4]   2> 271923 INFO  (coreCloseExecutor-2040-thread-1) [     ] o.a.s.u.LoggingInfoStream [IW][coreCloseExecutor-2040-thread-1]: commit: pendingCommit == null; skip
   [junit4]   2> 271923 INFO  (coreCloseExecutor-2040-thread-1) [     ] o.a.s.u.LoggingInfoStream [IW][coreCloseExecutor-2040-thread-1]: commit: took 0.1 msec
   [junit4]   2> 271923 INFO  (coreCloseExecutor-2040-thread-1) [     ] o.a.s.u.LoggingInfoStream [IW][coreCloseExecutor-2040-thread-1]: commit: done
   [junit4]   2> 271923 INFO  (coreCloseExecutor-2040-thread-1) [     ] o.a.s.u.LoggingInfoStream [IW][coreCloseExecutor-2040-thread-1]: rollback
   [junit4]   2> 271923 INFO  (coreCloseExecutor-2040-thread-1) [     ] o.a.s.u.LoggingInfoStream [IW][coreCloseExecutor-2040-thread-1]: all running merges have aborted
   [junit4]   2> 271923 INFO  (coreCloseExecutor-2040-thread-1) [     ] o.a.s.u.LoggingInfoStream [IW][coreCloseExecutor-2040-thread-1]: rollback: done finish merges
   [junit4]   2> 271923 INFO  (coreCloseExecutor-2040-thread-1) [     ] o.a.s.u.LoggingInfoStream [DW][coreCloseExecutor-2040-thread-1]: abort
   [junit4]   2> 271923 INFO  (coreCloseExecutor-2040-thread-1) [     ] o.a.s.u.LoggingInfoStream [DW][coreCloseExecutor-2040-thread-1]: done abort success=true
   [junit4]   2> 271923 INFO  (coreCloseExecutor-2040-thread-1) [     ] o.a.s.u.LoggingInfoStream [IW][coreCloseExecutor-2040-thread-1]: rollback: infos=_0(8.6.0):C1:[diagnostics={os=Linux, java.vendor=Oracle Corporation, java.version=1.8.0_191, java.vm.version=25.191-b12, lucene.version=8.6.0, os.arch=amd64, java.runtime.version=1.8.0_191-b12, source=flush, os.version=4.15.0-54-generic, timestamp=1586248156259}]:[attributes={Lucene50StoredFieldsFormat.mode=BEST_SPEED}]
   [junit4]   2> 271923 INFO  (coreCloseExecutor-2040-thread-1) [     ] o.a.s.u.LoggingInfoStream [IFD][coreCloseExecutor-2040-thread-1]: now checkpoint "_0(8.6.0):C1:[diagnostics={os=Linux, java.vendor=Oracle Corporation, java.version=1.8.0_191, java.vm.version=25.191-b12, lucene.version=8.6.0, os.arch=amd64, java.runtime.version=1.8.0_191-b12, source=flush, os.version=4.15.0-54-generic, timestamp=1586248156259}]:[attributes={Lucene50StoredFieldsFormat.mode=BEST_SPEED}]" [1 segments ; isCommit = false]
   [junit4]   2> 271923 INFO  (coreCloseExecutor-2040-thread-1) [     ] o.a.s.u.LoggingInfoStream [IFD][coreCloseExecutor-2040-thread-1]: 0 msec to checkpoint
   [junit4]   2> 271924 INFO  (SUITE-Http2SolrClientTest-seed#[C1856BF8244BA09C]-worker) [     ] o.a.s.m.SolrMetricManager Closing metric reporters for registry=solr.node, tag=null
   [junit4]   2> 271924 INFO  (SUITE-Http2SolrClientTest-seed#[C1856BF8244BA09C]-worker) [     ] o.a.s.m.r.SolrJmxReporter Closing reporter [org.apache.solr.metrics.reporters.SolrJmxReporter@61f02d25: rootName = null, domain = solr.node, service url = null, agent id = null] for registry solr.node / com.codahale.metrics.MetricRegistry@26aa87cf
   [junit4]   2> 271929 INFO  (SUITE-Http2SolrClientTest-seed#[C1856BF8244BA09C]-worker) [     ] o.a.s.m.SolrMetricManager Closing metric reporters for registry=solr.jvm, tag=null
   [junit4]   2> 271929 INFO  (SUITE-Http2SolrClientTest-seed#[C1856BF8244BA09C]-worker) [     ] o.a.s.m.r.SolrJmxReporter Closing reporter [org.apache.solr.metrics.reporters.SolrJmxReporter@3e255842: rootName = null, domain = solr.jvm, service url = null, agent id = null] for registry solr.jvm / com.codahale.metrics.MetricRegistry@f5fda98
   [junit4]   2> 271931 INFO  (SUITE-Http2SolrClientTest-seed#[C1856BF8244BA09C]-worker) [     ] o.a.s.m.SolrMetricManager Closing metric reporters for registry=solr.jetty, tag=null
   [junit4]   2> 271931 INFO  (SUITE-Http2SolrClientTest-seed#[C1856BF8244BA09C]-worker) [     ] o.a.s.m.r.SolrJmxReporter Closing reporter [org.apache.solr.metrics.reporters.SolrJmxReporter@2891addc: rootName = null, domain = solr.jetty, service url = null, agent id = null] for registry solr.jetty / com.codahale.metrics.MetricRegistry@7ef5d51d
   [junit4]   2> 271933 INFO  (SUITE-Http2SolrClientTest-seed#[C1856BF8244BA09C]-worker) [     ] o.e.j.s.AbstractConnector Stopped ServerConnector@ff9b85c{SSL, (ssl, http/1.1)}{127.0.0.1:0}
   [junit4]   2> 271933 INFO  (SUITE-Http2SolrClientTest-seed#[C1856BF8244BA09C]-worker) [     ] o.e.j.s.h.ContextHandler Stopped o.e.j.s.ServletContextHandler@45e22871{/solr,null,UNAVAILABLE}
   [junit4]   2> 271933 INFO  (SUITE-Http2SolrClientTest-seed#[C1856BF8244BA09C]-worker) [     ] o.e.j.s.session node0 Stopped scavenging
   [junit4]   2> 274586 INFO  (SUITE-Http2SolrClientTest-seed#[C1856BF8244BA09C]-worker) [     ] o.a.s.SolrTestCaseJ4 ------------------------------------------------------- Done waiting for tracked resources to be released
   [junit4]   2> NOTE: test params are: codec=CheapBastard, sim=Asserting(org.apache.lucene.search.similarities.AssertingSimilarity@7e3a4c57), locale=zh-HK, timezone=America/Indiana/Vincennes
   [junit4]   2> NOTE: Linux 4.15.0-54-generic amd64/Oracle Corporation 1.8.0_191 (64-bit)/cpus=4,threads=1,free=206896408,total=523763712
   [junit4]   2> NOTE: All tests run in this JVM: [ReverseEvaluatorTest, TermsResponseTest, HeatmapFacetMapTest, AscEvaluatorTest, LargeVolumeBinaryJettyTest, SolrParamTest, TestFastWriter, GraphExpressionTest, CloudSolrClientCacheTest, CubedRootEvaluatorTest, NaturalLogEvaluatorTest, MoveReplicaSuggesterTest, MathExpressionTest, NestableJsonFacetTest, SolrExceptionTest, CloudHttp2SolrClientTest, SolrZkClientTest, OperationsTest, StreamExpressionTest, LBHttpSolrClientBadInputTest, TestRetryUtil, ReplicaListTransformerTest, AndEvaluatorTest, CloudHttp2SolrClientBuilderTest, ConcurrentUpdateHttp2SolrClientTest, DocumentAnalysisResponseTest, RawValueEvaluatorTest, ArcSineEvaluatorTest, TestBatchUpdate, CloudSolrClientTest, Http2SolrClientTest]
   [junit4] Completed [178/208 (1!)] on J0 in 6.26s, 11 tests, 1 error <<< FAILURES!

[...truncated 51516 lines...]