You are viewing a plain text version of this content. The canonical link for it is here.
Posted to dev@directory.apache.org by Felix Knecht <fe...@apache.org> on 2008/08/29 08:53:49 UTC

Re: [continuum] BUILD FAILURE: Apache Directory Studio - Apache Directory Studio - Build Def: Build and deployment of studio snapshot distributions

Could it be that there are still some commits get lost?

Regards Felix

PS:
I've the same problems locally


Continuum VMBuild Server schrieb:
> Online report :
> http://vm094.oxylos.org/continuum/buildResult.action?buildId=1887&projectId=23
>
>
<snip />

> [INFO]
> ------------------------------------------------------------------------
> [INFO] [clean:clean]
> [INFO] Deleting directory
> /home/continuum/continuum-1.1/apps/continuum/webapp/WEB-INF/working-directory/23/studio-dsml-parser/target
>
> [INFO] [remote-resources:process {execution: default}]
> [INFO] [resources:resources]
> [INFO] Using default encoding to copy filtered resources.
> [INFO] [compiler:compile]
> [INFO] Compiling 49 source files to
> /home/continuum/continuum-1.1/apps/continuum/webapp/WEB-INF/working-directory/23/studio-dsml-parser/target/classes
>
> [INFO]
> ------------------------------------------------------------------------
> [ERROR] BUILD FAILURE
> [INFO]
> ------------------------------------------------------------------------
> [INFO] Compilation failure
>
> /home/continuum/continuum-1.1/apps/continuum/webapp/WEB-INF/working-directory/23/studio-dsml-parser/src/main/java/org/apache/directory/studio/dsmlv2/request/AddRequestDsml.java:[90,39]
> cannot find symbol
> symbol  : method getAttributes()
> location: class org.apache.directory.shared.ldap.codec.add.AddRequest
>
> /home/continuum/continuum-1.1/apps/continuum/webapp/WEB-INF/working-directory/23/studio-dsml-parser/src/main/java/org/apache/directory/studio/dsmlv2/request/AddRequestDsml.java:[142,35]
> cannot find symbol
> symbol  : method initAttributes()
> location: class org.apache.directory.shared.ldap.codec.add.AddRequest
>
> /home/continuum/continuum-1.1/apps/continuum/webapp/WEB-INF/working-directory/23/studio-dsml-parser/src/main/java/org/apache/directory/studio/dsmlv2/request/AddRequestDsml.java:[153,42]
> cannot find symbol
> symbol  : method getAttributes()
> location: class org.apache.directory.shared.ldap.codec.add.AddRequest
>
> /home/continuum/continuum-1.1/apps/continuum/webapp/WEB-INF/working-directory/23/studio-dsml-parser/src/main/java/org/apache/directory/studio/dsmlv2/request/AddRequestDsml.java:[186,51]
> incompatible types
> found   : org.apache.directory.shared.ldap.entry.Entry
> required: org.apache.directory.shared.ldap.name.LdapDN
>
> /home/continuum/continuum-1.1/apps/continuum/webapp/WEB-INF/working-directory/23/studio-dsml-parser/src/main/java/org/apache/directory/studio/dsmlv2/request/AddRequestDsml.java:[197,35]
> cannot find symbol
> symbol  : method setEntry(org.apache.directory.shared.ldap.name.LdapDN)
> location: class org.apache.directory.shared.ldap.codec.add.AddRequest
>
> /home/continuum/continuum-1.1/apps/continuum/webapp/WEB-INF/working-directory/23/studio-dsml-parser/src/main/java/org/apache/directory/studio/dsmlv2/request/Dsmlv2Grammar.java:[1182,22]
> cannot find symbol
> symbol  : method initAttributes()
> location: class org.apache.directory.shared.ldap.codec.add.AddRequest
>
> /home/continuum/continuum-1.1/apps/continuum/webapp/WEB-INF/working-directory/23/studio-dsml-parser/src/main/java/org/apache/directory/studio/dsmlv2/request/Dsmlv2Grammar.java:[1207,30]
> cannot find symbol
> symbol  : method setEntry(org.apache.directory.shared.ldap.name.LdapDN)
> location: class org.apache.directory.shared.ldap.codec.add.AddRequest
>
>
> [INFO]
> ------------------------------------------------------------------------
> [INFO] For more information, run Maven with the -e switch
> [INFO]
> ------------------------------------------------------------------------
> [INFO] Total time: 44 seconds
> [INFO] Finished at: Thu Aug 28 16:30:56 EDT 2008
> [INFO] Final Memory: 35M/508M
> [INFO]
> ------------------------------------------------------------------------
>
> ****************************************************************************
>
>
>


Re: [continuum] BUILD FAILURE: Apache Directory Studio - Apache Directory Studio - Build Def: Build and deployment of studio snapshot distributions

Posted by Emmanuel Lecharny <el...@gmail.com>.
Pierre-Arnaud Marcelot wrote:
> Hi Felix,
>
> Nope, there are no commits lost...
>
> Emmanuel removed the getAttributes method in a commit yesterday...
>   
Ahha ! You are depending on trunk ! I missed this :)

-- 
--
cordialement, regards,
Emmanuel Lécharny
www.iktek.com
directory.apache.org



Re: [continuum] BUILD FAILURE: Apache Directory Studio - Apache Directory Studio - Build Def: Build and deployment of studio snapshot distributions

Posted by Pierre-Arnaud Marcelot <pa...@marcelot.net>.
Hi Felix,

Nope, there are no commits lost...

Emmanuel removed the getAttributes method in a commit yesterday...

    /**
-     * Get the entry's attributes to be added
+     * Get the entry to be added
     *
-     * @return Returns the attributes.
+     * @return Returns the entry.
     */
-    public Attributes getAttributes()
+    public Entry getEntry()
    {
-        return attributes;
+        return entry;
    }


I'll fix this today.

Thanks,
Pierre-Arnaud


On Fri, Aug 29, 2008 at 8:53 AM, Felix Knecht <fe...@apache.org> wrote:

> Could it be that there are still some commits get lost?
>
> Regards Felix
>
> PS:
> I've the same problems locally
>
>
> Continuum VMBuild Server schrieb:
> > Online report :
> >
> http://vm094.oxylos.org/continuum/buildResult.action?buildId=1887&projectId=23
> >
> >
> <snip />
>
> > [INFO]
> > ------------------------------------------------------------------------
> > [INFO] [clean:clean]
> > [INFO] Deleting directory
> >
> /home/continuum/continuum-1.1/apps/continuum/webapp/WEB-INF/working-directory/23/studio-dsml-parser/target
> >
> > [INFO] [remote-resources:process {execution: default}]
> > [INFO] [resources:resources]
> > [INFO] Using default encoding to copy filtered resources.
> > [INFO] [compiler:compile]
> > [INFO] Compiling 49 source files to
> >
> /home/continuum/continuum-1.1/apps/continuum/webapp/WEB-INF/working-directory/23/studio-dsml-parser/target/classes
> >
> > [INFO]
> > ------------------------------------------------------------------------
> > [ERROR] BUILD FAILURE
> > [INFO]
> > ------------------------------------------------------------------------
> > [INFO] Compilation failure
> >
> >
> /home/continuum/continuum-1.1/apps/continuum/webapp/WEB-INF/working-directory/23/studio-dsml-parser/src/main/java/org/apache/directory/studio/dsmlv2/request/AddRequestDsml.java:[90,39]
> > cannot find symbol
> > symbol  : method getAttributes()
> > location: class org.apache.directory.shared.ldap.codec.add.AddRequest
> >
> >
> /home/continuum/continuum-1.1/apps/continuum/webapp/WEB-INF/working-directory/23/studio-dsml-parser/src/main/java/org/apache/directory/studio/dsmlv2/request/AddRequestDsml.java:[142,35]
> > cannot find symbol
> > symbol  : method initAttributes()
> > location: class org.apache.directory.shared.ldap.codec.add.AddRequest
> >
> >
> /home/continuum/continuum-1.1/apps/continuum/webapp/WEB-INF/working-directory/23/studio-dsml-parser/src/main/java/org/apache/directory/studio/dsmlv2/request/AddRequestDsml.java:[153,42]
> > cannot find symbol
> > symbol  : method getAttributes()
> > location: class org.apache.directory.shared.ldap.codec.add.AddRequest
> >
> >
> /home/continuum/continuum-1.1/apps/continuum/webapp/WEB-INF/working-directory/23/studio-dsml-parser/src/main/java/org/apache/directory/studio/dsmlv2/request/AddRequestDsml.java:[186,51]
> > incompatible types
> > found   : org.apache.directory.shared.ldap.entry.Entry
> > required: org.apache.directory.shared.ldap.name.LdapDN
> >
> >
> /home/continuum/continuum-1.1/apps/continuum/webapp/WEB-INF/working-directory/23/studio-dsml-parser/src/main/java/org/apache/directory/studio/dsmlv2/request/AddRequestDsml.java:[197,35]
> > cannot find symbol
> > symbol  : method setEntry(org.apache.directory.shared.ldap.name.LdapDN)
> > location: class org.apache.directory.shared.ldap.codec.add.AddRequest
> >
> >
> /home/continuum/continuum-1.1/apps/continuum/webapp/WEB-INF/working-directory/23/studio-dsml-parser/src/main/java/org/apache/directory/studio/dsmlv2/request/Dsmlv2Grammar.java:[1182,22]
> > cannot find symbol
> > symbol  : method initAttributes()
> > location: class org.apache.directory.shared.ldap.codec.add.AddRequest
> >
> >
> /home/continuum/continuum-1.1/apps/continuum/webapp/WEB-INF/working-directory/23/studio-dsml-parser/src/main/java/org/apache/directory/studio/dsmlv2/request/Dsmlv2Grammar.java:[1207,30]
> > cannot find symbol
> > symbol  : method setEntry(org.apache.directory.shared.ldap.name.LdapDN)
> > location: class org.apache.directory.shared.ldap.codec.add.AddRequest
> >
> >
> > [INFO]
> > ------------------------------------------------------------------------
> > [INFO] For more information, run Maven with the -e switch
> > [INFO]
> > ------------------------------------------------------------------------
> > [INFO] Total time: 44 seconds
> > [INFO] Finished at: Thu Aug 28 16:30:56 EDT 2008
> > [INFO] Final Memory: 35M/508M
> > [INFO]
> > ------------------------------------------------------------------------
> >
> >
> ****************************************************************************
> >
> >
> >
>
>