You are viewing a plain text version of this content. The canonical link for it is here.
Posted to dev@joshua.apache.org by Apache Jenkins Server <je...@builds.apache.org> on 2016/04/01 16:23:29 UTC
Build failed in Jenkins: joshua_master #5
See <https://builds.apache.org/job/joshua_master/5/changes>
Changes:
[post] minor change to trigger build
------------------------------------------
[...truncated 998 lines...]
[exec] Parameter.cpp:48:25: warning: ignoring return value of ‘char* getcwd(char*, size_t)’, declared with attribute warn_unused_result [-Wunused-result]
[exec] getcwd(path,1024);
[exec] ^
[exec] g++ -Wall -W -DNDEBUG -O3 -funroll-loops -std=c++11 -c ProblemTest.cpp -o ProblemTest.o
[exec] g++ -Wall -W -DNDEBUG -O3 -funroll-loops -std=c++11 -c RRTOptimization.cpp -o RRTOptimization.o
[exec] g++ -Wall -Wno-parentheses -std=c++11 -O3 -funroll-loops -DNDEBUG -DWORDINDEX_WITH_4_BYTE -DBINARY_SEARCH_FOR_TTABLE -DWORDINDEX_WITH_4_BYTE -c myassert.cpp -o optimized/myassert.o
[exec] g++ -Wall -Wno-parentheses -std=c++11 -O3 -funroll-loops -DNDEBUG -DWORDINDEX_WITH_4_BYTE -DBINARY_SEARCH_FOR_TTABLE -DWORDINDEX_WITH_4_BYTE -c Perplexity.cpp -o optimized/Perplexity.o
[exec] g++ -Wall -W -DNDEBUG -O3 -funroll-loops -std=c++11 -c MYOptimization.cpp -o MYOptimization.o
[exec] g++ -Wall -W -DNDEBUG -O3 -funroll-loops -std=c++11 -c SAOptimization.cpp -o SAOptimization.o
[exec] g++ -Wall -Wno-parentheses -std=c++11 -O3 -funroll-loops -DNDEBUG -DWORDINDEX_WITH_4_BYTE -DBINARY_SEARCH_FOR_TTABLE -DWORDINDEX_WITH_4_BYTE -c model1.cpp -o optimized/model1.o
[exec] g++ -Wall -Wno-parentheses -std=c++11 -O3 -funroll-loops -DNDEBUG -DWORDINDEX_WITH_4_BYTE -DBINARY_SEARCH_FOR_TTABLE -DWORDINDEX_WITH_4_BYTE -c model2.cpp -o optimized/model2.o
[exec] g++ -Wall -W -DNDEBUG -O3 -funroll-loops -std=c++11 -c TAOptimization.cpp -o TAOptimization.o
[exec] model1.cpp: In member function ‘int model1::em_with_tricks(int, bool, Dictionary&, bool)’:
[exec] model1.cpp:72:7: warning: variable ‘pair_no’ set but not used [-Wunused-but-set-variable]
[exec] int pair_no;
[exec] ^
[exec] g++ -Wall -W -DNDEBUG -O3 -funroll-loops -std=c++11 -c Optimization.cpp -o Optimization.o
[exec] model2.cpp: In member function ‘int model2::em_with_tricks(int)’:
[exec] model2.cpp:64:7: warning: variable ‘pair_no’ set but not used [-Wunused-but-set-variable]
[exec] int pair_no = 0;
[exec] ^
[exec] g++ -Wall -W -DNDEBUG -O3 -funroll-loops -std=c++11 -c KategProblemTest.cpp -o KategProblemTest.o
[exec] g++ -Wall -W -DNDEBUG -O3 -funroll-loops -std=c++11 -c KategProblemKBC.cpp -o KategProblemKBC.o
[exec] g++ -Wall -Wno-parentheses -std=c++11 -O3 -funroll-loops -DNDEBUG -DWORDINDEX_WITH_4_BYTE -DBINARY_SEARCH_FOR_TTABLE -DWORDINDEX_WITH_4_BYTE -c model3.cpp -o optimized/model3.o
[exec] g++ -Wall -Wno-parentheses -std=c++11 -O3 -funroll-loops -DNDEBUG -DWORDINDEX_WITH_4_BYTE -DBINARY_SEARCH_FOR_TTABLE -DWORDINDEX_WITH_4_BYTE -c getSentence.cpp -o optimized/getSentence.o
[exec] g++ -Wall -W -DNDEBUG -O3 -funroll-loops -std=c++11 -c KategProblemWBC.cpp -o KategProblemWBC.o
[exec] g++ -Wall -Wno-parentheses -std=c++11 -O3 -funroll-loops -DNDEBUG -DWORDINDEX_WITH_4_BYTE -DBINARY_SEARCH_FOR_TTABLE -DWORDINDEX_WITH_4_BYTE -c TTables.cpp -o optimized/TTables.o
[exec] In file included from TTables.cpp:22:0:
[exec] TTables.h: In instantiation of ‘tmodel<COUNT, PROB>::tmodel(const string&) [with COUNT = float; PROB = float; std::string = std::basic_string<char>]’:
[exec] TTables.cpp:106:16: required from here
[exec] TTables.h:197:23: warning: variable ‘oldf’ set but not used [-Wunused-but-set-variable]
[exec] int e,f,olde=-1,oldf=-1;
[exec] ^
[exec] g++ -Wall -W -DNDEBUG -O3 -funroll-loops -std=c++11 -c KategProblem.cpp -o KategProblem.o
[exec] g++ -Wall -Wno-parentheses -std=c++11 -O3 -funroll-loops -DNDEBUG -DWORDINDEX_WITH_4_BYTE -DBINARY_SEARCH_FOR_TTABLE -DWORDINDEX_WITH_4_BYTE -c ATables.cpp -o optimized/ATables.o
[exec] g++ -Wall -Wno-parentheses -std=c++11 -O3 -funroll-loops -DNDEBUG -DWORDINDEX_WITH_4_BYTE -DBINARY_SEARCH_FOR_TTABLE -DWORDINDEX_WITH_4_BYTE -c AlignTables.cpp -o optimized/AlignTables.o
[exec] g++ -Wall -W -DNDEBUG -O3 -funroll-loops -std=c++11 -c StatVar.cpp -o StatVar.o
[exec] g++ -Wall -W -DNDEBUG -O3 -funroll-loops -std=c++11 -c general.cpp -o general.o
[exec] g++ -Wall -Wno-parentheses -std=c++11 -O3 -funroll-loops -DNDEBUG -DWORDINDEX_WITH_4_BYTE -DBINARY_SEARCH_FOR_TTABLE -DWORDINDEX_WITH_4_BYTE -c main.cpp -o optimized/main.o
[exec] g++ -Wall -Wno-parentheses -std=c++11 -O3 -funroll-loops -DNDEBUG -DWORDINDEX_WITH_4_BYTE -DBINARY_SEARCH_FOR_TTABLE -DWORDINDEX_WITH_4_BYTE -c NTables.cpp -o optimized/NTables.o
[exec] g++ -Wall -W -DNDEBUG -O3 -funroll-loops -std=c++11 -c mkcls.cpp -o mkcls.o
[exec] main.cpp: In function ‘int main(int, char**)’:
[exec] main.cpp:707:10: warning: variable ‘errors’ set but not used [-Wunused-but-set-variable]
[exec] double errors=0.0;
[exec] ^
[exec] In file included from main.cpp:25:0:
[exec] TTables.h: In instantiation of ‘tmodel<COUNT, PROB>::tmodel(const string&) [with COUNT = float; PROB = float; std::string = std::basic_string<char>]’:
[exec] main.cpp:534:45: required from here
[exec] TTables.h:197:23: warning: variable ‘oldf’ set but not used [-Wunused-but-set-variable]
[exec] int e,f,olde=-1,oldf=-1;
[exec] ^
[exec] g++ -Wall -Wno-parentheses -std=c++11 -O3 -funroll-loops -DNDEBUG -DWORDINDEX_WITH_4_BYTE -DBINARY_SEARCH_FOR_TTABLE -DWORDINDEX_WITH_4_BYTE -c model2to3.cpp -o optimized/model2to3.o
[exec] g++ -Wall -Wno-parentheses -std=c++11 -O3 -funroll-loops -DNDEBUG -DWORDINDEX_WITH_4_BYTE -DBINARY_SEARCH_FOR_TTABLE -DWORDINDEX_WITH_4_BYTE -c collCounts.cpp -o optimized/collCounts.o
[exec] g++ -Wall -Wno-parentheses -std=c++11 -O3 -funroll-loops -DNDEBUG -DWORDINDEX_WITH_4_BYTE -DBINARY_SEARCH_FOR_TTABLE -DWORDINDEX_WITH_4_BYTE -c alignment.cpp -o optimized/alignment.o
[exec] g++ -Wall -Wno-parentheses -std=c++11 -O3 -funroll-loops -DNDEBUG -DWORDINDEX_WITH_4_BYTE -DBINARY_SEARCH_FOR_TTABLE -DWORDINDEX_WITH_4_BYTE -c vocab.cpp -o optimized/vocab.o
[exec] g++ -Wall -W -DNDEBUG -O3 -funroll-loops -std=c++11 -o mkcls GDAOptimization.o HCOptimization.o Problem.o IterOptimization.o ProblemTest.o RRTOptimization.o MYOptimization.o SAOptimization.o TAOptimization.o Optimization.o KategProblemTest.o KategProblemKBC.o KategProblemWBC.o KategProblem.o StatVar.o general.o mkcls.o
[exec] make[1]: Leaving directory `<https://builds.apache.org/job/joshua_master/ws/ext/giza-pp/mkcls-v2'>
[exec] g++ -Wall -Wno-parentheses -std=c++11 -O3 -funroll-loops -DNDEBUG -DWORDINDEX_WITH_4_BYTE -DBINARY_SEARCH_FOR_TTABLE -DWORDINDEX_WITH_4_BYTE -c MoveSwapMatrix.cpp -o optimized/MoveSwapMatrix.o
[exec] g++ -Wall -Wno-parentheses -std=c++11 -O3 -funroll-loops -DNDEBUG -DWORDINDEX_WITH_4_BYTE -DBINARY_SEARCH_FOR_TTABLE -DWORDINDEX_WITH_4_BYTE -c transpair_model3.cpp -o optimized/transpair_model3.o
[exec] g++ -Wall -Wno-parentheses -std=c++11 -O3 -funroll-loops -DNDEBUG -DWORDINDEX_WITH_4_BYTE -DBINARY_SEARCH_FOR_TTABLE -DWORDINDEX_WITH_4_BYTE -c transpair_model5.cpp -o optimized/transpair_model5.o
[exec] g++ -Wall -Wno-parentheses -std=c++11 -O3 -funroll-loops -DNDEBUG -DWORDINDEX_WITH_4_BYTE -DBINARY_SEARCH_FOR_TTABLE -DWORDINDEX_WITH_4_BYTE -c transpair_model4.cpp -o optimized/transpair_model4.o
[exec] g++ -Wall -Wno-parentheses -std=c++11 -O3 -funroll-loops -DNDEBUG -DWORDINDEX_WITH_4_BYTE -DBINARY_SEARCH_FOR_TTABLE -DWORDINDEX_WITH_4_BYTE -c utility.cpp -o optimized/utility.o
[exec] g++ -Wall -Wno-parentheses -std=c++11 -O3 -funroll-loops -DNDEBUG -DWORDINDEX_WITH_4_BYTE -DBINARY_SEARCH_FOR_TTABLE -DWORDINDEX_WITH_4_BYTE -c parse.cpp -o optimized/parse.o
[exec] g++ -Wall -Wno-parentheses -std=c++11 -O3 -funroll-loops -DNDEBUG -DWORDINDEX_WITH_4_BYTE -DBINARY_SEARCH_FOR_TTABLE -DWORDINDEX_WITH_4_BYTE -c reports.cpp -o optimized/reports.o
[exec] g++ -Wall -Wno-parentheses -std=c++11 -O3 -funroll-loops -DNDEBUG -DWORDINDEX_WITH_4_BYTE -DBINARY_SEARCH_FOR_TTABLE -DWORDINDEX_WITH_4_BYTE -c model3_viterbi.cpp -o optimized/model3_viterbi.o
[exec] g++ -Wall -Wno-parentheses -std=c++11 -O3 -funroll-loops -DNDEBUG -DWORDINDEX_WITH_4_BYTE -DBINARY_SEARCH_FOR_TTABLE -DWORDINDEX_WITH_4_BYTE -c model3_viterbi_with_tricks.cpp -o optimized/model3_viterbi_with_tricks.o
[exec] g++ -Wall -Wno-parentheses -std=c++11 -O3 -funroll-loops -DNDEBUG -DWORDINDEX_WITH_4_BYTE -DBINARY_SEARCH_FOR_TTABLE -DWORDINDEX_WITH_4_BYTE -c Dictionary.cpp -o optimized/Dictionary.o
[exec] g++ -Wall -Wno-parentheses -std=c++11 -O3 -funroll-loops -DNDEBUG -DWORDINDEX_WITH_4_BYTE -DBINARY_SEARCH_FOR_TTABLE -DWORDINDEX_WITH_4_BYTE -c model345-peg.cpp -o optimized/model345-peg.o
[exec] model3_viterbi.cpp: In member function ‘void model3::findAlignmentsNeighborhood(std::vector<unsigned int>&, std::vector<unsigned int>&, LogProb&, alignmodel&, int, int)’:
[exec] model3_viterbi.cpp:431:12: warning: variable ‘it_st’ set but not used [-Wunused-but-set-variable]
[exec] time_t it_st;
[exec] ^
[exec] g++ -Wall -Wno-parentheses -std=c++11 -O3 -funroll-loops -DNDEBUG -DWORDINDEX_WITH_4_BYTE -DBINARY_SEARCH_FOR_TTABLE -DWORDINDEX_WITH_4_BYTE -c hmm.cpp -o optimized/hmm.o
[exec] hmm.cpp: In member function ‘int hmm::em_with_tricks(int)’:
[exec] hmm.cpp:79:7: warning: variable ‘pair_no’ set but not used [-Wunused-but-set-variable]
[exec] int pair_no = 0;
[exec] ^
[exec] g++ -Wall -Wno-parentheses -std=c++11 -O3 -funroll-loops -DNDEBUG -DWORDINDEX_WITH_4_BYTE -DBINARY_SEARCH_FOR_TTABLE -DWORDINDEX_WITH_4_BYTE -c HMMTables.cpp -o optimized/HMMTables.o
[exec] g++ -Wall -Wno-parentheses -std=c++11 -O3 -funroll-loops -DNDEBUG -DWORDINDEX_WITH_4_BYTE -DBINARY_SEARCH_FOR_TTABLE -DWORDINDEX_WITH_4_BYTE -c ForwardBackward.cpp -o optimized/ForwardBackward.o
[exec] g++ -O3 -W -Wall snt2plain.cpp -o snt2plain.out
[exec] g++ -O3 -W -Wall plain2snt.cpp -o plain2snt.out
[exec] g++ -O3 -g -W -Wall snt2cooc.cpp -o snt2cooc.out
[exec] g++ -Wall -Wno-parentheses -std=c++11 -O3 -funroll-loops -DNDEBUG -DWORDINDEX_WITH_4_BYTE -DBINARY_SEARCH_FOR_TTABLE -DWORDINDEX_WITH_4_BYTE optimized/Parameter.o optimized/myassert.o optimized/Perplexity.o optimized/model1.o optimized/model2.o optimized/model3.o optimized/getSentence.o optimized/TTables.o optimized/ATables.o optimized/AlignTables.o optimized/main.o optimized/NTables.o optimized/model2to3.o optimized/collCounts.o optimized/alignment.o optimized/vocab.o optimized/MoveSwapMatrix.o optimized/transpair_model3.o optimized/transpair_model5.o optimized/transpair_model4.o optimized/utility.o optimized/parse.o optimized/reports.o optimized/model3_viterbi.o optimized/model3_viterbi_with_tricks.o optimized/Dictionary.o optimized/model345-peg.o optimized/hmm.o optimized/HMMTables.o optimized/ForwardBackward.o -o GIZA++
[exec] make[1]: Leaving directory `<https://builds.apache.org/job/joshua_master/ws/ext/giza-pp/GIZA++-v2'>
[exec] make: Leaving directory `<https://builds.apache.org/job/joshua_master/ws/ext/giza-pp'>
[exec] cp: cannot create regular file ‘/bin/GIZA++’: Permission denied
[exec] cp: cannot create regular file ‘/bin/snt2cooc.out’: Permission denied
[exec] cp: cannot create regular file ‘/bin/mkcls’: Permission denied
[exec] make: *** [install] Error 1
[exec] Result: 2
[exec] make: Entering directory `<https://builds.apache.org/job/joshua_master/ws/ext/symal'>
[exec] cc -O3 -c -o cmd.o cmd.c
[exec] g++ -O3 -o symal symal.cpp cmd.o
[exec] symal.cpp:44:1: warning: deprecated conversion from string constant to ‘char*’ [-Wwrite-strings]
[exec] };
[exec] ^
[exec] symal.cpp:44:1: warning: deprecated conversion from string constant to ‘char*’ [-Wwrite-strings]
[exec] symal.cpp:44:1: warning: deprecated conversion from string constant to ‘char*’ [-Wwrite-strings]
[exec] symal.cpp:44:1: warning: deprecated conversion from string constant to ‘char*’ [-Wwrite-strings]
[exec] symal.cpp:44:1: warning: deprecated conversion from string constant to ‘char*’ [-Wwrite-strings]
[exec] symal.cpp:44:1: warning: deprecated conversion from string constant to ‘char*’ [-Wwrite-strings]
[exec] symal.cpp:44:1: warning: deprecated conversion from string constant to ‘char*’ [-Wwrite-strings]
[exec] symal.cpp:44:1: warning: deprecated conversion from string constant to ‘char*’ [-Wwrite-strings]
[exec] symal.cpp:44:1: warning: deprecated conversion from string constant to ‘char*’ [-Wwrite-strings]
[exec] symal.cpp:44:1: warning: deprecated conversion from string constant to ‘char*’ [-Wwrite-strings]
[exec] symal.cpp:54:1: warning: deprecated conversion from string constant to ‘char*’ [-Wwrite-strings]
[exec] };
[exec] ^
[exec] symal.cpp:54:1: warning: deprecated conversion from string constant to ‘char*’ [-Wwrite-strings]
[exec] symal.cpp:54:1: warning: deprecated conversion from string constant to ‘char*’ [-Wwrite-strings]
[exec] symal.cpp:54:1: warning: deprecated conversion from string constant to ‘char*’ [-Wwrite-strings]
[exec] symal.cpp:54:1: warning: deprecated conversion from string constant to ‘char*’ [-Wwrite-strings]
[exec] symal.cpp:54:1: warning: deprecated conversion from string constant to ‘char*’ [-Wwrite-strings]
[exec] symal.cpp: In function ‘int main(int, char**)’:
[exec] symal.cpp:394:15: warning: deprecated conversion from string constant to ‘char*’ [-Wwrite-strings]
[exec] char* input="/dev/stdin";
[exec] ^
[exec] symal.cpp:395:16: warning: deprecated conversion from string constant to ‘char*’ [-Wwrite-strings]
[exec] char* output="/dev/stdout";
[exec] ^
[exec] symal.cpp:414:29: warning: deprecated conversion from string constant to ‘char*’ [-Wwrite-strings]
[exec] (char *)NULL);
[exec] ^
[exec] make: Leaving directory `<https://builds.apache.org/job/joshua_master/ws/ext/symal'>
kenlm:
[exec] -- The C compiler identification is GNU 4.8.2
[exec] -- The CXX compiler identification is GNU 4.8.2
[exec] -- Check for working C compiler: /usr/bin/cc
[exec] -- Check for working C compiler: /usr/bin/cc -- works
[exec] -- Detecting C compiler ABI info
[exec] -- Detecting C compiler ABI info - done
[exec] -- Check for working CXX compiler: /usr/bin/g++
[exec] -- Check for working CXX compiler: /usr/bin/g++ -- works
[exec] -- Detecting CXX compiler ABI info
[exec] -- Detecting CXX compiler ABI info - done
[exec] CMake Error at /usr/share/cmake-2.8/Modules/FindBoost.cmake:1131 (message):
[exec] Unable to find the requested Boost libraries.
[exec]
[exec] Boost version: 1.54.0
[exec]
[exec] Boost include path: /usr/include
[exec]
[exec] Could not find the following Boost libraries:
[exec]
[exec] boost_system
[exec] boost_thread
[exec]
[exec] Some (but not all) of the required Boost libraries were found. You may
[exec] need to install these additional Boost libraries. Alternatively, set
[exec] BOOST_LIBRARYDIR to the directory containing Boost libraries or BOOST_ROOT
[exec] to the location of Boost.
[exec] Call Stack (most recent call first):
[exec] CMakeLists.txt:36 (find_package)
[exec]
[exec]
[exec] -- Configuring incomplete, errors occurred!
[exec] See also "<https://builds.apache.org/job/joshua_master/ws/ext/kenlm/build/CMakeFiles/CMakeOutput.log".>
[exec] make: *** No targets specified and no makefile found. Stop.
[exec] cp: cannot stat ‘bin/query’: No such file or directory
[exec] cp: cannot stat ‘bin/lmplz’: No such file or directory
[exec] cp: cannot stat ‘bin/build_binary’: No such file or directory
[exec] g++: error: lm/CMakeFiles/kenlm.dir/*.o: No such file or directory
[exec] g++: error: util/CMakeFiles/kenlm_util.dir/*.o: No such file or directory
[exec] g++: error: util/CMakeFiles/kenlm_util.dir/double-conversion/*.o: No such file or directory
[exec] Result: 1
parallelize:
[exec] make: Entering directory `<https://builds.apache.org/job/joshua_master/ws/scripts/training/parallelize'>
[exec] gcc -g -O2 -o sentserver -pthread -L/usr/local/lib sentserver.c
[exec] gcc -g -O2 -o sentclient -pthread -L/usr/local/lib sentclient.c
[exec] sentclient.c: In function ‘main’:
[exec] sentclient.c:73:7: warning: ignoring return value of ‘write’, declared with attribute warn_unused_result [-Wunused-result]
[exec] write(1, key, strlen(key));
[exec] ^
[exec] sentclient.c:74:7: warning: ignoring return value of ‘write’, declared with attribute warn_unused_result [-Wunused-result]
[exec] write(1, "\n", 1);
[exec] ^
[exec] make: Leaving directory `<https://builds.apache.org/job/joshua_master/ws/scripts/training/parallelize'>
all:
test:
[exec] TESTS: ./lm/berkeley/test.sh ./lattice/test.sh ./decoder/segment-oovs/test.sh ./decoder/oov-list/test.sh ./decoder/tree-output/test.sh ./decoder/empty-test/test.sh ./decoder/left-state/test.sh ./decoder/target-bigram/test.sh ./decoder/constrained/test.sh ./decoder/n-ary/test.sh ./decoder/phrase/unique-hypotheses/test.sh ./decoder/phrase/constrained/test.sh ./decoder/phrase/decode/test.sh ./decoder/phrase/decode/test-packed.sh ./decoder/dont-crash/test.sh ./decoder/k-best-extraction/test.sh ./decoder/source-annotations/test.sh ./decoder/denormalization/test.sh ./decoder/num_translation_options/test.sh ./decoder/rescoring/test.sh ./decoder/fragmentlm/test.sh ./decoder/regexp-grammar/test.sh ./decoder/regexp-grammar-both-rule-types/test.sh ./thrax/extraction/test.sh ./thrax/filtering/test-loose.sh ./thrax/filtering/test-exact.sh ./thrax/filtering/test-fast.sh ./packed/test.sh ./bn-en/packed/test.sh ./bn-en/samt/test.sh ./bn-en/hiero/test-berkeleylm.sh ./bn-en/hiero/test-filter.sh ./bn-en/hiero/test-classlm.sh ./bn-en/hiero/test.sh ./scripts/normalization/test.sh ./scripts/support/moses_grammar/test.sh ./lattice-short/test.sh ./pipeline/test.sh ./pipeline/test-ghkm.sh ./server/tcp-text/test.sh ./server/http/test.sh ./packed-grammar/test.sh ./packed-grammar/test-multiple.sh ./parser/test.sh ./grammar/sparse-features/test.sh ./grammar/sparse-features/test-packed.sh
[exec] Running test 'test.sh' in test/./lm/berkeley...[01;32mPASSED[00m
[exec] Running test 'test.sh' in test/./lattice...[01;32mPASSED[00m
[exec] Running test 'test.sh' in test/./decoder/oov-list...[01;31;31mFAILED[00m
[exec] Running test 'test.sh' in test/./decoder/tree-output...[01;31;31mFAILED[00m
[exec] Running test 'test.sh' in test/./decoder/empty-test...[01;32mPASSED[00m
[exec] Running test 'test.sh' in test/./decoder/left-state...[01;31;31mFAILED[00m
[exec] Running test 'test.sh' in test/./decoder/target-bigram...[01;32mPASSED[00m
[exec] Running test 'test.sh' in test/./decoder/constrained...[01;31;31mFAILED[00m
[exec] Running test 'test.sh' in test/./decoder/n-ary...[01;31;31mFAILED[00m
[exec] Running test 'test.sh' in test/./decoder/phrase/unique-hypotheses...[01;31;31mFAILED[00m
[exec] Running test 'test.sh' in test/./decoder/phrase/constrained...[01;31;31mFAILED[00m
[exec] Running test 'test.sh' in test/./decoder/phrase/decode...[01;31;31mFAILED[00m
[exec] Running test 'test-packed.sh' in test/./decoder/phrase/decode...[01;31;31mFAILED[00m
[exec] Running test 'test.sh' in test/./decoder/dont-crash...[01;32mPASSED[00m
[exec] Running test 'test.sh' in test/./decoder/k-best-extraction...[01;31;31mFAILED[00m
[exec] Running test 'test.sh' in test/./decoder/source-annotations...[01;31;31mFAILED[00m
[exec] Running test 'test.sh' in test/./decoder/denormalization...[01;32mPASSED[00m
[exec] Running test 'test.sh' in test/./decoder/num_translation_options...[01;31;31mFAILED[00m
[exec] Running test 'test.sh' in test/./decoder/rescoring...[01;31;31mFAILED[00m
[exec] Running test 'test.sh' in test/./decoder/regexp-grammar...[01;32mPASSED[00m
[exec] Running test 'test.sh' in test/./decoder/regexp-grammar-both-rule-types...[01;32mPASSED[00m
[exec] getmerge: `thrax/final': No such file or directory
[exec] Running test 'test.sh' in test/./thrax/extraction...[01;31;31mFAILED[00m
[exec] Running test 'test-loose.sh' in test/./thrax/filtering...[01;32mPASSED[00m
[exec] Running test 'test-exact.sh' in test/./thrax/filtering...[01;32mPASSED[00m
[exec] Running test 'test-fast.sh' in test/./thrax/filtering...[01;32mPASSED[00m
[exec] Running test 'test.sh' in test/./bn-en/packed...[01;31;31mFAILED[00m
[exec] Running test 'test.sh' in test/./bn-en/samt...[01;31;31mFAILED[00m
[exec] Running test 'test-berkeleylm.sh' in test/./bn-en/hiero...[01;32mPASSED[00m
[exec] Running test 'test-filter.sh' in test/./bn-en/hiero...[01;31;31mFAILED[00m
[exec] Running test 'test-classlm.sh' in test/./bn-en/hiero...[01;31;31mFAILED[00m
[exec] Running test 'test.sh' in test/./bn-en/hiero...[01;31;31mFAILED[00m
[exec] Running test 'test.sh' in test/./scripts/support/moses_grammar...[01;32mPASSED[00m
[exec] Running test 'test.sh' in test/./lattice-short...[01;31;31mFAILED[00m
[exec] Running test 'test.sh' in test/./server/tcp-text...[01;32mPASSED[00m
[exec] Running test 'test.sh' in test/./server/http...[01;31;31mFAILED[00m
[exec] Running test 'test.sh' in test/./packed-grammar...[01;31;31mFAILED[00m
[exec] Running test 'test-multiple.sh' in test/./packed-grammar...[01;32mPASSED[00m
[exec] Running test 'test.sh' in test/./grammar/sparse-features...[01;32mPASSED[00m
[exec] Running test 'test-packed.sh' in test/./grammar/sparse-features...[01;32mPASSED[00m
[exec] [01;32mPASSED[00m 17 [01;31;31mFAILED[00m 22
check-joshua-home:
[echo] JOSHUA = <https://builds.apache.org/job/joshua_master/ws/> basedir = <https://builds.apache.org/job/joshua_master/ws/>
documentation:
BUILD FAILED
<https://builds.apache.org/job/joshua_master/ws/build.xml>:283: Problem: failed to create task or type antlib:org.doxygen.tools:doxygen
Cause: The name is undefined.
Action: Check the spelling.
Action: Check that any custom tasks/types have been declared.
Action: Check that any <presetdef>/<macrodef> declarations have taken place.
No types or tasks have been defined in this namespace yet
This appears to be an antlib declaration.
Action: Check that the implementing library exists in one of:
-/home/jenkins/tools/ant/latest/lib
-/home/jenkins/.ant/lib
-a directory added on the command line with the -lib argument
Total time: 7 minutes 42 seconds
Build step 'Invoke Ant' marked build as failure
Publishing Javadoc