You are viewing a plain text version of this content. The canonical link for it is here.
Posted to dev@lucene.apache.org by Policeman Jenkins Server <je...@thetaphi.de> on 2013/11/20 14:31:17 UTC
[JENKINS] Lucene-Solr-4.x-Windows (32bit/jdk1.7.0_45) - Build #
3409 - Still Failing!
Build: http://jenkins.thetaphi.de/job/Lucene-Solr-4.x-Windows/3409/
Java: 32bit/jdk1.7.0_45 -server -XX:+UseSerialGC
1 tests failed.
REGRESSION: org.apache.lucene.index.TestIndexWriterReader.testTooManySegments
Error Message:
Stack Trace:
java.lang.AssertionError
at __randomizedtesting.SeedInfo.seed([4C266EC9D71C52D5:AB5A5E30EFBEA06]:0)
at org.junit.Assert.fail(Assert.java:92)
at org.junit.Assert.assertTrue(Assert.java:43)
at org.junit.Assert.assertTrue(Assert.java:54)
at org.apache.lucene.index.TestIndexWriterReader.testTooManySegments(TestIndexWriterReader.java:1157)
at sun.reflect.NativeMethodAccessorImpl.invoke0(Native Method)
at sun.reflect.NativeMethodAccessorImpl.invoke(NativeMethodAccessorImpl.java:57)
at sun.reflect.DelegatingMethodAccessorImpl.invoke(DelegatingMethodAccessorImpl.java:43)
at java.lang.reflect.Method.invoke(Method.java:606)
at com.carrotsearch.randomizedtesting.RandomizedRunner.invoke(RandomizedRunner.java:1559)
at com.carrotsearch.randomizedtesting.RandomizedRunner.access$600(RandomizedRunner.java:79)
at com.carrotsearch.randomizedtesting.RandomizedRunner$6.evaluate(RandomizedRunner.java:737)
at com.carrotsearch.randomizedtesting.RandomizedRunner$7.evaluate(RandomizedRunner.java:773)
at com.carrotsearch.randomizedtesting.RandomizedRunner$8.evaluate(RandomizedRunner.java:787)
at org.apache.lucene.util.TestRuleSetupTeardownChained$1.evaluate(TestRuleSetupTeardownChained.java:50)
at org.apache.lucene.util.TestRuleFieldCacheSanity$1.evaluate(TestRuleFieldCacheSanity.java:51)
at org.apache.lucene.util.AbstractBeforeAfterRule$1.evaluate(AbstractBeforeAfterRule.java:46)
at com.carrotsearch.randomizedtesting.rules.SystemPropertiesInvariantRule$1.evaluate(SystemPropertiesInvariantRule.java:55)
at org.apache.lucene.util.TestRuleThreadAndTestName$1.evaluate(TestRuleThreadAndTestName.java:49)
at org.apache.lucene.util.TestRuleIgnoreAfterMaxFailures$1.evaluate(TestRuleIgnoreAfterMaxFailures.java:70)
at org.apache.lucene.util.TestRuleMarkFailure$1.evaluate(TestRuleMarkFailure.java:48)
at com.carrotsearch.randomizedtesting.rules.StatementAdapter.evaluate(StatementAdapter.java:36)
at com.carrotsearch.randomizedtesting.ThreadLeakControl$StatementRunner.run(ThreadLeakControl.java:358)
at com.carrotsearch.randomizedtesting.ThreadLeakControl.forkTimeoutingTask(ThreadLeakControl.java:782)
at com.carrotsearch.randomizedtesting.ThreadLeakControl$3.evaluate(ThreadLeakControl.java:442)
at com.carrotsearch.randomizedtesting.RandomizedRunner.runSingleTest(RandomizedRunner.java:746)
at com.carrotsearch.randomizedtesting.RandomizedRunner$3.evaluate(RandomizedRunner.java:648)
at com.carrotsearch.randomizedtesting.RandomizedRunner$4.evaluate(RandomizedRunner.java:682)
at com.carrotsearch.randomizedtesting.RandomizedRunner$5.evaluate(RandomizedRunner.java:693)
at org.apache.lucene.util.AbstractBeforeAfterRule$1.evaluate(AbstractBeforeAfterRule.java:46)
at org.apache.lucene.util.TestRuleStoreClassName$1.evaluate(TestRuleStoreClassName.java:42)
at com.carrotsearch.randomizedtesting.rules.SystemPropertiesInvariantRule$1.evaluate(SystemPropertiesInvariantRule.java:55)
at com.carrotsearch.randomizedtesting.rules.NoShadowingOrOverridesOnMethodsRule$1.evaluate(NoShadowingOrOverridesOnMethodsRule.java:39)
at com.carrotsearch.randomizedtesting.rules.NoShadowingOrOverridesOnMethodsRule$1.evaluate(NoShadowingOrOverridesOnMethodsRule.java:39)
at com.carrotsearch.randomizedtesting.rules.StatementAdapter.evaluate(StatementAdapter.java:36)
at org.apache.lucene.util.TestRuleAssertionsRequired$1.evaluate(TestRuleAssertionsRequired.java:43)
at org.apache.lucene.util.TestRuleMarkFailure$1.evaluate(TestRuleMarkFailure.java:48)
at org.apache.lucene.util.TestRuleIgnoreAfterMaxFailures$1.evaluate(TestRuleIgnoreAfterMaxFailures.java:70)
at org.apache.lucene.util.TestRuleIgnoreTestSuites$1.evaluate(TestRuleIgnoreTestSuites.java:55)
at com.carrotsearch.randomizedtesting.rules.StatementAdapter.evaluate(StatementAdapter.java:36)
at com.carrotsearch.randomizedtesting.ThreadLeakControl$StatementRunner.run(ThreadLeakControl.java:358)
at java.lang.Thread.run(Thread.java:744)
Build Log:
[...truncated 565 lines...]
[junit4] Suite: org.apache.lucene.index.TestIndexWriterReader
[junit4] 2> NOTE: reproduce with: ant test -Dtestcase=TestIndexWriterReader -Dtests.method=testTooManySegments -Dtests.seed=4C266EC9D71C52D5 -Dtests.slow=true -Dtests.locale=en -Dtests.timezone=NZ-CHAT -Dtests.file.encoding=Cp1252
[junit4] FAILURE 1.88s | TestIndexWriterReader.testTooManySegments <<<
[junit4] > Throwable #1: java.lang.AssertionError
[junit4] > at __randomizedtesting.SeedInfo.seed([4C266EC9D71C52D5:AB5A5E30EFBEA06]:0)
[junit4] > at org.apache.lucene.index.TestIndexWriterReader.testTooManySegments(TestIndexWriterReader.java:1157)
[junit4] > at java.lang.Thread.run(Thread.java:744)
[junit4] IGNOR/A 0.01s | TestIndexWriterReader.testNoTermsIndex
[junit4] > Assumption #1: Format: Memory does not support ReaderTermsIndexDivisor!
[junit4] 2> NOTE: test params are: codec=Lucene46: {f=PostingsFormat(name=Memory doPackFST= false), field5=PostingsFormat(name=MockRandom), id=PostingsFormat(name=MockRandom), field=PostingsFormat(name=Memory doPackFST= false), field4=PostingsFormat(name=Asserting), field3=PostingsFormat(name=SimpleText), field2=PostingsFormat(name=Memory doPackFST= false), foo=PostingsFormat(name=Memory doPackFST= false), field1=PostingsFormat(name=MockRandom), indexname=PostingsFormat(name=SimpleText)}, docValues:{}, sim=DefaultSimilarity, locale=en, timezone=NZ-CHAT
[junit4] 2> NOTE: Windows 7 6.1 x86/Oracle Corporation 1.7.0_45 (32-bit)/cpus=2,threads=1,free=38746888,total=75358208
[junit4] 2> NOTE: All tests run in this JVM: [TestIndexWriterLockRelease, Test2BTerms, Test4GBStoredFields, TestTopDocsCollector, TestSimilarityProvider, TestTermsEnum2, TestBasics, TestTieredMergePolicy, TestFieldCacheSanityChecker, TestExternalCodecs, TestConcurrentMergeScheduler, TestLucene40StoredFieldsFormat, TestUniqueTermCount, TestCompressingStoredFieldsFormat, TestNumericDocValuesUpdates, TestTopDocsMerge, TestUnicodeUtil, TestMultiTermQueryRewrites, TestPositionIncrement, TestDateSort, TestPrefixInBooleanQuery, TestNumericUtils, TestDocCount, TestRecyclingIntBlockAllocator, TestPerFieldPostingsFormat, TestDocumentsWriterDeleteQueue, TestLucene3xTermVectorsFormat, TestTransactions, TestVirtualMethod, TestLucene40PostingsFormat, TestBooleanMinShouldMatch, TestIndexWriter, TestNewestSegment, TestFixedBitSet, TestCharTermAttributeImpl, TestCompoundFile, TestBytesRef, TestSumDocFreq, TestIndexWriterDelete, TestBlockPostingsFormat2, TestCachingTokenFilter, TestShardSearching, TestNoDeletionPolicy, TestSegmentTermDocs, Test2BPostingsBytes, TestFieldMaskingSpanQuery, TestSegmentTermEnum, TestSnapshotDeletionPolicy, TestOmitPositions, TestSameTokenSamePosition, TestIndexWriterExceptions, Nested1, TestPayloadsOnVectors, Nested3, Nested1, Nested2, TestPrefixCodedTerms, TestCustomSearcherSort, TestCrash, TestPayloads, TestFieldValueFilter, TestNorms, TestIndexCommit, TestMultiTermConstantScore, TestDocumentsWriterStallControl, TestFieldCacheRangeFilter, TestBroadWord, TestNeverDelete, TestAddIndexes, TestArrayUtil, TestCloseableThreadLocal, TestPagedBytes, TestMockAnalyzer, TestAutomatonQueryUnicode, TestFieldInfos, TestCompressingTermVectorsFormat, TestTermInfosReaderIndex, TestMergedIterator, TestSortDocValues, TestRollingBuffer, TestSimpleSearchEquivalence, TestLucene3xStoredFieldsFormat, TestMultiMMap, TestFuzzyQuery, Nested, Nested, TestCharFilter, TestCachingWrapperFilter, TestSimilarity, TestDocIdSet, TestIntroSorter, Nested, TestDocValuesIndexing, TestPostingsOffsets, TestIndexWriterReader]
[junit4] Completed in 26.27s, 23 tests, 1 failure, 1 skipped <<< FAILURES!
[...truncated 999 lines...]
BUILD FAILED
C:\Users\JenkinsSlave\workspace\Lucene-Solr-4.x-Windows\build.xml:426: The following error occurred while executing this line:
C:\Users\JenkinsSlave\workspace\Lucene-Solr-4.x-Windows\build.xml:406: The following error occurred while executing this line:
C:\Users\JenkinsSlave\workspace\Lucene-Solr-4.x-Windows\build.xml:39: The following error occurred while executing this line:
C:\Users\JenkinsSlave\workspace\Lucene-Solr-4.x-Windows\extra-targets.xml:37: The following error occurred while executing this line:
C:\Users\JenkinsSlave\workspace\Lucene-Solr-4.x-Windows\lucene\build.xml:49: The following error occurred while executing this line:
C:\Users\JenkinsSlave\workspace\Lucene-Solr-4.x-Windows\lucene\common-build.xml:1276: The following error occurred while executing this line:
C:\Users\JenkinsSlave\workspace\Lucene-Solr-4.x-Windows\lucene\common-build.xml:912: There were test failures: 379 suites, 2758 tests, 1 failure, 92 ignored (79 assumptions)
Total time: 11 minutes 9 seconds
Build step 'Invoke Ant' marked build as failure
Description set: Java: 32bit/jdk1.7.0_45 -server -XX:+UseSerialGC
Archiving artifacts
Recording test results
Email was triggered for: Failure
Sending email for trigger: Failure
Re: [JENKINS] Lucene-Solr-4.x-Windows (32bit/jdk1.7.0_45) - Build #
3409 - Still Failing!
Posted by Michael McCandless <lu...@mikemccandless.com>.
I committed a fix.
Mike McCandless
http://blog.mikemccandless.com
On Wed, Nov 20, 2013 at 8:31 AM, Policeman Jenkins Server
<je...@thetaphi.de> wrote:
> Build: http://jenkins.thetaphi.de/job/Lucene-Solr-4.x-Windows/3409/
> Java: 32bit/jdk1.7.0_45 -server -XX:+UseSerialGC
>
> 1 tests failed.
> REGRESSION: org.apache.lucene.index.TestIndexWriterReader.testTooManySegments
>
> Error Message:
>
>
> Stack Trace:
> java.lang.AssertionError
> at __randomizedtesting.SeedInfo.seed([4C266EC9D71C52D5:AB5A5E30EFBEA06]:0)
> at org.junit.Assert.fail(Assert.java:92)
> at org.junit.Assert.assertTrue(Assert.java:43)
> at org.junit.Assert.assertTrue(Assert.java:54)
> at org.apache.lucene.index.TestIndexWriterReader.testTooManySegments(TestIndexWriterReader.java:1157)
> at sun.reflect.NativeMethodAccessorImpl.invoke0(Native Method)
> at sun.reflect.NativeMethodAccessorImpl.invoke(NativeMethodAccessorImpl.java:57)
> at sun.reflect.DelegatingMethodAccessorImpl.invoke(DelegatingMethodAccessorImpl.java:43)
> at java.lang.reflect.Method.invoke(Method.java:606)
> at com.carrotsearch.randomizedtesting.RandomizedRunner.invoke(RandomizedRunner.java:1559)
> at com.carrotsearch.randomizedtesting.RandomizedRunner.access$600(RandomizedRunner.java:79)
> at com.carrotsearch.randomizedtesting.RandomizedRunner$6.evaluate(RandomizedRunner.java:737)
> at com.carrotsearch.randomizedtesting.RandomizedRunner$7.evaluate(RandomizedRunner.java:773)
> at com.carrotsearch.randomizedtesting.RandomizedRunner$8.evaluate(RandomizedRunner.java:787)
> at org.apache.lucene.util.TestRuleSetupTeardownChained$1.evaluate(TestRuleSetupTeardownChained.java:50)
> at org.apache.lucene.util.TestRuleFieldCacheSanity$1.evaluate(TestRuleFieldCacheSanity.java:51)
> at org.apache.lucene.util.AbstractBeforeAfterRule$1.evaluate(AbstractBeforeAfterRule.java:46)
> at com.carrotsearch.randomizedtesting.rules.SystemPropertiesInvariantRule$1.evaluate(SystemPropertiesInvariantRule.java:55)
> at org.apache.lucene.util.TestRuleThreadAndTestName$1.evaluate(TestRuleThreadAndTestName.java:49)
> at org.apache.lucene.util.TestRuleIgnoreAfterMaxFailures$1.evaluate(TestRuleIgnoreAfterMaxFailures.java:70)
> at org.apache.lucene.util.TestRuleMarkFailure$1.evaluate(TestRuleMarkFailure.java:48)
> at com.carrotsearch.randomizedtesting.rules.StatementAdapter.evaluate(StatementAdapter.java:36)
> at com.carrotsearch.randomizedtesting.ThreadLeakControl$StatementRunner.run(ThreadLeakControl.java:358)
> at com.carrotsearch.randomizedtesting.ThreadLeakControl.forkTimeoutingTask(ThreadLeakControl.java:782)
> at com.carrotsearch.randomizedtesting.ThreadLeakControl$3.evaluate(ThreadLeakControl.java:442)
> at com.carrotsearch.randomizedtesting.RandomizedRunner.runSingleTest(RandomizedRunner.java:746)
> at com.carrotsearch.randomizedtesting.RandomizedRunner$3.evaluate(RandomizedRunner.java:648)
> at com.carrotsearch.randomizedtesting.RandomizedRunner$4.evaluate(RandomizedRunner.java:682)
> at com.carrotsearch.randomizedtesting.RandomizedRunner$5.evaluate(RandomizedRunner.java:693)
> at org.apache.lucene.util.AbstractBeforeAfterRule$1.evaluate(AbstractBeforeAfterRule.java:46)
> at org.apache.lucene.util.TestRuleStoreClassName$1.evaluate(TestRuleStoreClassName.java:42)
> at com.carrotsearch.randomizedtesting.rules.SystemPropertiesInvariantRule$1.evaluate(SystemPropertiesInvariantRule.java:55)
> at com.carrotsearch.randomizedtesting.rules.NoShadowingOrOverridesOnMethodsRule$1.evaluate(NoShadowingOrOverridesOnMethodsRule.java:39)
> at com.carrotsearch.randomizedtesting.rules.NoShadowingOrOverridesOnMethodsRule$1.evaluate(NoShadowingOrOverridesOnMethodsRule.java:39)
> at com.carrotsearch.randomizedtesting.rules.StatementAdapter.evaluate(StatementAdapter.java:36)
> at org.apache.lucene.util.TestRuleAssertionsRequired$1.evaluate(TestRuleAssertionsRequired.java:43)
> at org.apache.lucene.util.TestRuleMarkFailure$1.evaluate(TestRuleMarkFailure.java:48)
> at org.apache.lucene.util.TestRuleIgnoreAfterMaxFailures$1.evaluate(TestRuleIgnoreAfterMaxFailures.java:70)
> at org.apache.lucene.util.TestRuleIgnoreTestSuites$1.evaluate(TestRuleIgnoreTestSuites.java:55)
> at com.carrotsearch.randomizedtesting.rules.StatementAdapter.evaluate(StatementAdapter.java:36)
> at com.carrotsearch.randomizedtesting.ThreadLeakControl$StatementRunner.run(ThreadLeakControl.java:358)
> at java.lang.Thread.run(Thread.java:744)
>
>
>
>
> Build Log:
> [...truncated 565 lines...]
> [junit4] Suite: org.apache.lucene.index.TestIndexWriterReader
> [junit4] 2> NOTE: reproduce with: ant test -Dtestcase=TestIndexWriterReader -Dtests.method=testTooManySegments -Dtests.seed=4C266EC9D71C52D5 -Dtests.slow=true -Dtests.locale=en -Dtests.timezone=NZ-CHAT -Dtests.file.encoding=Cp1252
> [junit4] FAILURE 1.88s | TestIndexWriterReader.testTooManySegments <<<
> [junit4] > Throwable #1: java.lang.AssertionError
> [junit4] > at __randomizedtesting.SeedInfo.seed([4C266EC9D71C52D5:AB5A5E30EFBEA06]:0)
> [junit4] > at org.apache.lucene.index.TestIndexWriterReader.testTooManySegments(TestIndexWriterReader.java:1157)
> [junit4] > at java.lang.Thread.run(Thread.java:744)
> [junit4] IGNOR/A 0.01s | TestIndexWriterReader.testNoTermsIndex
> [junit4] > Assumption #1: Format: Memory does not support ReaderTermsIndexDivisor!
> [junit4] 2> NOTE: test params are: codec=Lucene46: {f=PostingsFormat(name=Memory doPackFST= false), field5=PostingsFormat(name=MockRandom), id=PostingsFormat(name=MockRandom), field=PostingsFormat(name=Memory doPackFST= false), field4=PostingsFormat(name=Asserting), field3=PostingsFormat(name=SimpleText), field2=PostingsFormat(name=Memory doPackFST= false), foo=PostingsFormat(name=Memory doPackFST= false), field1=PostingsFormat(name=MockRandom), indexname=PostingsFormat(name=SimpleText)}, docValues:{}, sim=DefaultSimilarity, locale=en, timezone=NZ-CHAT
> [junit4] 2> NOTE: Windows 7 6.1 x86/Oracle Corporation 1.7.0_45 (32-bit)/cpus=2,threads=1,free=38746888,total=75358208
> [junit4] 2> NOTE: All tests run in this JVM: [TestIndexWriterLockRelease, Test2BTerms, Test4GBStoredFields, TestTopDocsCollector, TestSimilarityProvider, TestTermsEnum2, TestBasics, TestTieredMergePolicy, TestFieldCacheSanityChecker, TestExternalCodecs, TestConcurrentMergeScheduler, TestLucene40StoredFieldsFormat, TestUniqueTermCount, TestCompressingStoredFieldsFormat, TestNumericDocValuesUpdates, TestTopDocsMerge, TestUnicodeUtil, TestMultiTermQueryRewrites, TestPositionIncrement, TestDateSort, TestPrefixInBooleanQuery, TestNumericUtils, TestDocCount, TestRecyclingIntBlockAllocator, TestPerFieldPostingsFormat, TestDocumentsWriterDeleteQueue, TestLucene3xTermVectorsFormat, TestTransactions, TestVirtualMethod, TestLucene40PostingsFormat, TestBooleanMinShouldMatch, TestIndexWriter, TestNewestSegment, TestFixedBitSet, TestCharTermAttributeImpl, TestCompoundFile, TestBytesRef, TestSumDocFreq, TestIndexWriterDelete, TestBlockPostingsFormat2, TestCachingTokenFilter, TestShardSearching, TestNoDeletionPolicy, TestSegmentTermDocs, Test2BPostingsBytes, TestFieldMaskingSpanQuery, TestSegmentTermEnum, TestSnapshotDeletionPolicy, TestOmitPositions, TestSameTokenSamePosition, TestIndexWriterExceptions, Nested1, TestPayloadsOnVectors, Nested3, Nested1, Nested2, TestPrefixCodedTerms, TestCustomSearcherSort, TestCrash, TestPayloads, TestFieldValueFilter, TestNorms, TestIndexCommit, TestMultiTermConstantScore, TestDocumentsWriterStallControl, TestFieldCacheRangeFilter, TestBroadWord, TestNeverDelete, TestAddIndexes, TestArrayUtil, TestCloseableThreadLocal, TestPagedBytes, TestMockAnalyzer, TestAutomatonQueryUnicode, TestFieldInfos, TestCompressingTermVectorsFormat, TestTermInfosReaderIndex, TestMergedIterator, TestSortDocValues, TestRollingBuffer, TestSimpleSearchEquivalence, TestLucene3xStoredFieldsFormat, TestMultiMMap, TestFuzzyQuery, Nested, Nested, TestCharFilter, TestCachingWrapperFilter, TestSimilarity, TestDocIdSet, TestIntroSorter, Nested, TestDocValuesIndexing, TestPostingsOffsets, TestIndexWriterReader]
> [junit4] Completed in 26.27s, 23 tests, 1 failure, 1 skipped <<< FAILURES!
>
> [...truncated 999 lines...]
> BUILD FAILED
> C:\Users\JenkinsSlave\workspace\Lucene-Solr-4.x-Windows\build.xml:426: The following error occurred while executing this line:
> C:\Users\JenkinsSlave\workspace\Lucene-Solr-4.x-Windows\build.xml:406: The following error occurred while executing this line:
> C:\Users\JenkinsSlave\workspace\Lucene-Solr-4.x-Windows\build.xml:39: The following error occurred while executing this line:
> C:\Users\JenkinsSlave\workspace\Lucene-Solr-4.x-Windows\extra-targets.xml:37: The following error occurred while executing this line:
> C:\Users\JenkinsSlave\workspace\Lucene-Solr-4.x-Windows\lucene\build.xml:49: The following error occurred while executing this line:
> C:\Users\JenkinsSlave\workspace\Lucene-Solr-4.x-Windows\lucene\common-build.xml:1276: The following error occurred while executing this line:
> C:\Users\JenkinsSlave\workspace\Lucene-Solr-4.x-Windows\lucene\common-build.xml:912: There were test failures: 379 suites, 2758 tests, 1 failure, 92 ignored (79 assumptions)
>
> Total time: 11 minutes 9 seconds
> Build step 'Invoke Ant' marked build as failure
> Description set: Java: 32bit/jdk1.7.0_45 -server -XX:+UseSerialGC
> Archiving artifacts
> Recording test results
> Email was triggered for: Failure
> Sending email for trigger: Failure
>
>
>
>
> ---------------------------------------------------------------------
> To unsubscribe, e-mail: dev-unsubscribe@lucene.apache.org
> For additional commands, e-mail: dev-help@lucene.apache.org
---------------------------------------------------------------------
To unsubscribe, e-mail: dev-unsubscribe@lucene.apache.org
For additional commands, e-mail: dev-help@lucene.apache.org