You are viewing a plain text version of this content. The canonical link for it is here.
Posted to dev@zookeeper.apache.org by Apache Hudson Server <hu...@hudson.zones.apache.org> on 2009/06/03 00:46:28 UTC

Build failed in Hudson: Zookeeper-Patch-vesta.apache.org #99

See http://hudson.zones.apache.org/hudson/job/Zookeeper-Patch-vesta.apache.org/99/changes

Changes:

[breed] ZOOKEEPER-358. Throw exception when ledger does not exist

[phunt] ZOOKEEPER-421. zkpython run_tests.sh is missing #!

------------------------------------------
[...truncated 264 lines...]
     [exec] 
     [exec] 
     [exec] /home/hudson/tools/ant/latest/bin/ant  -Dfindbugs.home=/home/nigel/tools/findbugs/latest -Djava5.home=/home/hudson/tools/java/latest1.5 -Dforrest.home=/home/nigel/tools/forrest/latest -DZooKeeperPatchProcess= findbugs
     [exec] Buildfile: build.xml
     [exec] 
     [exec] check-for-findbugs:
     [exec] 
     [exec] clover.setup:
     [exec] 
     [exec] clover.info:
     [exec] 
     [exec] clover:
     [exec] 
     [exec] init:
     [exec] 
     [exec] jute:
     [exec] 
     [exec] compile_jute_uptodate:
     [exec] 
     [exec] compile_jute:
     [exec] 
     [exec] ver-gen:
     [exec] 
     [exec] svn-revision:
     [exec] 
     [exec] version-info:
     [exec] 
     [exec] build-generated:
     [exec]     [javac] Compiling 1 source file to http://hudson.zones.apache.org/hudson/job/Zookeeper-Patch-vesta.apache.org/ws/trunk/build/classes 
     [exec] 
     [exec] compile-main:
     [exec]      [copy] Copying 1 file to http://hudson.zones.apache.org/hudson/job/Zookeeper-Patch-vesta.apache.org/ws/trunk/build/classes 
     [exec] 
     [exec] compile-extra:
     [exec] 
     [exec] compile:
     [exec] 
     [exec] jar:
     [exec]       [jar] Building jar: http://hudson.zones.apache.org/hudson/job/Zookeeper-Patch-vesta.apache.org/ws/trunk/zookeeper-dev.jar 
     [exec] 
     [exec] findbugs:
     [exec]     [mkdir] Created dir: http://hudson.zones.apache.org/hudson/job/Zookeeper-Patch-vesta.apache.org/ws/trunk/build/test/findbugs 
     [exec]  [findbugs] Executing findbugs from ant task
     [exec]  [findbugs] Running FindBugs...
     [exec]  [findbugs] The following classes needed for analysis were missing:
     [exec]  [findbugs]   jline.Completor
     [exec]  [findbugs] Warnings generated: 1
     [exec]  [findbugs] Missing classes: 2
     [exec]  [findbugs] Calculating exit code...
     [exec]  [findbugs] Setting 'missing class' flag (2)
     [exec]  [findbugs] Setting 'bugs found' flag (1)
     [exec]  [findbugs] Exit code set to: 3
     [exec]  [findbugs] Java Result: 3
     [exec]  [findbugs] Classes needed for analysis were missing
     [exec]  [findbugs] Output saved to http://hudson.zones.apache.org/hudson/job/Zookeeper-Patch-vesta.apache.org/ws/trunk/build/test/findbugs/zookeeper-findbugs-report.xml 
     [exec]      [xslt] Processing http://hudson.zones.apache.org/hudson/job/Zookeeper-Patch-vesta.apache.org/ws/trunk/build/test/findbugs/zookeeper-findbugs-report.xml  to http://hudson.zones.apache.org/hudson/job/Zookeeper-Patch-vesta.apache.org/ws/trunk/build/test/findbugs/zookeeper-findbugs-report.html 
     [exec]      [xslt] Loading stylesheet /home/nigel/tools/findbugs/latest/src/xsl/default.xsl
     [exec] 
     [exec] BUILD SUCCESSFUL
     [exec] Total time: 29 seconds
     [exec] Starting with http://hudson.zones.apache.org/hudson/job/Zookeeper-Patch-vesta.apache.org/ws/patchprocess/trunkFindbugsWarnings.xml 
     [exec] Merging http://hudson.zones.apache.org/hudson/job/Zookeeper-Patch-vesta.apache.org/ws/patchprocess/patchFindbugsWarnings.xml 
     [exec] 
     [exec] 
     [exec] ======================================================================
     [exec] ======================================================================
     [exec]     Determining number of patched release audit warnings.
     [exec] ======================================================================
     [exec] ======================================================================
     [exec] 
     [exec] 
     [exec] /home/hudson/tools/ant/latest/bin/ant  -Djava5.home=/home/hudson/tools/java/latest1.5 -Dforrest.home=/home/nigel/tools/forrest/latest -DZooKeeperPatchProcess= releaseaudit > http://hudson.zones.apache.org/hudson/job/Zookeeper-Patch-vesta.apache.org/ws/patchprocess/patchReleaseAuditWarnings.txt  2>&1
     [exec] 
     [exec] 
     [exec] There appear to be 171 release audit warnings before the patch and 0 release audit warnings after applying the patch.
     [exec] 
     [exec] 
     [exec] ======================================================================
     [exec] ======================================================================
     [exec]     Running core tests.
     [exec] ======================================================================
     [exec] ======================================================================
     [exec] 
     [exec] 
     [exec] Warning: bad ps syntax, perhaps a bogus '-'? See http://procps.sf.net/faq.html
     [exec] /bin/kill -9 14091 
     [exec] kill: No such process
     [exec] /home/hudson/tools/ant/latest/bin/ant  -DZooKeeperPatchProcess= -Dtest.junit.output.format=xml -Dtest.output=yes -Dcompile.c++=yes -Dforrest.home=/home/nigel/tools/forrest/latest -Djava5.home=/home/hudson/tools/java/latest1.5  test-core
     [exec] Buildfile: build.xml
     [exec] 
     [exec] clover.setup:
     [exec] 
     [exec] clover.info:
     [exec] 
     [exec] clover:
     [exec] 
     [exec] init:
     [exec] 
     [exec] jute:
     [exec] 
     [exec] compile_jute_uptodate:
     [exec] 
     [exec] compile_jute:
     [exec] 
     [exec] ver-gen:
     [exec] 
     [exec] svn-revision:
     [exec] 
     [exec] version-info:
     [exec] 
     [exec] build-generated:
     [exec]     [javac] Compiling 1 source file to http://hudson.zones.apache.org/hudson/job/Zookeeper-Patch-vesta.apache.org/ws/trunk/build/classes 
     [exec] 
     [exec] compile-main:
     [exec]      [copy] Copying 1 file to http://hudson.zones.apache.org/hudson/job/Zookeeper-Patch-vesta.apache.org/ws/trunk/build/classes 
     [exec] 
     [exec] compile-extra:
     [exec] 
     [exec] compile:
     [exec] 
     [exec] jar:
     [exec]       [jar] Building jar: http://hudson.zones.apache.org/hudson/job/Zookeeper-Patch-vesta.apache.org/ws/trunk/zookeeper-dev.jar 
     [exec] 
     [exec] test-classpath:
     [exec] 
     [exec] compile-test:
     [exec]     [javac] Compiling 46 source files to http://hudson.zones.apache.org/hudson/job/Zookeeper-Patch-vesta.apache.org/ws/trunk/build/testclasses 
     [exec]     [javac] http://hudson.zones.apache.org/hudson/job/Zookeeper-Patch-vesta.apache.org/ws/trunk/src/java/test/org/apache/zookeeper/server/CRCTest.java :122: cannot assign a value to final variable snapCount
     [exec]     [javac]         SyncRequestProcessor.snapCount = 150;
     [exec]     [javac]                             ^
     [exec]     [javac] http://hudson.zones.apache.org/hudson/job/Zookeeper-Patch-vesta.apache.org/ws/trunk/src/java/test/org/apache/zookeeper/server/InvalidSnapshotTest.java :55: cannot assign a value to final variable snapCount
     [exec]     [javac]        SyncRequestProcessor.snapCount = 100;
     [exec]     [javac]                            ^
     [exec]     [javac] http://hudson.zones.apache.org/hudson/job/Zookeeper-Patch-vesta.apache.org/ws/trunk/src/java/test/org/apache/zookeeper/server/InvalidSnapshotTest.java :76: cannot assign a value to final variable snapCount
     [exec]     [javac]        SyncRequestProcessor.snapCount = 100;
     [exec]     [javac]                            ^
     [exec]     [javac] http://hudson.zones.apache.org/hudson/job/Zookeeper-Patch-vesta.apache.org/ws/trunk/src/java/test/org/apache/zookeeper/test/ACLTest.java :67: cannot assign a value to final variable snapCount
     [exec]     [javac]         SyncRequestProcessor.snapCount = 1000;
     [exec]     [javac]                             ^
     [exec]     [javac] http://hudson.zones.apache.org/hudson/job/Zookeeper-Patch-vesta.apache.org/ws/trunk/src/java/test/org/apache/zookeeper/test/ClientTest.java :535: cannot assign a value to final variable failCreate
     [exec]     [javac]         PrepRequestProcessor.failCreate = true;
     [exec]     [javac]                             ^
     [exec]     [javac] http://hudson.zones.apache.org/hudson/job/Zookeeper-Patch-vesta.apache.org/ws/trunk/src/java/test/org/apache/zookeeper/test/ClientTest.java :542: cannot assign a value to final variable failCreate
     [exec]     [javac]         PrepRequestProcessor.failCreate = false;
     [exec]     [javac]                             ^
     [exec]     [javac] http://hudson.zones.apache.org/hudson/job/Zookeeper-Patch-vesta.apache.org/ws/trunk/src/java/test/org/apache/zookeeper/test/InvalidSnapshotTest.java :61: cannot assign a value to final variable snapCount
     [exec]     [javac]         SyncRequestProcessor.snapCount = 1000;
     [exec]     [javac]                             ^
     [exec]     [javac] http://hudson.zones.apache.org/hudson/job/Zookeeper-Patch-vesta.apache.org/ws/trunk/src/java/test/org/apache/zookeeper/test/PurgeTxnTest.java :55: cannot assign a value to final variable snapCount
     [exec]     [javac]         SyncRequestProcessor.snapCount = 100;
     [exec]     [javac]                             ^
     [exec]     [javac] http://hudson.zones.apache.org/hudson/job/Zookeeper-Patch-vesta.apache.org/ws/trunk/src/java/test/org/apache/zookeeper/test/RecoveryTest.java :78: cannot assign a value to final variable snapCount
     [exec]     [javac]         SyncRequestProcessor.snapCount = 1000;
     [exec]     [javac]                             ^
     [exec]     [javac] http://hudson.zones.apache.org/hudson/job/Zookeeper-Patch-vesta.apache.org/ws/trunk/src/java/test/org/apache/zookeeper/test/RecoveryTest.java :193: cannot assign a value to final variable snapCount
     [exec]     [javac]             SyncRequestProcessor.snapCount = oldSnapCount;
     [exec]     [javac]                                 ^
     [exec]     [javac] http://hudson.zones.apache.org/hudson/job/Zookeeper-Patch-vesta.apache.org/ws/trunk/src/java/test/org/apache/zookeeper/test/UpgradeTest.java :69: cannot assign a value to final variable snapCount
     [exec]     [javac]         SyncRequestProcessor.snapCount = 1000;
     [exec]     [javac]                             ^
     [exec]     [javac] http://hudson.zones.apache.org/hudson/job/Zookeeper-Patch-vesta.apache.org/ws/trunk/src/java/test/org/apache/zookeeper/test/WatcherTest.java :201: cannot assign a value to final variable disableAutoWatchReset
     [exec]     [javac]         ClientCnxn.disableAutoWatchReset = true;
     [exec]     [javac]                   ^
     [exec]     [javac] http://hudson.zones.apache.org/hudson/job/Zookeeper-Patch-vesta.apache.org/ws/trunk/src/java/test/org/apache/zookeeper/test/WatcherTest.java :207: cannot assign a value to final variable disableAutoWatchReset
     [exec]     [javac]         ClientCnxn.disableAutoWatchReset = true;
     [exec]     [javac]                   ^
     [exec]     [javac] 13 errors
     [exec] 
     [exec] BUILD FAILED
     [exec] http://hudson.zones.apache.org/hudson/job/Zookeeper-Patch-vesta.apache.org/ws/trunk/build.xml :289: Compile failed; see the compiler error output for details.
     [exec] 
     [exec] Total time: 2 seconds
     [exec] 
     [exec] 
     [exec] ======================================================================
     [exec] ======================================================================
     [exec]     Running contrib tests.
     [exec] ======================================================================
     [exec] ======================================================================
     [exec] 
     [exec] 
     [exec] Warning: bad ps syntax, perhaps a bogus '-'? See http://procps.sf.net/faq.html
     [exec] /bin/kill -9 14180 
     [exec] kill: No such process
     [exec] /home/hudson/tools/ant/latest/bin/ant  -Declipse.home=/home/nigel/tools/eclipse/latest -Dpython.home=/home/nigel/tools/python/latest -DZooKeeperPatchProcess= -Dtest.junit.output.format=xml -Dtest.output=yes test-contrib
     [exec] Buildfile: build.xml
     [exec] 
     [exec] test-contrib:
     [exec] 
     [exec] BUILD SUCCESSFUL
     [exec] Total time: 0 seconds
     [exec] 
     [exec] 
     [exec] 
     [exec] 
     [exec] -1 overall.  Here are the results of testing the latest attachment 
     [exec]   http://issues.apache.org/jira/secure/attachment/12409680/ZOOKEEPER-408.patch
     [exec]   against trunk revision 781173.
     [exec] 
     [exec]     +1 @author.  The patch does not contain any @author tags.
     [exec] 
     [exec]     +1 tests included.  The patch appears to include 27 new or modified tests.
     [exec] 
     [exec]     +1 javadoc.  The javadoc tool did not generate any warning messages.
     [exec] 
     [exec]     +1 javac.  The applied patch does not increase the total number of javac compiler warnings.
     [exec] 
     [exec]     +1 findbugs.  The patch does not introduce any new Findbugs warnings.
     [exec] 
     [exec]     +1 release audit.  The applied patch does not increase the total number of release audit warnings.
     [exec] 
     [exec]     -1 core tests.  The patch failed core unit tests.
     [exec] 
     [exec]     +1 contrib tests.  The patch passed contrib unit tests.
     [exec] 
     [exec] Test results: http://hudson.zones.apache.org/hudson/job/Zookeeper-Patch-vesta.apache.org/99/testReport/
     [exec] Findbugs warnings: http://hudson.zones.apache.org/hudson/job/Zookeeper-Patch-vesta.apache.org/99/artifact/trunk/build/test/findbugs/newPatchFindbugsWarnings.html
     [exec] Console output: http://hudson.zones.apache.org/hudson/job/Zookeeper-Patch-vesta.apache.org/99/console
     [exec] 
     [exec] This message is automatically generated.
     [exec] 
     [exec] 
     [exec] ======================================================================
     [exec] ======================================================================
     [exec]     Adding comment to Jira.
     [exec] ======================================================================
     [exec] ======================================================================
     [exec] 
     [exec] 
     [exec]   % Total    % Received % Xferd  Average Speed   Time    Time     Time  Current
     [exec]                                  Dload  Upload   Total   Spent    Left  Speed
     [exec] 
     [exec]   0     0    0     0    0     0      0      0 --:--:-- --:--:-- --:--:--     0  0     0    0     0    0     0      0      0 --:--:-- --:--:-- --:--:--     0
     [exec] 
     [exec] 
     [exec] ======================================================================
     [exec] ======================================================================
     [exec]     Finished build.
     [exec] ======================================================================
     [exec] ======================================================================
     [exec] 
     [exec] 

BUILD FAILED
http://hudson.zones.apache.org/hudson/job/Zookeeper-Patch-vesta.apache.org/ws/trunk/build.xml :958: exec returned: 1

Total time: 2 minutes 28 seconds
Recording test results
Description found: ZOOKEEPER-408


Hudson build is back to normal: Zookeeper-Patch-vesta.apache.org #102

Posted by Apache Hudson Server <hu...@hudson.zones.apache.org>.
See http://hudson.zones.apache.org/hudson/job/Zookeeper-Patch-vesta.apache.org/102/



Build failed in Hudson: Zookeeper-Patch-vesta.apache.org #101

Posted by Apache Hudson Server <hu...@hudson.zones.apache.org>.
See http://hudson.zones.apache.org/hudson/job/Zookeeper-Patch-vesta.apache.org/101/changes

Changes:

[breed] reverting ZOOKEEPER-408 patch since it breaks the build

[breed] ZOOKEEPER-406. address all findbugs warnings in persistence classes

[gkesavan] Fixes broken Releaseaudit link

------------------------------------------
[...truncated 114720 lines...]
     [exec]     [junit] 2009-06-03 18:10:53,300 - INFO  [SyncThread:0:SyncRequestProcessor@118] - SyncRequestProcessor exited!
     [exec]     [junit] ensureOnly:[]
     [exec]     [junit] 2009-06-03 18:10:53,399 - INFO  [main:ClientBase@317] - STARTING server
     [exec]     [junit] 2009-06-03 18:10:53,400 - INFO  [main:ZooKeeperServer@160] - Created server
     [exec]     [junit] 2009-06-03 18:10:53,400 - INFO  [main:FileSnap@81] - Reading snapshot http://hudson.zones.apache.org/hudson/job/Zookeeper-Patch-vesta.apache.org/ws/trunk/build/test/tmp/test6352329893071795543.junit.dir/version-2/snapshot.0 
     [exec]     [junit] 2009-06-03 18:10:53,402 - INFO  [main:FileTxnSnapLog@198] - Snapshotting: 3
     [exec]     [junit] 2009-06-03 18:10:53,427 - INFO  [NIOServerCxn.Factory:33221:NIOServerCnxn@690] - Processing stat command from /127.0.0.1:39270
     [exec]     [junit] ensureOnly:[InMemoryDataTree, StandaloneServer_port]
     [exec]     [junit] 2009-06-03 18:10:53,428 - WARN  [NIOServerCxn.Factory:33221:NIOServerCnxn@488] - Exception causing close of session 0x0 due to java.io.IOException: Responded to info probe
     [exec]     [junit] 2009-06-03 18:10:53,428 - INFO  [NIOServerCxn.Factory:33221:NIOServerCnxn@826] - closing session:0x0 NIOServerCnxn: java.nio.channels.SocketChannel[connected local=/127.0.0.1:33221 remote=/127.0.0.1:39270]
     [exec]     [junit] expect:InMemoryDataTree
     [exec]     [junit] found:InMemoryDataTree org.apache.ZooKeeperService:name0=StandaloneServer_port-1,name1=InMemoryDataTree
     [exec]     [junit] expect:StandaloneServer_port
     [exec]     [junit] found:StandaloneServer_port org.apache.ZooKeeperService:name0=StandaloneServer_port-1
     [exec]     [junit] 2009-06-03 18:10:54,000 - INFO  [SessionTracker:SessionTrackerImpl@141] - SessionTrackerImpl exited loop!
     [exec]     [junit] 2009-06-03 18:10:54,000 - INFO  [SessionTracker:SessionTrackerImpl@141] - SessionTrackerImpl exited loop!
     [exec]     [junit] 2009-06-03 18:10:54,779 - INFO  [main-SendThread:ClientCnxn$SendThread@821] - Attempting connection to server /127.0.0.1:33221
     [exec]     [junit] 2009-06-03 18:10:54,779 - INFO  [main-SendThread:ClientCnxn$SendThread@737] - Priming connection to java.nio.channels.SocketChannel[connected local=/127.0.0.1:39271 remote=/127.0.0.1:33221]
     [exec]     [junit] 2009-06-03 18:10:54,780 - INFO  [main-SendThread:ClientCnxn$SendThread@889] - Server connection successful
     [exec]     [junit] 2009-06-03 18:10:54,780 - INFO  [NIOServerCxn.Factory:33221:NIOServerCnxn@576] - Connected to /127.0.0.1:39271 lastZxid 3
     [exec]     [junit] 2009-06-03 18:10:54,781 - INFO  [NIOServerCxn.Factory:33221:NIOServerCnxn@955] - Finished init of 0x121a75104a20000 valid:true
     [exec]     [junit] 2009-06-03 18:10:54,781 - INFO  [NIOServerCxn.Factory:33221:NIOServerCnxn@604] - Renewing session 0x121a75104a20000
     [exec]     [junit] 2009-06-03 18:11:28,880 - INFO  [main:ClientBase@324] - STOPPING server
     [exec]     [junit] 2009-06-03 18:11:28,881 - INFO  [main:NIOServerCnxn@826] - closing session:0x121a75104a20000 NIOServerCnxn: java.nio.channels.SocketChannel[connected local=/127.0.0.1:33221 remote=/127.0.0.1:39271]
     [exec]     [junit] 2009-06-03 18:11:28,881 - WARN  [main-SendThread:ClientCnxn$SendThread@919] - Exception closing session 0x121a75104a20000 to sun.nio.ch.SelectionKeyImpl@1dfd90f
     [exec]     [junit] java.io.IOException: Read error rc = -1 java.nio.DirectByteBuffer[pos=0 lim=4 cap=4]
     [exec]     [junit] 	at org.apache.zookeeper.ClientCnxn$SendThread.doIO(ClientCnxn.java:653)
     [exec]     [junit] 	at org.apache.zookeeper.ClientCnxn$SendThread.run(ClientCnxn.java:897)
     [exec]     [junit] 2009-06-03 18:11:28,882 - INFO  [NIOServerCxn.Factory:33221:NIOServerCnxn$Factory@234] - NIOServerCnxn factory exited run method
     [exec]     [junit] 2009-06-03 18:11:28,882 - INFO  [main:FinalRequestProcessor@268] - shutdown of request processor complete
     [exec]     [junit] 2009-06-03 18:11:28,882 - INFO  [SyncThread:0:SyncRequestProcessor@118] - SyncRequestProcessor exited!
     [exec]     [junit] 2009-06-03 18:11:28,882 - INFO  [ProcessThread:-1:PrepRequestProcessor@109] - PrepRequestProcessor exited loop!
     [exec]     [junit] ensureOnly:[]
     [exec]     [junit] 2009-06-03 18:11:28,982 - INFO  [main:ClientBase@317] - STARTING server
     [exec]     [junit] 2009-06-03 18:11:28,982 - INFO  [main:ZooKeeperServer@160] - Created server
     [exec]     [junit] 2009-06-03 18:11:28,983 - INFO  [main:FileSnap@81] - Reading snapshot http://hudson.zones.apache.org/hudson/job/Zookeeper-Patch-vesta.apache.org/ws/trunk/build/test/tmp/test6352329893071795543.junit.dir/version-2/snapshot.3 
     [exec]     [junit] 2009-06-03 18:11:28,985 - INFO  [main:FileTxnSnapLog@198] - Snapshotting: 5
     [exec]     [junit] ensureOnly:[InMemoryDataTree, StandaloneServer_port]
     [exec]     [junit] 2009-06-03 18:11:28,987 - INFO  [NIOServerCxn.Factory:33221:NIOServerCnxn@690] - Processing stat command from /127.0.0.1:39274
     [exec]     [junit] 2009-06-03 18:11:28,987 - WARN  [NIOServerCxn.Factory:33221:NIOServerCnxn@488] - Exception causing close of session 0x0 due to java.io.IOException: Responded to info probe
     [exec]     [junit] 2009-06-03 18:11:28,988 - INFO  [NIOServerCxn.Factory:33221:NIOServerCnxn@826] - closing session:0x0 NIOServerCnxn: java.nio.channels.SocketChannel[connected local=/127.0.0.1:33221 remote=/127.0.0.1:39274]
     [exec]     [junit] expect:InMemoryDataTree
     [exec]     [junit] found:InMemoryDataTree org.apache.ZooKeeperService:name0=StandaloneServer_port-1,name1=InMemoryDataTree
     [exec]     [junit] expect:StandaloneServer_port
     [exec]     [junit] found:StandaloneServer_port org.apache.ZooKeeperService:name0=StandaloneServer_port-1
     [exec]     [junit] 2009-06-03 18:11:30,000 - INFO  [SessionTracker:SessionTrackerImpl@141] - SessionTrackerImpl exited loop!
     [exec]     [junit] 2009-06-03 18:11:30,417 - INFO  [main-SendThread:ClientCnxn$SendThread@821] - Attempting connection to server /127.0.0.1:33221
     [exec]     [junit] 2009-06-03 18:11:30,417 - INFO  [main-SendThread:ClientCnxn$SendThread@737] - Priming connection to java.nio.channels.SocketChannel[connected local=/127.0.0.1:39275 remote=/127.0.0.1:33221]
     [exec]     [junit] 2009-06-03 18:11:30,417 - INFO  [main-SendThread:ClientCnxn$SendThread@889] - Server connection successful
     [exec]     [junit] 2009-06-03 18:11:30,418 - INFO  [NIOServerCxn.Factory:33221:NIOServerCnxn@576] - Connected to /127.0.0.1:39275 lastZxid 5
     [exec]     [junit] 2009-06-03 18:11:30,418 - INFO  [NIOServerCxn.Factory:33221:NIOServerCnxn@955] - Finished init of 0x121a75104a20000 valid:true
     [exec]     [junit] 2009-06-03 18:11:30,418 - INFO  [NIOServerCxn.Factory:33221:NIOServerCnxn@604] - Renewing session 0x121a75104a20000
     [exec]     [junit] 2009-06-03 18:11:30,495 - INFO  [main:ClientBase@324] - STOPPING server
     [exec]     [junit] 2009-06-03 18:11:30,496 - INFO  [main:NIOServerCnxn@826] - closing session:0x121a75104a20000 NIOServerCnxn: java.nio.channels.SocketChannel[connected local=/127.0.0.1:33221 remote=/127.0.0.1:39275]
     [exec]     [junit] 2009-06-03 18:11:30,496 - WARN  [main-SendThread:ClientCnxn$SendThread@919] - Exception closing session 0x121a75104a20000 to sun.nio.ch.SelectionKeyImpl@1fac852
     [exec]     [junit] java.io.IOException: Read error rc = -1 java.nio.DirectByteBuffer[pos=0 lim=4 cap=4]
     [exec]     [junit] 	at org.apache.zookeeper.ClientCnxn$SendThread.doIO(ClientCnxn.java:653)
     [exec]     [junit] 	at org.apache.zookeeper.ClientCnxn$SendThread.run(ClientCnxn.java:897)
     [exec]     [junit] 2009-06-03 18:11:30,496 - INFO  [NIOServerCxn.Factory:33221:NIOServerCnxn$Factory@234] - NIOServerCnxn factory exited run method
     [exec]     [junit] 2009-06-03 18:11:30,497 - INFO  [main:FinalRequestProcessor@268] - shutdown of request processor complete
     [exec]     [junit] 2009-06-03 18:11:30,497 - INFO  [SyncThread:0:SyncRequestProcessor@118] - SyncRequestProcessor exited!
     [exec]     [junit] 2009-06-03 18:11:30,497 - INFO  [ProcessThread:-1:PrepRequestProcessor@109] - PrepRequestProcessor exited loop!
     [exec]     [junit] ensureOnly:[]
     [exec]     [junit] 2009-06-03 18:11:30,596 - INFO  [main:ClientBase@317] - STARTING server
     [exec]     [junit] 2009-06-03 18:11:30,597 - INFO  [main:ZooKeeperServer@160] - Created server
     [exec]     [junit] 2009-06-03 18:11:30,598 - INFO  [main:FileSnap@81] - Reading snapshot http://hudson.zones.apache.org/hudson/job/Zookeeper-Patch-vesta.apache.org/ws/trunk/build/test/tmp/test6352329893071795543.junit.dir/version-2/snapshot.5 
     [exec]     [junit] 2009-06-03 18:11:30,600 - INFO  [main:FileTxnSnapLog@198] - Snapshotting: 6
     [exec]     [junit] ensureOnly:[InMemoryDataTree, StandaloneServer_port]
     [exec]     [junit] 2009-06-03 18:11:30,602 - INFO  [NIOServerCxn.Factory:33221:NIOServerCnxn@690] - Processing stat command from /127.0.0.1:39277
     [exec]     [junit] 2009-06-03 18:11:30,602 - WARN  [NIOServerCxn.Factory:33221:NIOServerCnxn@488] - Exception causing close of session 0x0 due to java.io.IOException: Responded to info probe
     [exec]     [junit] 2009-06-03 18:11:30,602 - INFO  [NIOServerCxn.Factory:33221:NIOServerCnxn@826] - closing session:0x0 NIOServerCnxn: java.nio.channels.SocketChannel[connected local=/127.0.0.1:33221 remote=/127.0.0.1:39277]
     [exec]     [junit] expect:InMemoryDataTree
     [exec]     [junit] found:InMemoryDataTree org.apache.ZooKeeperService:name0=StandaloneServer_port-1,name1=InMemoryDataTree
     [exec]     [junit] expect:StandaloneServer_port
     [exec]     [junit] found:StandaloneServer_port org.apache.ZooKeeperService:name0=StandaloneServer_port-1
     [exec]     [junit] 2009-06-03 18:11:31,982 - INFO  [main-SendThread:ClientCnxn$SendThread@821] - Attempting connection to server /127.0.0.1:33221
     [exec]     [junit] 2009-06-03 18:11:31,982 - INFO  [main-SendThread:ClientCnxn$SendThread@737] - Priming connection to java.nio.channels.SocketChannel[connected local=/127.0.0.1:39278 remote=/127.0.0.1:33221]
     [exec]     [junit] 2009-06-03 18:11:31,983 - INFO  [main-SendThread:ClientCnxn$SendThread@889] - Server connection successful
     [exec]     [junit] 2009-06-03 18:11:31,983 - INFO  [NIOServerCxn.Factory:33221:NIOServerCnxn@576] - Connected to /127.0.0.1:39278 lastZxid 6
     [exec]     [junit] 2009-06-03 18:11:31,983 - INFO  [NIOServerCxn.Factory:33221:NIOServerCnxn@955] - Finished init of 0x121a75104a20000 valid:true
     [exec]     [junit] 2009-06-03 18:11:31,983 - INFO  [NIOServerCxn.Factory:33221:NIOServerCnxn@604] - Renewing session 0x121a75104a20000
     [exec]     [junit] 2009-06-03 18:11:33,000 - INFO  [SessionTracker:SessionTrackerImpl@141] - SessionTrackerImpl exited loop!
     [exec]     [junit] 2009-06-03 18:11:43,058 - INFO  [main:ZooKeeper@437] - Closing session: 0x121a75104a20000
     [exec]     [junit] 2009-06-03 18:11:43,058 - INFO  [main:ClientCnxn@1020] - Closing ClientCnxn for session: 0x121a75104a20000
     [exec]     [junit] 2009-06-03 18:11:43,060 - INFO  [ProcessThread:-1:PrepRequestProcessor@363] - Processed session termination request for id: 0x121a75104a20000
     [exec]     [junit] 2009-06-03 18:11:43,092 - INFO  [SyncThread:0:NIOServerCnxn@826] - closing session:0x121a75104a20000 NIOServerCnxn: java.nio.channels.SocketChannel[connected local=/127.0.0.1:33221 remote=/127.0.0.1:39278]
     [exec]     [junit] 2009-06-03 18:11:43,092 - INFO  [main-SendThread:ClientCnxn$SendThread@913] - Exception while closing send thread for session 0x121a75104a20000 : Read error rc = -1 java.nio.DirectByteBuffer[pos=0 lim=4 cap=4]
     [exec]     [junit] 2009-06-03 18:11:43,193 - INFO  [main:ClientCnxn@1006] - Disconnecting ClientCnxn for session: 0x121a75104a20000
     [exec]     [junit] 2009-06-03 18:11:43,193 - INFO  [main:ZooKeeper@445] - Session: 0x121a75104a20000 closed
     [exec]     [junit] 2009-06-03 18:11:43,193 - INFO  [main-EventThread:ClientCnxn$EventThread@473] - EventThread shut down
     [exec]     [junit] 2009-06-03 18:11:43,193 - INFO  [main:ClientBase@333] - tearDown starting
     [exec]     [junit] 2009-06-03 18:11:43,193 - INFO  [main:ClientBase@324] - STOPPING server
     [exec]     [junit] 2009-06-03 18:11:43,195 - INFO  [NIOServerCxn.Factory:33221:NIOServerCnxn$Factory@234] - NIOServerCnxn factory exited run method
     [exec]     [junit] 2009-06-03 18:11:43,195 - INFO  [main:FinalRequestProcessor@268] - shutdown of request processor complete
     [exec]     [junit] ensureOnly:[]
     [exec]     [junit] 2009-06-03 18:11:43,195 - INFO  [ProcessThread:-1:PrepRequestProcessor@109] - PrepRequestProcessor exited loop!
     [exec]     [junit] 2009-06-03 18:11:43,195 - INFO  [SyncThread:0:SyncRequestProcessor@118] - SyncRequestProcessor exited!
     [exec]     [junit] 2009-06-03 18:11:43,198 - INFO  [main:ClientBase@345] - FINISHED testWatcherAutoResetDisabledWithLocal
     [exec]     [junit] Tests run: 6, Failures: 0, Errors: 0, Time elapsed: 127.372 sec
     [exec]     [junit] Running org.apache.zookeeper.test.ZooKeeperQuotaTest
     [exec]     [junit] 2009-06-03 18:11:43,835 - INFO  [main:ClientBase@303] - STARTING testQuota
     [exec]     [junit] 2009-06-03 18:11:43,982 - INFO  [main:ClientBase@317] - STARTING server
     [exec]     [junit] 2009-06-03 18:11:43,987 - INFO  [main:Environment@97] - Server environment:zookeeper.version=3.2.0-781488, built on 06/03/2009 17:58 GMT
     [exec]     [junit] 2009-06-03 18:11:43,987 - INFO  [main:Environment@97] - Server environment:host.name=vesta.apache.org
     [exec]     [junit] 2009-06-03 18:11:43,988 - INFO  [main:Environment@97] - Server environment:java.version=1.6.0_11
     [exec]     [junit] 2009-06-03 18:11:43,988 - INFO  [main:Environment@97] - Server environment:java.vendor=Sun Microsystems Inc.
     [exec]     [junit] 2009-06-03 18:11:43,990 - INFO  [main:Environment@97] - Server environment:java.home=/home/hudson/tools/java/jdk1.6.0_11-32/jre
     [exec]     [junit] 2009-06-03 18:11:43,991 - INFO  [main:Environment@97] - Server environment:java.class.path=http://hudson.zones.apache.org/hudson/job/Zookeeper-Patch-vesta.apache.org/ws/trunk/zookeeper-dev.jar :http://hudson.zones.apache.org/hudson/job/Zookeeper-Patch-vesta.apache.org/ws/trunk/src/java/lib/jdiff-1.0.9.jar :http://hudson.zones.apache.org/hudson/job/Zookeeper-Patch-vesta.apache.org/ws/trunk/src/java/lib/jline-0.9.94.jar :http://hudson.zones.apache.org/hudson/job/Zookeeper-Patch-vesta.apache.org/ws/trunk/src/java/lib/junit-4.4.jar :http://hudson.zones.apache.org/hudson/job/Zookeeper-Patch-vesta.apache.org/ws/trunk/src/java/lib/log4j-1.2.15.jar :http://hudson.zones.apache.org/hudson/job/Zookeeper-Patch-vesta.apache.org/ws/trunk/src/java/lib/rats.jar :http://hudson.zones.apache.org/hudson/job/Zookeeper-Patch-vesta.apache.org/ws/trunk/src/java/lib/xerces-1.4.4.jar :http://hudson.zones.apache.org/hudson/job/Zookeeper-Patch-vesta.apache.org/ws/trunk/build/testclasses :/home/hudson/tools/ant/apache-ant-1.7.1/lib/ant-launcher.jar:/home/hudson/tools/ant/latest/lib/ant.jar:/home/hudson/tools/ant/latest/lib/ant-junit.jar
     [exec]     [junit] 2009-06-03 18:11:43,994 - INFO  [main:Environment@97] - Server environment:java.library.path=/home/hudson/tools/java/jdk1.6.0_11-32/jre/lib/i386/server:/home/hudson/tools/java/jdk1.6.0_11-32/jre/lib/i386:/home/hudson/tools/java/jdk1.6.0_11-32/jre/../lib/i386:/usr/java/packages/lib/i386:/lib:/usr/lib
     [exec]     [junit] 2009-06-03 18:11:43,994 - INFO  [main:Environment@97] - Server environment:java.io.tmpdir=/tmp
     [exec]     [junit] 2009-06-03 18:11:43,995 - INFO  [main:Environment@97] - Server environment:java.compiler=<NA>
     [exec]     [junit] 2009-06-03 18:11:44,001 - INFO  [main:Environment@97] - Server environment:os.name=Linux
     [exec]     [junit] 2009-06-03 18:11:44,001 - INFO  [main:Environment@97] - Server environment:os.arch=i386
     [exec]     [junit] 2009-06-03 18:11:44,001 - INFO  [main:Environment@97] - Server environment:os.version=2.6.27-7-server
     [exec]     [junit] 2009-06-03 18:11:44,002 - INFO  [main:Environment@97] - Server environment:user.name=hudson
     [exec]     [junit] 2009-06-03 18:11:44,002 - INFO  [main:Environment@97] - Server environment:user.home=/home/hudson
     [exec]     [junit] 2009-06-03 18:11:44,002 - INFO  [main:Environment@97] - Server environment:user.dir=http://hudson.zones.apache.org/hudson/job/Zookeeper-Patch-vesta.apache.org/ws/trunk 
     [exec]     [junit] 2009-06-03 18:11:44,006 - INFO  [main:ZooKeeperServer@160] - Created server
     [exec]     [junit] 2009-06-03 18:11:44,038 - INFO  [main:FileTxnSnapLog@198] - Snapshotting: 0
     [exec]     [junit] 2009-06-03 18:11:44,057 - INFO  [NIOServerCxn.Factory:33221:NIOServerCnxn@690] - Processing stat command from /127.0.0.1:39282
     [exec]     [junit] 2009-06-03 18:11:44,058 - WARN  [NIOServerCxn.Factory:33221:NIOServerCnxn@488] - Exception causing close of session 0x0 due to java.io.IOException: Responded to info probe
     [exec]     [junit] 2009-06-03 18:11:44,058 - INFO  [NIOServerCxn.Factory:33221:NIOServerCnxn@826] - closing session:0x0 NIOServerCnxn: java.nio.channels.SocketChannel[connected local=/127.0.0.1:33221 remote=/127.0.0.1:39282]
     [exec]     [junit] ensureOnly:[InMemoryDataTree, StandaloneServer_port]
     [exec]     [junit] expect:InMemoryDataTree
     [exec]     [junit] found:InMemoryDataTree org.apache.ZooKeeperService:name0=StandaloneServer_port-1,name1=InMemoryDataTree
     [exec]     [junit] expect:StandaloneServer_port
     [exec]     [junit] found:StandaloneServer_port org.apache.ZooKeeperService:name0=StandaloneServer_port-1
     [exec]     [junit] 2009-06-03 18:11:44,091 - INFO  [main:ClientBase@313] - Client test setup finished
     [exec]     [junit] 2009-06-03 18:11:44,094 - INFO  [main:Environment@97] - Client environment:zookeeper.version=3.2.0-781488, built on 06/03/2009 17:58 GMT
     [exec]     [junit] 2009-06-03 18:11:44,094 - INFO  [main:Environment@97] - Client environment:host.name=vesta.apache.org
     [exec]     [junit] 2009-06-03 18:11:44,094 - INFO  [main:Environment@97] - Client environment:java.version=1.6.0_11
     [exec]     [junit] 2009-06-03 18:11:44,095 - INFO  [main:Environment@97] - Client environment:java.vendor=Sun Microsystems Inc.
     [exec]     [junit] 2009-06-03 18:11:44,095 - INFO  [main:Environment@97] - Client environment:java.home=/home/hudson/tools/java/jdk1.6.0_11-32/jre
     [exec]     [junit] 2009-06-03 18:11:44,095 - INFO  [main:Environment@97] - Client environment:java.class.path=http://hudson.zones.apache.org/hudson/job/Zookeeper-Patch-vesta.apache.org/ws/trunk/zookeeper-dev.jar :http://hudson.zones.apache.org/hudson/job/Zookeeper-Patch-vesta.apache.org/ws/trunk/src/java/lib/jdiff-1.0.9.jar :http://hudson.zones.apache.org/hudson/job/Zookeeper-Patch-vesta.apache.org/ws/trunk/src/java/lib/jline-0.9.94.jar :http://hudson.zones.apache.org/hudson/job/Zookeeper-Patch-vesta.apache.org/ws/trunk/src/java/lib/junit-4.4.jar :http://hudson.zones.apache.org/hudson/job/Zookeeper-Patch-vesta.apache.org/ws/trunk/src/java/lib/log4j-1.2.15.jar :http://hudson.zones.apache.org/hudson/job/Zookeeper-Patch-vesta.apache.org/ws/trunk/src/java/lib/rats.jar :http://hudson.zones.apache.org/hudson/job/Zookeeper-Patch-vesta.apache.org/ws/trunk/src/java/lib/xerces-1.4.4.jar :http://hudson.zones.apache.org/hudson/job/Zookeeper-Patch-vesta.apache.org/ws/trunk/build/testclasses :/home/hudson/tools/ant/apache-ant-1.7.1/lib/ant-launcher.jar:/home/hudson/tools/ant/latest/lib/ant.jar:/home/hudson/tools/ant/latest/lib/ant-junit.jar
     [exec]     [junit] 2009-06-03 18:11:44,096 - INFO  [main:Environment@97] - Client environment:java.library.path=/home/hudson/tools/java/jdk1.6.0_11-32/jre/lib/i386/server:/home/hudson/tools/java/jdk1.6.0_11-32/jre/lib/i386:/home/hudson/tools/java/jdk1.6.0_11-32/jre/../lib/i386:/usr/java/packages/lib/i386:/lib:/usr/lib
     [exec]     [junit] 2009-06-03 18:11:44,096 - INFO  [main:Environment@97] - Client environment:java.io.tmpdir=/tmp
     [exec]     [junit] 2009-06-03 18:11:44,096 - INFO  [main:Environment@97] - Client environment:java.compiler=<NA>
     [exec]     [junit] 2009-06-03 18:11:44,097 - INFO  [main:Environment@97] - Client environment:os.name=Linux
     [exec]     [junit] 2009-06-03 18:11:44,097 - INFO  [main:Environment@97] - Client environment:os.arch=i386
     [exec]     [junit] 2009-06-03 18:11:44,098 - INFO  [main:Environment@97] - Client environment:os.version=2.6.27-7-server
     [exec]     [junit] 2009-06-03 18:11:44,098 - INFO  [main:Environment@97] - Client environment:user.name=hudson
     [exec]     [junit] 2009-06-03 18:11:44,098 - INFO  [main:Environment@97] - Client environment:user.home=/home/hudson
     [exec]     [junit] 2009-06-03 18:11:44,099 - INFO  [main:Environment@97] - Client environment:user.dir=http://hudson.zones.apache.org/hudson/job/Zookeeper-Patch-vesta.apache.org/ws/trunk 
     [exec]     [junit] 2009-06-03 18:11:44,100 - INFO  [main:ZooKeeper@342] - Initiating client connection, host=127.0.0.1:33221 sessionTimeout=30000 watcher=org.apache.zookeeper.test.ClientBase$CountdownWatcher@a45536
     [exec]     [junit] 2009-06-03 18:11:44,101 - INFO  [main:ClientCnxn@91] - zookeeper.disableAutoWatchReset is false
     [exec]     [junit] 2009-06-03 18:11:44,106 - INFO  [main-SendThread:ClientCnxn$SendThread@821] - Attempting connection to server /127.0.0.1:33221
     [exec]     [junit] 2009-06-03 18:11:44,107 - INFO  [main-SendThread:ClientCnxn$SendThread@737] - Priming connection to java.nio.channels.SocketChannel[connected local=/127.0.0.1:39283 remote=/127.0.0.1:33221]
     [exec]     [junit] 2009-06-03 18:11:44,110 - INFO  [main-SendThread:ClientCnxn$SendThread@889] - Server connection successful
     [exec]     [junit] 2009-06-03 18:11:44,111 - INFO  [NIOServerCxn.Factory:33221:NIOServerCnxn@576] - Connected to /127.0.0.1:39283 lastZxid 0
     [exec]     [junit] 2009-06-03 18:11:44,112 - INFO  [NIOServerCxn.Factory:33221:NIOServerCnxn@607] - Creating new session 0x121a751cb2a0000
     [exec]     [junit] 2009-06-03 18:11:44,226 - INFO  [SyncThread:0:NIOServerCnxn@955] - Finished init of 0x121a751cb2a0000 valid:true
     [exec]     [junit] expect:0x121a751cb2a0000
     [exec]     [junit] found:0x121a751cb2a0000 org.apache.ZooKeeperService:name0=StandaloneServer_port-1,name1=Connections,name2=127.0.0.1,name3=0x121a751cb2a0000
     [exec]     [junit] 2009-06-03 18:11:44,320 - INFO  [main:ClientBase@333] - tearDown starting
     [exec]     [junit] 2009-06-03 18:11:44,321 - INFO  [main:ClientBase@324] - STOPPING server
     [exec]     [junit] 2009-06-03 18:11:44,322 - INFO  [main:NIOServerCnxn@826] - closing session:0x121a751cb2a0000 NIOServerCnxn: java.nio.channels.SocketChannel[connected local=/127.0.0.1:33221 remote=/127.0.0.1:39283]
     [exec]     [junit] 2009-06-03 18:11:44,323 - WARN  [main-SendThread:ClientCnxn$SendThread@919] - Exception closing session 0x121a751cb2a0000 to sun.nio.ch.SelectionKeyImpl@f30494
     [exec]     [junit] java.io.IOException: Read error rc = -1 java.nio.DirectByteBuffer[pos=0 lim=4 cap=4]
     [exec]     [junit] 	at org.apache.zookeeper.ClientCnxn$SendThread.doIO(ClientCnxn.java:653)
     [exec]     [junit] 	at org.apache.zookeeper.ClientCnxn$SendThread.run(ClientCnxn.java:897)
     [exec]     [junit] 2009-06-03 18:11:44,323 - INFO  [NIOServerCxn.Factory:33221:NIOServerCnxn$Factory@234] - NIOServerCnxn factory exited run method
     [exec]     [junit] 2009-06-03 18:11:44,324 - INFO  [main:FinalRequestProcessor@268] - shutdown of request processor complete
     [exec]     [junit] 2009-06-03 18:11:44,324 - INFO  [SyncThread:0:SyncRequestProcessor@118] - SyncRequestProcessor exited!
     [exec]     [junit] 2009-06-03 18:11:44,324 - INFO  [ProcessThread:-1:PrepRequestProcessor@109] - PrepRequestProcessor exited loop!
     [exec]     [junit] ensureOnly:[]
     [exec]     [junit] 2009-06-03 18:11:44,334 - INFO  [main:ClientBase@345] - FINISHED testQuota
     [exec]     [junit] Tests run: 1, Failures: 0, Errors: 0, Time elapsed: 0.583 sec
     [exec] 
     [exec] BUILD FAILED
     [exec] http://hudson.zones.apache.org/hudson/job/Zookeeper-Patch-vesta.apache.org/ws/trunk/build.xml :644: Tests failed!
     [exec] 
     [exec] Total time: 11 minutes 54 seconds
     [exec] 
     [exec] 
     [exec] ======================================================================
     [exec] ======================================================================
     [exec]     Running contrib tests.
     [exec] ======================================================================
     [exec] ======================================================================
     [exec] 
     [exec] Warning: bad ps syntax, perhaps a bogus '-'? See http://procps.sf.net/faq.html
     [exec] 
     [exec] /bin/kill -9 10175 
     [exec] kill: No such process
     [exec] /home/hudson/tools/ant/latest/bin/ant  -Declipse.home=/home/nigel/tools/eclipse/latest -Dpython.home=/home/nigel/tools/python/latest -DZooKeeperPatchProcess= -Dtest.junit.output.format=xml -Dtest.output=yes test-contrib
     [exec] Buildfile: build.xml
     [exec] 
     [exec] test-contrib:
     [exec] 
     [exec] BUILD SUCCESSFUL
     [exec] Total time: 0 seconds
     [exec] 
     [exec] 
     [exec] 
     [exec] 
     [exec] -1 overall.  Here are the results of testing the latest attachment 
     [exec]   http://issues.apache.org/jira/secure/attachment/12409788/ZOOKEEPER-336.patch
     [exec]   against trunk revision 781266.
     [exec] 
     [exec]     +1 @author.  The patch does not contain any @author tags.
     [exec] 
     [exec]     +1 tests included.  The patch appears to include 23 new or modified tests.
     [exec] 
     [exec]     +1 javadoc.  The javadoc tool did not generate any warning messages.
     [exec] 
     [exec]     +1 javac.  The applied patch does not increase the total number of javac compiler warnings.
     [exec] 
     [exec]     +1 findbugs.  The patch does not introduce any new Findbugs warnings.
     [exec] 
     [exec]     +1 release audit.  The applied patch does not increase the total number of release audit warnings.
     [exec] 
     [exec]     -1 core tests.  The patch failed core unit tests.
     [exec] 
     [exec]     +1 contrib tests.  The patch passed contrib unit tests.
     [exec] 
     [exec] Test results: http://hudson.zones.apache.org/hudson/job/Zookeeper-Patch-vesta.apache.org/101/testReport/
     [exec] Findbugs warnings: http://hudson.zones.apache.org/hudson/job/Zookeeper-Patch-vesta.apache.org/101/artifact/trunk/build/test/findbugs/newPatchFindbugsWarnings.html
     [exec] Console output: http://hudson.zones.apache.org/hudson/job/Zookeeper-Patch-vesta.apache.org/101/console
     [exec] 
     [exec] This message is automatically generated.
     [exec] 
     [exec] 
     [exec] ======================================================================
     [exec] ======================================================================
     [exec]     Adding comment to Jira.
     [exec] ======================================================================
     [exec] ======================================================================
     [exec] 
     [exec] 
     [exec]   % Total    % Received % Xferd  Average Speed   Time    Time     Time  Current
     [exec]                                  Dload  Upload   Total   Spent    Left  Speed
     [exec] 
     [exec] 
     [exec] 
     [exec] ======================================================================
     [exec] ======================================================================
     [exec]     Finished build.
     [exec] ======================================================================
     [exec] ======================================================================
     [exec] 
     [exec] 
     [exec]   0     0    0     0    0     0      0      0 --:--:-- --:--:-- --:--:--     0  0     0    0     0    0     0      0      0 --:--:-- --:--:-- --:--:--     0

BUILD FAILED
http://hudson.zones.apache.org/hudson/job/Zookeeper-Patch-vesta.apache.org/ws/trunk/build.xml :958: exec returned: 1

Total time: 15 minutes 6 seconds
Recording test results
Description found: ZOOKEEPER-336


Build failed in Hudson: Zookeeper-Patch-vesta.apache.org #100

Posted by Apache Hudson Server <hu...@hudson.zones.apache.org>.
See http://hudson.zones.apache.org/hudson/job/Zookeeper-Patch-vesta.apache.org/100/

------------------------------------------
[...truncated 120775 lines...]
     [exec]      [exec] libtool: compile:  gcc -DHAVE_CONFIG_H -I. -Ihttp://hudson.zones.apache.org/hudson/job/Zookeeper-Patch-vesta.apache.org/ws/trunk/src/c  -Ihttp://hudson.zones.apache.org/hudson/job/Zookeeper-Patch-vesta.apache.org/ws/trunk/src/c/include  -Ihttp://hudson.zones.apache.org/hudson/job/Zookeeper-Patch-vesta.apache.org/ws/trunk/src/c/tests  -Ihttp://hudson.zones.apache.org/hudson/job/Zookeeper-Patch-vesta.apache.org/ws/trunk/src/c/generated  -DTHREADED -g -O2 -MT libzkmt_la-mt_adaptor.lo -MD -MP -MF .deps/libzkmt_la-mt_adaptor.Tpo -c http://hudson.zones.apache.org/hudson/job/Zookeeper-Patch-vesta.apache.org/ws/trunk/src/c/src/mt_adaptor.c  -o libzkmt_la-mt_adaptor.o >/dev/null 2>&1
     [exec]      [exec] mv -f .deps/libzkmt_la-mt_adaptor.Tpo .deps/libzkmt_la-mt_adaptor.Plo
     [exec]      [exec] /bin/bash ./libtool --tag=CC   --mode=link gcc -DTHREADED -g -O2   -o libzkmt.la  libzkmt_la-zookeeper.lo libzkmt_la-recordio.lo libzkmt_la-zookeeper.jute.lo libzkmt_la-zk_log.lo libzkmt_la-zk_hashtable.lo libzkmt_la-mt_adaptor.lo -lm 
     [exec]      [exec] libtool: link: ar cru .libs/libzkmt.a .libs/libzkmt_la-zookeeper.o .libs/libzkmt_la-recordio.o .libs/libzkmt_la-zookeeper.jute.o .libs/libzkmt_la-zk_log.o .libs/libzkmt_la-zk_hashtable.o .libs/libzkmt_la-mt_adaptor.o 
     [exec]      [exec] libtool: link: ranlib .libs/libzkmt.a
     [exec]      [exec] libtool: link: ( cd ".libs" && rm -f "libzkmt.la" && ln -s "../libzkmt.la" "libzkmt.la" )
     [exec]      [exec] /bin/bash ./libtool --tag=CC   --mode=link gcc -Wall -Werror  -g -O2 -no-undefined -version-info 2  -o libzookeeper_mt.la -rpath http://hudson.zones.apache.org/hudson/job/Zookeeper-Patch-vesta.apache.org/ws/trunk/build/test/test-cppunit/lib   libzkmt.la libhashtable.la -lpthread 
     [exec]      [exec] libtool: link: gcc -shared  -Wl,--whole-archive ./.libs/libzkmt.a ./.libs/libhashtable.a -Wl,--no-whole-archive  -lm -lpthread    -Wl,-soname -Wl,libzookeeper_mt.so.2 -o .libs/libzookeeper_mt.so.2.0.0
     [exec]      [exec] libtool: link: (cd ".libs" && rm -f "libzookeeper_mt.so.2" && ln -s "libzookeeper_mt.so.2.0.0" "libzookeeper_mt.so.2")
     [exec]      [exec] libtool: link: (cd ".libs" && rm -f "libzookeeper_mt.so" && ln -s "libzookeeper_mt.so.2.0.0" "libzookeeper_mt.so")
     [exec]      [exec] libtool: link: (cd .libs/libzookeeper_mt.lax/libzkmt.a && ar x "http://hudson.zones.apache.org/hudson/job/Zookeeper-Patch-vesta.apache.org/ws/trunk/build/test/test-cppunit/./.libs/libzkmt.a") 
     [exec]      [exec] libtool: link: (cd .libs/libzookeeper_mt.lax/libhashtable.a && ar x "http://hudson.zones.apache.org/hudson/job/Zookeeper-Patch-vesta.apache.org/ws/trunk/build/test/test-cppunit/./.libs/libhashtable.a") 
     [exec]      [exec] libtool: link: ar cru .libs/libzookeeper_mt.a   .libs/libzookeeper_mt.lax/libzkmt.a/libzkmt_la-zk_hashtable.o .libs/libzookeeper_mt.lax/libzkmt.a/libzkmt_la-zookeeper.jute.o .libs/libzookeeper_mt.lax/libzkmt.a/libzkmt_la-mt_adaptor.o .libs/libzookeeper_mt.lax/libzkmt.a/libzkmt_la-zk_log.o .libs/libzookeeper_mt.lax/libzkmt.a/libzkmt_la-recordio.o .libs/libzookeeper_mt.lax/libzkmt.a/libzkmt_la-zookeeper.o  .libs/libzookeeper_mt.lax/libhashtable.a/hashtable_itr.o .libs/libzookeeper_mt.lax/libhashtable.a/hashtable.o 
     [exec]      [exec] libtool: link: ranlib .libs/libzookeeper_mt.a
     [exec]      [exec] libtool: link: rm -fr .libs/libzookeeper_mt.lax
     [exec]      [exec] libtool: link: ( cd ".libs" && rm -f "libzookeeper_mt.la" && ln -s "../libzookeeper_mt.la" "libzookeeper_mt.la" )
     [exec]      [exec] gcc -DHAVE_CONFIG_H -I. -Ihttp://hudson.zones.apache.org/hudson/job/Zookeeper-Patch-vesta.apache.org/ws/trunk/src/c   -Ihttp://hudson.zones.apache.org/hudson/job/Zookeeper-Patch-vesta.apache.org/ws/trunk/src/c/include  -Ihttp://hudson.zones.apache.org/hudson/job/Zookeeper-Patch-vesta.apache.org/ws/trunk/src/c/tests  -Ihttp://hudson.zones.apache.org/hudson/job/Zookeeper-Patch-vesta.apache.org/ws/trunk/src/c/generated   -Wall -Werror  -g -O2 -MT cli.o -MD -MP -MF .deps/cli.Tpo -c -o cli.o `test -f 'src/cli.c' || echo 'http://hudson.zones.apache.org/hudson/job/Zookeeper-Patch-vesta.apache.org/ws/trunk/src/c/'`src/cli.c 
     [exec]      [exec] mv -f .deps/cli.Tpo .deps/cli.Po
     [exec]      [exec] /bin/bash ./libtool --tag=CC   --mode=link gcc -Wall -Werror  -g -O2   -o cli_st cli.o libzookeeper_st.la 
     [exec]      [exec] libtool: link: gcc -Wall -Werror -g -O2 -o .libs/cli_st cli.o  ./.libs/libzookeeper_st.so -lm -Wl,-rpath -Wl,http://hudson.zones.apache.org/hudson/job/Zookeeper-Patch-vesta.apache.org/ws/trunk/build/test/test-cppunit/lib 
     [exec]      [exec] gcc -DHAVE_CONFIG_H -I. -Ihttp://hudson.zones.apache.org/hudson/job/Zookeeper-Patch-vesta.apache.org/ws/trunk/src/c   -Ihttp://hudson.zones.apache.org/hudson/job/Zookeeper-Patch-vesta.apache.org/ws/trunk/src/c/include  -Ihttp://hudson.zones.apache.org/hudson/job/Zookeeper-Patch-vesta.apache.org/ws/trunk/src/c/tests  -Ihttp://hudson.zones.apache.org/hudson/job/Zookeeper-Patch-vesta.apache.org/ws/trunk/src/c/generated   -DTHREADED -g -O2 -MT cli_mt-cli.o -MD -MP -MF .deps/cli_mt-cli.Tpo -c -o cli_mt-cli.o `test -f 'src/cli.c' || echo 'http://hudson.zones.apache.org/hudson/job/Zookeeper-Patch-vesta.apache.org/ws/trunk/src/c/'`src/cli.c 
     [exec]      [exec] mv -f .deps/cli_mt-cli.Tpo .deps/cli_mt-cli.Po
     [exec]      [exec] /bin/bash ./libtool --tag=CC   --mode=link gcc -DTHREADED -g -O2   -o cli_mt cli_mt-cli.o libzookeeper_mt.la 
     [exec]      [exec] libtool: link: gcc -DTHREADED -g -O2 -o .libs/cli_mt cli_mt-cli.o  ./.libs/libzookeeper_mt.so -lm -lpthread -Wl,-rpath -Wl,http://hudson.zones.apache.org/hudson/job/Zookeeper-Patch-vesta.apache.org/ws/trunk/build/test/test-cppunit/lib 
     [exec]      [exec] gcc -DHAVE_CONFIG_H -I. -Ihttp://hudson.zones.apache.org/hudson/job/Zookeeper-Patch-vesta.apache.org/ws/trunk/src/c   -Ihttp://hudson.zones.apache.org/hudson/job/Zookeeper-Patch-vesta.apache.org/ws/trunk/src/c/include  -Ihttp://hudson.zones.apache.org/hudson/job/Zookeeper-Patch-vesta.apache.org/ws/trunk/src/c/tests  -Ihttp://hudson.zones.apache.org/hudson/job/Zookeeper-Patch-vesta.apache.org/ws/trunk/src/c/generated   -DTHREADED -g -O2 -MT load_gen-load_gen.o -MD -MP -MF .deps/load_gen-load_gen.Tpo -c -o load_gen-load_gen.o `test -f 'src/load_gen.c' || echo 'http://hudson.zones.apache.org/hudson/job/Zookeeper-Patch-vesta.apache.org/ws/trunk/src/c/'`src/load_gen.c 
     [exec]      [exec] mv -f .deps/load_gen-load_gen.Tpo .deps/load_gen-load_gen.Po
     [exec]      [exec] /bin/bash ./libtool --tag=CC   --mode=link gcc -DTHREADED -g -O2   -o load_gen load_gen-load_gen.o libzookeeper_mt.la 
     [exec]      [exec] libtool: link: gcc -DTHREADED -g -O2 -o .libs/load_gen load_gen-load_gen.o  ./.libs/libzookeeper_mt.so -lm -lpthread -Wl,-rpath -Wl,http://hudson.zones.apache.org/hudson/job/Zookeeper-Patch-vesta.apache.org/ws/trunk/build/test/test-cppunit/lib 
     [exec]      [exec] make  zktest-st zktest-mt
     [exec]      [exec] make[1]: Entering directory `http://hudson.zones.apache.org/hudson/job/Zookeeper-Patch-vesta.apache.org/ws/trunk/build/test/test-cppunit' 
     [exec]      [exec] g++ -DHAVE_CONFIG_H -I. -Ihttp://hudson.zones.apache.org/hudson/job/Zookeeper-Patch-vesta.apache.org/ws/trunk/src/c   -Ihttp://hudson.zones.apache.org/hudson/job/Zookeeper-Patch-vesta.apache.org/ws/trunk/src/c/include  -Ihttp://hudson.zones.apache.org/hudson/job/Zookeeper-Patch-vesta.apache.org/ws/trunk/src/c/tests  -Ihttp://hudson.zones.apache.org/hudson/job/Zookeeper-Patch-vesta.apache.org/ws/trunk/src/c/generated   -DUSE_STATIC_LIB -DZKSERVER_CMD="\"http://hudson.zones.apache.org/hudson/job/Zookeeper-Patch-vesta.apache.org/ws/trunk/src/c/tests/zkServer.sh\""  -Wall -g -MT zktest_st-TestDriver.o -MD -MP -MF .deps/zktest_st-TestDriver.Tpo -c -o zktest_st-TestDriver.o `test -f 'tests/TestDriver.cc' || echo 'http://hudson.zones.apache.org/hudson/job/Zookeeper-Patch-vesta.apache.org/ws/trunk/src/c/'`tests/TestDriver.cc 
     [exec]      [exec] mv -f .deps/zktest_st-TestDriver.Tpo .deps/zktest_st-TestDriver.Po
     [exec]      [exec] g++ -DHAVE_CONFIG_H -I. -Ihttp://hudson.zones.apache.org/hudson/job/Zookeeper-Patch-vesta.apache.org/ws/trunk/src/c   -Ihttp://hudson.zones.apache.org/hudson/job/Zookeeper-Patch-vesta.apache.org/ws/trunk/src/c/include  -Ihttp://hudson.zones.apache.org/hudson/job/Zookeeper-Patch-vesta.apache.org/ws/trunk/src/c/tests  -Ihttp://hudson.zones.apache.org/hudson/job/Zookeeper-Patch-vesta.apache.org/ws/trunk/src/c/generated   -DUSE_STATIC_LIB -DZKSERVER_CMD="\"http://hudson.zones.apache.org/hudson/job/Zookeeper-Patch-vesta.apache.org/ws/trunk/src/c/tests/zkServer.sh\""  -Wall -g -MT zktest_st-LibCMocks.o -MD -MP -MF .deps/zktest_st-LibCMocks.Tpo -c -o zktest_st-LibCMocks.o `test -f 'tests/LibCMocks.cc' || echo 'http://hudson.zones.apache.org/hudson/job/Zookeeper-Patch-vesta.apache.org/ws/trunk/src/c/'`tests/LibCMocks.cc 
     [exec]      [exec] mv -f .deps/zktest_st-LibCMocks.Tpo .deps/zktest_st-LibCMocks.Po
     [exec]      [exec] g++ -DHAVE_CONFIG_H -I. -Ihttp://hudson.zones.apache.org/hudson/job/Zookeeper-Patch-vesta.apache.org/ws/trunk/src/c   -Ihttp://hudson.zones.apache.org/hudson/job/Zookeeper-Patch-vesta.apache.org/ws/trunk/src/c/include  -Ihttp://hudson.zones.apache.org/hudson/job/Zookeeper-Patch-vesta.apache.org/ws/trunk/src/c/tests  -Ihttp://hudson.zones.apache.org/hudson/job/Zookeeper-Patch-vesta.apache.org/ws/trunk/src/c/generated   -DUSE_STATIC_LIB -DZKSERVER_CMD="\"http://hudson.zones.apache.org/hudson/job/Zookeeper-Patch-vesta.apache.org/ws/trunk/src/c/tests/zkServer.sh\""  -Wall -g -MT zktest_st-LibCSymTable.o -MD -MP -MF .deps/zktest_st-LibCSymTable.Tpo -c -o zktest_st-LibCSymTable.o `test -f 'tests/LibCSymTable.cc' || echo 'http://hudson.zones.apache.org/hudson/job/Zookeeper-Patch-vesta.apache.org/ws/trunk/src/c/'`tests/LibCSymTable.cc 
     [exec]      [exec] mv -f .deps/zktest_st-LibCSymTable.Tpo .deps/zktest_st-LibCSymTable.Po
     [exec]      [exec] g++ -DHAVE_CONFIG_H -I. -Ihttp://hudson.zones.apache.org/hudson/job/Zookeeper-Patch-vesta.apache.org/ws/trunk/src/c   -Ihttp://hudson.zones.apache.org/hudson/job/Zookeeper-Patch-vesta.apache.org/ws/trunk/src/c/include  -Ihttp://hudson.zones.apache.org/hudson/job/Zookeeper-Patch-vesta.apache.org/ws/trunk/src/c/tests  -Ihttp://hudson.zones.apache.org/hudson/job/Zookeeper-Patch-vesta.apache.org/ws/trunk/src/c/generated   -DUSE_STATIC_LIB -DZKSERVER_CMD="\"http://hudson.zones.apache.org/hudson/job/Zookeeper-Patch-vesta.apache.org/ws/trunk/src/c/tests/zkServer.sh\""  -Wall -g -MT zktest_st-MocksBase.o -MD -MP -MF .deps/zktest_st-MocksBase.Tpo -c -o zktest_st-MocksBase.o `test -f 'tests/MocksBase.cc' || echo 'http://hudson.zones.apache.org/hudson/job/Zookeeper-Patch-vesta.apache.org/ws/trunk/src/c/'`tests/MocksBase.cc 
     [exec]      [exec] mv -f .deps/zktest_st-MocksBase.Tpo .deps/zktest_st-MocksBase.Po
     [exec]      [exec] g++ -DHAVE_CONFIG_H -I. -Ihttp://hudson.zones.apache.org/hudson/job/Zookeeper-Patch-vesta.apache.org/ws/trunk/src/c   -Ihttp://hudson.zones.apache.org/hudson/job/Zookeeper-Patch-vesta.apache.org/ws/trunk/src/c/include  -Ihttp://hudson.zones.apache.org/hudson/job/Zookeeper-Patch-vesta.apache.org/ws/trunk/src/c/tests  -Ihttp://hudson.zones.apache.org/hudson/job/Zookeeper-Patch-vesta.apache.org/ws/trunk/src/c/generated   -DUSE_STATIC_LIB -DZKSERVER_CMD="\"http://hudson.zones.apache.org/hudson/job/Zookeeper-Patch-vesta.apache.org/ws/trunk/src/c/tests/zkServer.sh\""  -Wall -g -MT zktest_st-ZKMocks.o -MD -MP -MF .deps/zktest_st-ZKMocks.Tpo -c -o zktest_st-ZKMocks.o `test -f 'tests/ZKMocks.cc' || echo 'http://hudson.zones.apache.org/hudson/job/Zookeeper-Patch-vesta.apache.org/ws/trunk/src/c/'`tests/ZKMocks.cc 
     [exec]      [exec] mv -f .deps/zktest_st-ZKMocks.Tpo .deps/zktest_st-ZKMocks.Po
     [exec]      [exec] g++ -DHAVE_CONFIG_H -I. -Ihttp://hudson.zones.apache.org/hudson/job/Zookeeper-Patch-vesta.apache.org/ws/trunk/src/c   -Ihttp://hudson.zones.apache.org/hudson/job/Zookeeper-Patch-vesta.apache.org/ws/trunk/src/c/include  -Ihttp://hudson.zones.apache.org/hudson/job/Zookeeper-Patch-vesta.apache.org/ws/trunk/src/c/tests  -Ihttp://hudson.zones.apache.org/hudson/job/Zookeeper-Patch-vesta.apache.org/ws/trunk/src/c/generated   -DUSE_STATIC_LIB -DZKSERVER_CMD="\"http://hudson.zones.apache.org/hudson/job/Zookeeper-Patch-vesta.apache.org/ws/trunk/src/c/tests/zkServer.sh\""  -Wall -g -MT zktest_st-Util.o -MD -MP -MF .deps/zktest_st-Util.Tpo -c -o zktest_st-Util.o `test -f 'tests/Util.cc' || echo 'http://hudson.zones.apache.org/hudson/job/Zookeeper-Patch-vesta.apache.org/ws/trunk/src/c/'`tests/Util.cc 
     [exec]      [exec] mv -f .deps/zktest_st-Util.Tpo .deps/zktest_st-Util.Po
     [exec]      [exec] g++ -DHAVE_CONFIG_H -I. -Ihttp://hudson.zones.apache.org/hudson/job/Zookeeper-Patch-vesta.apache.org/ws/trunk/src/c   -Ihttp://hudson.zones.apache.org/hudson/job/Zookeeper-Patch-vesta.apache.org/ws/trunk/src/c/include  -Ihttp://hudson.zones.apache.org/hudson/job/Zookeeper-Patch-vesta.apache.org/ws/trunk/src/c/tests  -Ihttp://hudson.zones.apache.org/hudson/job/Zookeeper-Patch-vesta.apache.org/ws/trunk/src/c/generated   -DUSE_STATIC_LIB -DZKSERVER_CMD="\"http://hudson.zones.apache.org/hudson/job/Zookeeper-Patch-vesta.apache.org/ws/trunk/src/c/tests/zkServer.sh\""  -Wall -g -MT zktest_st-ThreadingUtil.o -MD -MP -MF .deps/zktest_st-ThreadingUtil.Tpo -c -o zktest_st-ThreadingUtil.o `test -f 'tests/ThreadingUtil.cc' || echo 'http://hudson.zones.apache.org/hudson/job/Zookeeper-Patch-vesta.apache.org/ws/trunk/src/c/'`tests/ThreadingUtil.cc 
     [exec]      [exec] mv -f .deps/zktest_st-ThreadingUtil.Tpo .deps/zktest_st-ThreadingUtil.Po
     [exec]      [exec] g++ -DHAVE_CONFIG_H -I. -Ihttp://hudson.zones.apache.org/hudson/job/Zookeeper-Patch-vesta.apache.org/ws/trunk/src/c   -Ihttp://hudson.zones.apache.org/hudson/job/Zookeeper-Patch-vesta.apache.org/ws/trunk/src/c/include  -Ihttp://hudson.zones.apache.org/hudson/job/Zookeeper-Patch-vesta.apache.org/ws/trunk/src/c/tests  -Ihttp://hudson.zones.apache.org/hudson/job/Zookeeper-Patch-vesta.apache.org/ws/trunk/src/c/generated   -DUSE_STATIC_LIB -DZKSERVER_CMD="\"http://hudson.zones.apache.org/hudson/job/Zookeeper-Patch-vesta.apache.org/ws/trunk/src/c/tests/zkServer.sh\""  -Wall -g -MT zktest_st-TestWatchers.o -MD -MP -MF .deps/zktest_st-TestWatchers.Tpo -c -o zktest_st-TestWatchers.o `test -f 'tests/TestWatchers.cc' || echo 'http://hudson.zones.apache.org/hudson/job/Zookeeper-Patch-vesta.apache.org/ws/trunk/src/c/'`tests/TestWatchers.cc 
     [exec]      [exec] mv -f .deps/zktest_st-TestWatchers.Tpo .deps/zktest_st-TestWatchers.Po
     [exec]      [exec] g++ -DHAVE_CONFIG_H -I. -Ihttp://hudson.zones.apache.org/hudson/job/Zookeeper-Patch-vesta.apache.org/ws/trunk/src/c   -Ihttp://hudson.zones.apache.org/hudson/job/Zookeeper-Patch-vesta.apache.org/ws/trunk/src/c/include  -Ihttp://hudson.zones.apache.org/hudson/job/Zookeeper-Patch-vesta.apache.org/ws/trunk/src/c/tests  -Ihttp://hudson.zones.apache.org/hudson/job/Zookeeper-Patch-vesta.apache.org/ws/trunk/src/c/generated   -DUSE_STATIC_LIB -DZKSERVER_CMD="\"http://hudson.zones.apache.org/hudson/job/Zookeeper-Patch-vesta.apache.org/ws/trunk/src/c/tests/zkServer.sh\""  -Wall -g -MT zktest_st-TestOperations.o -MD -MP -MF .deps/zktest_st-TestOperations.Tpo -c -o zktest_st-TestOperations.o `test -f 'tests/TestOperations.cc' || echo 'http://hudson.zones.apache.org/hudson/job/Zookeeper-Patch-vesta.apache.org/ws/trunk/src/c/'`tests/TestOperations.cc 
     [exec]      [exec] mv -f .deps/zktest_st-TestOperations.Tpo .deps/zktest_st-TestOperations.Po
     [exec]      [exec] g++ -DHAVE_CONFIG_H -I. -Ihttp://hudson.zones.apache.org/hudson/job/Zookeeper-Patch-vesta.apache.org/ws/trunk/src/c   -Ihttp://hudson.zones.apache.org/hudson/job/Zookeeper-Patch-vesta.apache.org/ws/trunk/src/c/include  -Ihttp://hudson.zones.apache.org/hudson/job/Zookeeper-Patch-vesta.apache.org/ws/trunk/src/c/tests  -Ihttp://hudson.zones.apache.org/hudson/job/Zookeeper-Patch-vesta.apache.org/ws/trunk/src/c/generated   -DUSE_STATIC_LIB -DZKSERVER_CMD="\"http://hudson.zones.apache.org/hudson/job/Zookeeper-Patch-vesta.apache.org/ws/trunk/src/c/tests/zkServer.sh\""  -Wall -g -MT zktest_st-TestZookeeperInit.o -MD -MP -MF .deps/zktest_st-TestZookeeperInit.Tpo -c -o zktest_st-TestZookeeperInit.o `test -f 'tests/TestZookeeperInit.cc' || echo 'http://hudson.zones.apache.org/hudson/job/Zookeeper-Patch-vesta.apache.org/ws/trunk/src/c/'`tests/TestZookeeperInit.cc 
     [exec]      [exec] mv -f .deps/zktest_st-TestZookeeperInit.Tpo .deps/zktest_st-TestZookeeperInit.Po
     [exec]      [exec] g++ -DHAVE_CONFIG_H -I. -Ihttp://hudson.zones.apache.org/hudson/job/Zookeeper-Patch-vesta.apache.org/ws/trunk/src/c   -Ihttp://hudson.zones.apache.org/hudson/job/Zookeeper-Patch-vesta.apache.org/ws/trunk/src/c/include  -Ihttp://hudson.zones.apache.org/hudson/job/Zookeeper-Patch-vesta.apache.org/ws/trunk/src/c/tests  -Ihttp://hudson.zones.apache.org/hudson/job/Zookeeper-Patch-vesta.apache.org/ws/trunk/src/c/generated   -DUSE_STATIC_LIB -DZKSERVER_CMD="\"http://hudson.zones.apache.org/hudson/job/Zookeeper-Patch-vesta.apache.org/ws/trunk/src/c/tests/zkServer.sh\""  -Wall -g -MT zktest_st-TestZookeeperClose.o -MD -MP -MF .deps/zktest_st-TestZookeeperClose.Tpo -c -o zktest_st-TestZookeeperClose.o `test -f 'tests/TestZookeeperClose.cc' || echo 'http://hudson.zones.apache.org/hudson/job/Zookeeper-Patch-vesta.apache.org/ws/trunk/src/c/'`tests/TestZookeeperClose.cc 
     [exec]      [exec] mv -f .deps/zktest_st-TestZookeeperClose.Tpo .deps/zktest_st-TestZookeeperClose.Po
     [exec]      [exec] g++ -DHAVE_CONFIG_H -I. -Ihttp://hudson.zones.apache.org/hudson/job/Zookeeper-Patch-vesta.apache.org/ws/trunk/src/c   -Ihttp://hudson.zones.apache.org/hudson/job/Zookeeper-Patch-vesta.apache.org/ws/trunk/src/c/include  -Ihttp://hudson.zones.apache.org/hudson/job/Zookeeper-Patch-vesta.apache.org/ws/trunk/src/c/tests  -Ihttp://hudson.zones.apache.org/hudson/job/Zookeeper-Patch-vesta.apache.org/ws/trunk/src/c/generated   -DUSE_STATIC_LIB -DZKSERVER_CMD="\"http://hudson.zones.apache.org/hudson/job/Zookeeper-Patch-vesta.apache.org/ws/trunk/src/c/tests/zkServer.sh\""  -Wall -g -MT zktest_st-TestClient.o -MD -MP -MF .deps/zktest_st-TestClient.Tpo -c -o zktest_st-TestClient.o `test -f 'tests/TestClient.cc' || echo 'http://hudson.zones.apache.org/hudson/job/Zookeeper-Patch-vesta.apache.org/ws/trunk/src/c/'`tests/TestClient.cc 
     [exec]      [exec] mv -f .deps/zktest_st-TestClient.Tpo .deps/zktest_st-TestClient.Po
     [exec]      [exec] /bin/bash ./libtool --tag=CXX   --mode=link g++ -DUSE_STATIC_LIB -DZKSERVER_CMD="\"http://hudson.zones.apache.org/hudson/job/Zookeeper-Patch-vesta.apache.org/ws/trunk/src/c/tests/zkServer.sh\""  -Wall -g -static-libtool-libs -Wl,--wrap -Wl,calloc -Wl,--wrap -Wl,free -Wl,--wrap -Wl,flush_send_queue -Wl,--wrap -Wl,get_xid -Wl,--wrap -Wl,deliverWatchers -Wl,--wrap -Wl,activateWatcher  -o zktest-st zktest_st-TestDriver.o zktest_st-LibCMocks.o zktest_st-LibCSymTable.o zktest_st-MocksBase.o zktest_st-ZKMocks.o zktest_st-Util.o zktest_st-ThreadingUtil.o zktest_st-TestWatchers.o zktest_st-TestOperations.o zktest_st-TestZookeeperInit.o zktest_st-TestZookeeperClose.o zktest_st-TestClient.o libzkst.la libhashtable.la -lcppunit -ldl 
     [exec]      [exec] libtool: link: g++ -DUSE_STATIC_LIB -DZKSERVER_CMD=\"http://hudson.zones.apache.org/hudson/job/Zookeeper-Patch-vesta.apache.org/ws/trunk/src/c/tests/zkServer.sh\"  -Wall -g -Wl,--wrap -Wl,calloc -Wl,--wrap -Wl,free -Wl,--wrap -Wl,flush_send_queue -Wl,--wrap -Wl,get_xid -Wl,--wrap -Wl,deliverWatchers -Wl,--wrap -Wl,activateWatcher -o zktest-st zktest_st-TestDriver.o zktest_st-LibCMocks.o zktest_st-LibCSymTable.o zktest_st-MocksBase.o zktest_st-ZKMocks.o zktest_st-Util.o zktest_st-ThreadingUtil.o zktest_st-TestWatchers.o zktest_st-TestOperations.o zktest_st-TestZookeeperInit.o zktest_st-TestZookeeperClose.o zktest_st-TestClient.o  ./.libs/libzkst.a -lm ./.libs/libhashtable.a /usr/lib/libcppunit.a -ldl
     [exec]      [exec] g++ -DHAVE_CONFIG_H -I. -Ihttp://hudson.zones.apache.org/hudson/job/Zookeeper-Patch-vesta.apache.org/ws/trunk/src/c   -Ihttp://hudson.zones.apache.org/hudson/job/Zookeeper-Patch-vesta.apache.org/ws/trunk/src/c/include  -Ihttp://hudson.zones.apache.org/hudson/job/Zookeeper-Patch-vesta.apache.org/ws/trunk/src/c/tests  -Ihttp://hudson.zones.apache.org/hudson/job/Zookeeper-Patch-vesta.apache.org/ws/trunk/src/c/generated   -DUSE_STATIC_LIB -DTHREADED -DZKSERVER_CMD="\"http://hudson.zones.apache.org/hudson/job/Zookeeper-Patch-vesta.apache.org/ws/trunk/src/c/tests/zkServer.sh\""  -Wall -g -MT zktest_mt-TestDriver.o -MD -MP -MF .deps/zktest_mt-TestDriver.Tpo -c -o zktest_mt-TestDriver.o `test -f 'tests/TestDriver.cc' || echo 'http://hudson.zones.apache.org/hudson/job/Zookeeper-Patch-vesta.apache.org/ws/trunk/src/c/'`tests/TestDriver.cc 
     [exec]      [exec] mv -f .deps/zktest_mt-TestDriver.Tpo .deps/zktest_mt-TestDriver.Po
     [exec]      [exec] g++ -DHAVE_CONFIG_H -I. -Ihttp://hudson.zones.apache.org/hudson/job/Zookeeper-Patch-vesta.apache.org/ws/trunk/src/c   -Ihttp://hudson.zones.apache.org/hudson/job/Zookeeper-Patch-vesta.apache.org/ws/trunk/src/c/include  -Ihttp://hudson.zones.apache.org/hudson/job/Zookeeper-Patch-vesta.apache.org/ws/trunk/src/c/tests  -Ihttp://hudson.zones.apache.org/hudson/job/Zookeeper-Patch-vesta.apache.org/ws/trunk/src/c/generated   -DUSE_STATIC_LIB -DTHREADED -DZKSERVER_CMD="\"http://hudson.zones.apache.org/hudson/job/Zookeeper-Patch-vesta.apache.org/ws/trunk/src/c/tests/zkServer.sh\""  -Wall -g -MT zktest_mt-LibCMocks.o -MD -MP -MF .deps/zktest_mt-LibCMocks.Tpo -c -o zktest_mt-LibCMocks.o `test -f 'tests/LibCMocks.cc' || echo 'http://hudson.zones.apache.org/hudson/job/Zookeeper-Patch-vesta.apache.org/ws/trunk/src/c/'`tests/LibCMocks.cc 
     [exec]      [exec] mv -f .deps/zktest_mt-LibCMocks.Tpo .deps/zktest_mt-LibCMocks.Po
     [exec]      [exec] g++ -DHAVE_CONFIG_H -I. -Ihttp://hudson.zones.apache.org/hudson/job/Zookeeper-Patch-vesta.apache.org/ws/trunk/src/c   -Ihttp://hudson.zones.apache.org/hudson/job/Zookeeper-Patch-vesta.apache.org/ws/trunk/src/c/include  -Ihttp://hudson.zones.apache.org/hudson/job/Zookeeper-Patch-vesta.apache.org/ws/trunk/src/c/tests  -Ihttp://hudson.zones.apache.org/hudson/job/Zookeeper-Patch-vesta.apache.org/ws/trunk/src/c/generated   -DUSE_STATIC_LIB -DTHREADED -DZKSERVER_CMD="\"http://hudson.zones.apache.org/hudson/job/Zookeeper-Patch-vesta.apache.org/ws/trunk/src/c/tests/zkServer.sh\""  -Wall -g -MT zktest_mt-LibCSymTable.o -MD -MP -MF .deps/zktest_mt-LibCSymTable.Tpo -c -o zktest_mt-LibCSymTable.o `test -f 'tests/LibCSymTable.cc' || echo 'http://hudson.zones.apache.org/hudson/job/Zookeeper-Patch-vesta.apache.org/ws/trunk/src/c/'`tests/LibCSymTable.cc 
     [exec]      [exec] mv -f .deps/zktest_mt-LibCSymTable.Tpo .deps/zktest_mt-LibCSymTable.Po
     [exec]      [exec] g++ -DHAVE_CONFIG_H -I. -Ihttp://hudson.zones.apache.org/hudson/job/Zookeeper-Patch-vesta.apache.org/ws/trunk/src/c   -Ihttp://hudson.zones.apache.org/hudson/job/Zookeeper-Patch-vesta.apache.org/ws/trunk/src/c/include  -Ihttp://hudson.zones.apache.org/hudson/job/Zookeeper-Patch-vesta.apache.org/ws/trunk/src/c/tests  -Ihttp://hudson.zones.apache.org/hudson/job/Zookeeper-Patch-vesta.apache.org/ws/trunk/src/c/generated   -DUSE_STATIC_LIB -DTHREADED -DZKSERVER_CMD="\"http://hudson.zones.apache.org/hudson/job/Zookeeper-Patch-vesta.apache.org/ws/trunk/src/c/tests/zkServer.sh\""  -Wall -g -MT zktest_mt-MocksBase.o -MD -MP -MF .deps/zktest_mt-MocksBase.Tpo -c -o zktest_mt-MocksBase.o `test -f 'tests/MocksBase.cc' || echo 'http://hudson.zones.apache.org/hudson/job/Zookeeper-Patch-vesta.apache.org/ws/trunk/src/c/'`tests/MocksBase.cc 
     [exec]      [exec] mv -f .deps/zktest_mt-MocksBase.Tpo .deps/zktest_mt-MocksBase.Po
     [exec]      [exec] g++ -DHAVE_CONFIG_H -I. -Ihttp://hudson.zones.apache.org/hudson/job/Zookeeper-Patch-vesta.apache.org/ws/trunk/src/c   -Ihttp://hudson.zones.apache.org/hudson/job/Zookeeper-Patch-vesta.apache.org/ws/trunk/src/c/include  -Ihttp://hudson.zones.apache.org/hudson/job/Zookeeper-Patch-vesta.apache.org/ws/trunk/src/c/tests  -Ihttp://hudson.zones.apache.org/hudson/job/Zookeeper-Patch-vesta.apache.org/ws/trunk/src/c/generated   -DUSE_STATIC_LIB -DTHREADED -DZKSERVER_CMD="\"http://hudson.zones.apache.org/hudson/job/Zookeeper-Patch-vesta.apache.org/ws/trunk/src/c/tests/zkServer.sh\""  -Wall -g -MT zktest_mt-ZKMocks.o -MD -MP -MF .deps/zktest_mt-ZKMocks.Tpo -c -o zktest_mt-ZKMocks.o `test -f 'tests/ZKMocks.cc' || echo 'http://hudson.zones.apache.org/hudson/job/Zookeeper-Patch-vesta.apache.org/ws/trunk/src/c/'`tests/ZKMocks.cc 
     [exec]      [exec] mv -f .deps/zktest_mt-ZKMocks.Tpo .deps/zktest_mt-ZKMocks.Po
     [exec]      [exec] g++ -DHAVE_CONFIG_H -I. -Ihttp://hudson.zones.apache.org/hudson/job/Zookeeper-Patch-vesta.apache.org/ws/trunk/src/c   -Ihttp://hudson.zones.apache.org/hudson/job/Zookeeper-Patch-vesta.apache.org/ws/trunk/src/c/include  -Ihttp://hudson.zones.apache.org/hudson/job/Zookeeper-Patch-vesta.apache.org/ws/trunk/src/c/tests  -Ihttp://hudson.zones.apache.org/hudson/job/Zookeeper-Patch-vesta.apache.org/ws/trunk/src/c/generated   -DUSE_STATIC_LIB -DTHREADED -DZKSERVER_CMD="\"http://hudson.zones.apache.org/hudson/job/Zookeeper-Patch-vesta.apache.org/ws/trunk/src/c/tests/zkServer.sh\""  -Wall -g -MT zktest_mt-Util.o -MD -MP -MF .deps/zktest_mt-Util.Tpo -c -o zktest_mt-Util.o `test -f 'tests/Util.cc' || echo 'http://hudson.zones.apache.org/hudson/job/Zookeeper-Patch-vesta.apache.org/ws/trunk/src/c/'`tests/Util.cc 
     [exec]      [exec] mv -f .deps/zktest_mt-Util.Tpo .deps/zktest_mt-Util.Po
     [exec]      [exec] g++ -DHAVE_CONFIG_H -I. -Ihttp://hudson.zones.apache.org/hudson/job/Zookeeper-Patch-vesta.apache.org/ws/trunk/src/c   -Ihttp://hudson.zones.apache.org/hudson/job/Zookeeper-Patch-vesta.apache.org/ws/trunk/src/c/include  -Ihttp://hudson.zones.apache.org/hudson/job/Zookeeper-Patch-vesta.apache.org/ws/trunk/src/c/tests  -Ihttp://hudson.zones.apache.org/hudson/job/Zookeeper-Patch-vesta.apache.org/ws/trunk/src/c/generated   -DUSE_STATIC_LIB -DTHREADED -DZKSERVER_CMD="\"http://hudson.zones.apache.org/hudson/job/Zookeeper-Patch-vesta.apache.org/ws/trunk/src/c/tests/zkServer.sh\""  -Wall -g -MT zktest_mt-ThreadingUtil.o -MD -MP -MF .deps/zktest_mt-ThreadingUtil.Tpo -c -o zktest_mt-ThreadingUtil.o `test -f 'tests/ThreadingUtil.cc' || echo 'http://hudson.zones.apache.org/hudson/job/Zookeeper-Patch-vesta.apache.org/ws/trunk/src/c/'`tests/ThreadingUtil.cc 
     [exec]      [exec] mv -f .deps/zktest_mt-ThreadingUtil.Tpo .deps/zktest_mt-ThreadingUtil.Po
     [exec]      [exec] g++ -DHAVE_CONFIG_H -I. -Ihttp://hudson.zones.apache.org/hudson/job/Zookeeper-Patch-vesta.apache.org/ws/trunk/src/c   -Ihttp://hudson.zones.apache.org/hudson/job/Zookeeper-Patch-vesta.apache.org/ws/trunk/src/c/include  -Ihttp://hudson.zones.apache.org/hudson/job/Zookeeper-Patch-vesta.apache.org/ws/trunk/src/c/tests  -Ihttp://hudson.zones.apache.org/hudson/job/Zookeeper-Patch-vesta.apache.org/ws/trunk/src/c/generated   -DUSE_STATIC_LIB -DTHREADED -DZKSERVER_CMD="\"http://hudson.zones.apache.org/hudson/job/Zookeeper-Patch-vesta.apache.org/ws/trunk/src/c/tests/zkServer.sh\""  -Wall -g -MT zktest_mt-TestWatchers.o -MD -MP -MF .deps/zktest_mt-TestWatchers.Tpo -c -o zktest_mt-TestWatchers.o `test -f 'tests/TestWatchers.cc' || echo 'http://hudson.zones.apache.org/hudson/job/Zookeeper-Patch-vesta.apache.org/ws/trunk/src/c/'`tests/TestWatchers.cc 
     [exec]      [exec] mv -f .deps/zktest_mt-TestWatchers.Tpo .deps/zktest_mt-TestWatchers.Po
     [exec]      [exec] g++ -DHAVE_CONFIG_H -I. -Ihttp://hudson.zones.apache.org/hudson/job/Zookeeper-Patch-vesta.apache.org/ws/trunk/src/c   -Ihttp://hudson.zones.apache.org/hudson/job/Zookeeper-Patch-vesta.apache.org/ws/trunk/src/c/include  -Ihttp://hudson.zones.apache.org/hudson/job/Zookeeper-Patch-vesta.apache.org/ws/trunk/src/c/tests  -Ihttp://hudson.zones.apache.org/hudson/job/Zookeeper-Patch-vesta.apache.org/ws/trunk/src/c/generated   -DUSE_STATIC_LIB -DTHREADED -DZKSERVER_CMD="\"http://hudson.zones.apache.org/hudson/job/Zookeeper-Patch-vesta.apache.org/ws/trunk/src/c/tests/zkServer.sh\""  -Wall -g -MT zktest_mt-TestOperations.o -MD -MP -MF .deps/zktest_mt-TestOperations.Tpo -c -o zktest_mt-TestOperations.o `test -f 'tests/TestOperations.cc' || echo 'http://hudson.zones.apache.org/hudson/job/Zookeeper-Patch-vesta.apache.org/ws/trunk/src/c/'`tests/TestOperations.cc 
     [exec]      [exec] mv -f .deps/zktest_mt-TestOperations.Tpo .deps/zktest_mt-TestOperations.Po
     [exec]      [exec] g++ -DHAVE_CONFIG_H -I. -Ihttp://hudson.zones.apache.org/hudson/job/Zookeeper-Patch-vesta.apache.org/ws/trunk/src/c   -Ihttp://hudson.zones.apache.org/hudson/job/Zookeeper-Patch-vesta.apache.org/ws/trunk/src/c/include  -Ihttp://hudson.zones.apache.org/hudson/job/Zookeeper-Patch-vesta.apache.org/ws/trunk/src/c/tests  -Ihttp://hudson.zones.apache.org/hudson/job/Zookeeper-Patch-vesta.apache.org/ws/trunk/src/c/generated   -DUSE_STATIC_LIB -DTHREADED -DZKSERVER_CMD="\"http://hudson.zones.apache.org/hudson/job/Zookeeper-Patch-vesta.apache.org/ws/trunk/src/c/tests/zkServer.sh\""  -Wall -g -MT zktest_mt-TestZookeeperInit.o -MD -MP -MF .deps/zktest_mt-TestZookeeperInit.Tpo -c -o zktest_mt-TestZookeeperInit.o `test -f 'tests/TestZookeeperInit.cc' || echo 'http://hudson.zones.apache.org/hudson/job/Zookeeper-Patch-vesta.apache.org/ws/trunk/src/c/'`tests/TestZookeeperInit.cc 
     [exec]      [exec] mv -f .deps/zktest_mt-TestZookeeperInit.Tpo .deps/zktest_mt-TestZookeeperInit.Po
     [exec]      [exec] g++ -DHAVE_CONFIG_H -I. -Ihttp://hudson.zones.apache.org/hudson/job/Zookeeper-Patch-vesta.apache.org/ws/trunk/src/c   -Ihttp://hudson.zones.apache.org/hudson/job/Zookeeper-Patch-vesta.apache.org/ws/trunk/src/c/include  -Ihttp://hudson.zones.apache.org/hudson/job/Zookeeper-Patch-vesta.apache.org/ws/trunk/src/c/tests  -Ihttp://hudson.zones.apache.org/hudson/job/Zookeeper-Patch-vesta.apache.org/ws/trunk/src/c/generated   -DUSE_STATIC_LIB -DTHREADED -DZKSERVER_CMD="\"http://hudson.zones.apache.org/hudson/job/Zookeeper-Patch-vesta.apache.org/ws/trunk/src/c/tests/zkServer.sh\""  -Wall -g -MT zktest_mt-TestZookeeperClose.o -MD -MP -MF .deps/zktest_mt-TestZookeeperClose.Tpo -c -o zktest_mt-TestZookeeperClose.o `test -f 'tests/TestZookeeperClose.cc' || echo 'http://hudson.zones.apache.org/hudson/job/Zookeeper-Patch-vesta.apache.org/ws/trunk/src/c/'`tests/TestZookeeperClose.cc 
     [exec]      [exec] mv -f .deps/zktest_mt-TestZookeeperClose.Tpo .deps/zktest_mt-TestZookeeperClose.Po
     [exec]      [exec] g++ -DHAVE_CONFIG_H -I. -Ihttp://hudson.zones.apache.org/hudson/job/Zookeeper-Patch-vesta.apache.org/ws/trunk/src/c   -Ihttp://hudson.zones.apache.org/hudson/job/Zookeeper-Patch-vesta.apache.org/ws/trunk/src/c/include  -Ihttp://hudson.zones.apache.org/hudson/job/Zookeeper-Patch-vesta.apache.org/ws/trunk/src/c/tests  -Ihttp://hudson.zones.apache.org/hudson/job/Zookeeper-Patch-vesta.apache.org/ws/trunk/src/c/generated   -DUSE_STATIC_LIB -DTHREADED -DZKSERVER_CMD="\"http://hudson.zones.apache.org/hudson/job/Zookeeper-Patch-vesta.apache.org/ws/trunk/src/c/tests/zkServer.sh\""  -Wall -g -MT zktest_mt-TestClient.o -MD -MP -MF .deps/zktest_mt-TestClient.Tpo -c -o zktest_mt-TestClient.o `test -f 'tests/TestClient.cc' || echo 'http://hudson.zones.apache.org/hudson/job/Zookeeper-Patch-vesta.apache.org/ws/trunk/src/c/'`tests/TestClient.cc 
     [exec]      [exec] mv -f .deps/zktest_mt-TestClient.Tpo .deps/zktest_mt-TestClient.Po
     [exec]      [exec] g++ -DHAVE_CONFIG_H -I. -Ihttp://hudson.zones.apache.org/hudson/job/Zookeeper-Patch-vesta.apache.org/ws/trunk/src/c   -Ihttp://hudson.zones.apache.org/hudson/job/Zookeeper-Patch-vesta.apache.org/ws/trunk/src/c/include  -Ihttp://hudson.zones.apache.org/hudson/job/Zookeeper-Patch-vesta.apache.org/ws/trunk/src/c/tests  -Ihttp://hudson.zones.apache.org/hudson/job/Zookeeper-Patch-vesta.apache.org/ws/trunk/src/c/generated   -DUSE_STATIC_LIB -DTHREADED -DZKSERVER_CMD="\"http://hudson.zones.apache.org/hudson/job/Zookeeper-Patch-vesta.apache.org/ws/trunk/src/c/tests/zkServer.sh\""  -Wall -g -MT zktest_mt-PthreadMocks.o -MD -MP -MF .deps/zktest_mt-PthreadMocks.Tpo -c -o zktest_mt-PthreadMocks.o `test -f 'tests/PthreadMocks.cc' || echo 'http://hudson.zones.apache.org/hudson/job/Zookeeper-Patch-vesta.apache.org/ws/trunk/src/c/'`tests/PthreadMocks.cc 
     [exec]      [exec] mv -f .deps/zktest_mt-PthreadMocks.Tpo .deps/zktest_mt-PthreadMocks.Po
     [exec]      [exec] /bin/bash ./libtool --tag=CXX   --mode=link g++ -DUSE_STATIC_LIB -DTHREADED -DZKSERVER_CMD="\"http://hudson.zones.apache.org/hudson/job/Zookeeper-Patch-vesta.apache.org/ws/trunk/src/c/tests/zkServer.sh\""  -Wall -g -static-libtool-libs -Wl,--wrap -Wl,calloc -Wl,--wrap -Wl,free -Wl,--wrap -Wl,flush_send_queue -Wl,--wrap -Wl,get_xid -Wl,--wrap -Wl,deliverWatchers -Wl,--wrap -Wl,activateWatcher -Wl,--wrap -Wl,pthread_mutex_lock -Wl,--wrap -Wl,pthread_mutex_trylock -Wl,--wrap -Wl,pthread_mutex_unlock  -o zktest-mt zktest_mt-TestDriver.o zktest_mt-LibCMocks.o zktest_mt-LibCSymTable.o zktest_mt-MocksBase.o zktest_mt-ZKMocks.o zktest_mt-Util.o zktest_mt-ThreadingUtil.o zktest_mt-TestWatchers.o zktest_mt-TestOperations.o zktest_mt-TestZookeeperInit.o zktest_mt-TestZookeeperClose.o zktest_mt-TestClient.o zktest_mt-PthreadMocks.o libzkmt.la libhashtable.la -lpthread -lcppunit -ldl 
     [exec]      [exec] libtool: link: g++ -DUSE_STATIC_LIB -DTHREADED -DZKSERVER_CMD=\"http://hudson.zones.apache.org/hudson/job/Zookeeper-Patch-vesta.apache.org/ws/trunk/src/c/tests/zkServer.sh\"  -Wall -g -Wl,--wrap -Wl,calloc -Wl,--wrap -Wl,free -Wl,--wrap -Wl,flush_send_queue -Wl,--wrap -Wl,get_xid -Wl,--wrap -Wl,deliverWatchers -Wl,--wrap -Wl,activateWatcher -Wl,--wrap -Wl,pthread_mutex_lock -Wl,--wrap -Wl,pthread_mutex_trylock -Wl,--wrap -Wl,pthread_mutex_unlock -o zktest-mt zktest_mt-TestDriver.o zktest_mt-LibCMocks.o zktest_mt-LibCSymTable.o zktest_mt-MocksBase.o zktest_mt-ZKMocks.o zktest_mt-Util.o zktest_mt-ThreadingUtil.o zktest_mt-TestWatchers.o zktest_mt-TestOperations.o zktest_mt-TestZookeeperInit.o zktest_mt-TestZookeeperClose.o zktest_mt-TestClient.o zktest_mt-PthreadMocks.o  ./.libs/libzkmt.a -lm ./.libs/libhashtable.a -lpthread /usr/lib/libcppunit.a -ldl
     [exec]      [exec] make[1]: Leaving directory `http://hudson.zones.apache.org/hudson/job/Zookeeper-Patch-vesta.apache.org/ws/trunk/build/test/test-cppunit' 
     [exec]      [exec] ./zktest-st 
     [exec]      [exec] Running Zookeeper_watchers::testDefaultSessionWatcher1 : OK
     [exec]      [exec] Zookeeper_watchers::testDefaultSessionWatcher2 : OK
     [exec]      [exec] Zookeeper_watchers::testObjectSessionWatcher1 : OK
     [exec]      [exec] Zookeeper_watchers::testObjectSessionWatcher2 : OK
     [exec]      [exec] Zookeeper_watchers::testNodeWatcher1 : OK
     [exec]      [exec] Zookeeper_watchers::testChildWatcher1 : OK
     [exec]      [exec] Zookeeper_watchers::testChildWatcher2 : OK
     [exec]      [exec] Zookeeper_operations::testPing : OK
     [exec]      [exec] Zookeeper_operations::testTimeoutCausedByWatches1 : OK
     [exec]      [exec] Zookeeper_operations::testTimeoutCausedByWatches2 : OK
     [exec]      [exec] Zookeeper_operations::testOperationsAndDisconnectConcurrently1 : OK
     [exec]      [exec] Zookeeper_operations::testOperationsAndDisconnectConcurrently2 : OK
     [exec]      [exec] Zookeeper_operations::testConcurrentOperations10
     [exec]      [exec] 0
     [exec]      [exec] RC = -117 : OK
     [exec]      [exec] Zookeeper_init::testBasic : OK
     [exec]      [exec] Zookeeper_init::testAddressResolution : OK
     [exec]      [exec] Zookeeper_init::testMultipleAddressResolution : OK
     [exec]      [exec] Zookeeper_init::testNullAddressString : OK
     [exec]      [exec] Zookeeper_init::testEmptyAddressString : OK
     [exec]      [exec] Zookeeper_init::testOneSpaceAddressString : OK
     [exec]      [exec] Zookeeper_init::testTwoSpacesAddressString : OK
     [exec]      [exec] Zookeeper_init::testInvalidAddressString1 : OK
     [exec]      [exec] Zookeeper_init::testInvalidAddressString2 : OK
     [exec]      [exec] Zookeeper_init::testNonexistentHost : OK
     [exec]      [exec] Zookeeper_init::testOutOfMemory_init : OK
     [exec]      [exec] Zookeeper_init::testOutOfMemory_getaddrs1 : OK
     [exec]      [exec] Zookeeper_init::testOutOfMemory_getaddrs2 : OK
     [exec]      [exec] Zookeeper_init::testPermuteAddrsList : OK
     [exec]      [exec] Zookeeper_close::testCloseUnconnected : OK
     [exec]      [exec] Zookeeper_close::testCloseUnconnected1 : OK
     [exec]      [exec] Zookeeper_close::testCloseConnected1 : OK
     [exec]      [exec] Zookeeper_close::testCloseFromWatcher1 : OK
     [exec]      [exec] Zookeeper_simpleSystem::testAsyncWatcherAutoReset : OK
     [exec]      [exec] 
     [exec]      [exec] OK (32)
     [exec]      [exec] ./zktest-mt 
     [exec]      [exec] Running Zookeeper_watchers::testDefaultSessionWatcher1 : OK
     [exec]      [exec] Zookeeper_watchers::testDefaultSessionWatcher2 : OK
     [exec]      [exec] Zookeeper_watchers::testObjectSessionWatcher1 : OK
     [exec]      [exec] Zookeeper_watchers::testObjectSessionWatcher2 : OK
     [exec]      [exec] Zookeeper_watchers::testNodeWatcher1 : OK
     [exec]      [exec] Zookeeper_watchers::testChildWatcher1 : OK
     [exec]      [exec] Zookeeper_watchers::testChildWatcher2 : OK
     [exec]      [exec] Zookeeper_operations::testAsyncWatcher1 : OK
     [exec]      [exec] Zookeeper_operations::testAsyncGetOperation : OK
     [exec]      [exec] Zookeeper_operations::testOperationsAndDisconnectConcurrently1 : OK
     [exec]      [exec] Zookeeper_operations::testOperationsAndDisconnectConcurrently2 : OK
     [exec]      [exec] Zookeeper_operations::testConcurrentOperations1 : OK
     [exec]      [exec] Zookeeper_init::testBasic : OK
     [exec]      [exec] Zookeeper_init::testAddressResolution : OK
     [exec]      [exec] Zookeeper_init::testMultipleAddressResolution : OK
     [exec]      [exec] Zookeeper_init::testNullAddressString : OK
     [exec]      [exec] Zookeeper_init::testEmptyAddressString : OK
     [exec]      [exec] Zookeeper_init::testOneSpaceAddressString : OK
     [exec]      [exec] Zookeeper_init::testTwoSpacesAddressString : OK
     [exec]      [exec] Zookeeper_init::testInvalidAddressString1 : OK
     [exec]      [exec] Zookeeper_init::testInvalidAddressString2 : OK
     [exec]      [exec] Zookeeper_init::testNonexistentHost : OK
     [exec]      [exec] Zookeeper_init::testOutOfMemory_init : OK
     [exec]      [exec] Zookeeper_init::testOutOfMemory_getaddrs1 : OK
     [exec]      [exec] Zookeeper_init::testOutOfMemory_getaddrs2 : OK
     [exec]      [exec] Zookeeper_init::testPermuteAddrsList : OK
     [exec]      [exec] Zookeeper_close::testIOThreadStoppedOnExpire : OK
     [exec]      [exec] Zookeeper_close::testCloseUnconnected : OK
     [exec]      [exec] Zookeeper_close::testCloseUnconnected1 : OK
     [exec]      [exec] Zookeeper_close::testCloseConnected1 : OK
     [exec]      [exec] Zookeeper_close::testCloseFromWatcher1 : OK
     [exec]      [exec] Zookeeper_simpleSystem::testAsyncWatcherAutoReset : OK
     [exec]      [exec] Zookeeper_simpleSystem::testNullData : OK
     [exec]      [exec] Zookeeper_simpleSystem::testPathValidation : OK
     [exec]      [exec] Zookeeper_simpleSystem::testPing : OK
     [exec]      [exec] Zookeeper_simpleSystem::testAcl : OK
     [exec]      [exec] Zookeeper_simpleSystem::testAuth : OK
     [exec]      [exec] Zookeeper_simpleSystem::testWatcherAutoResetWithGlobal : OK
     [exec]      [exec] Zookeeper_simpleSystem::testWatcherAutoResetWithLocal : OK
     [exec]      [exec] 
     [exec]      [exec] OK (39)
     [exec] 
     [exec] test-core-cppunit:
     [exec] 
     [exec] test-core:
     [exec] 
     [exec] BUILD SUCCESSFUL
     [exec] Total time: 15 minutes 6 seconds
     [exec] 
     [exec] 
     [exec] ======================================================================
     [exec] ======================================================================
     [exec]     Running contrib tests.
     [exec] ======================================================================
     [exec] ======================================================================
     [exec] 
     [exec] 
     [exec] Warning: bad ps syntax, perhaps a bogus '-'? See http://procps.sf.net/faq.html
     [exec] /bin/kill -9 30147 
     [exec] kill: No such process
     [exec] /home/hudson/tools/ant/latest/bin/ant  -Declipse.home=/home/nigel/tools/eclipse/latest -Dpython.home=/home/nigel/tools/python/latest -DZooKeeperPatchProcess= -Dtest.junit.output.format=xml -Dtest.output=yes test-contrib
     [exec] Buildfile: build.xml
     [exec] 
     [exec] test-contrib:
     [exec] 
     [exec] BUILD SUCCESSFUL
     [exec] Total time: 0 seconds
     [exec] 
     [exec] 
     [exec] 
     [exec] 
     [exec] -1 overall.  Here are the results of testing the latest attachment 
     [exec]   http://issues.apache.org/jira/secure/attachment/12409690/ZOOKEEPER-196.patch
     [exec]   against trunk revision 781173.
     [exec] 
     [exec]     +1 @author.  The patch does not contain any @author tags.
     [exec] 
     [exec]     -1 tests included.  The patch doesn't appear to include any new or modified tests.
     [exec]                         Please justify why no tests are needed for this patch.
     [exec] 
     [exec]     +1 javadoc.  The javadoc tool did not generate any warning messages.
     [exec] 
     [exec]     +1 javac.  The applied patch does not increase the total number of javac compiler warnings.
     [exec] 
     [exec]     +1 findbugs.  The patch does not introduce any new Findbugs warnings.
     [exec] 
     [exec]     +1 release audit.  The applied patch does not increase the total number of release audit warnings.
     [exec] 
     [exec]     +1 core tests.  The patch passed core unit tests.
     [exec] 
     [exec]     +1 contrib tests.  The patch passed contrib unit tests.
     [exec] 
     [exec] Test results: http://hudson.zones.apache.org/hudson/job/Zookeeper-Patch-vesta.apache.org/100/testReport/
     [exec] Findbugs warnings: http://hudson.zones.apache.org/hudson/job/Zookeeper-Patch-vesta.apache.org/100/artifact/trunk/build/test/findbugs/newPatchFindbugsWarnings.html
     [exec] Console output: http://hudson.zones.apache.org/hudson/job/Zookeeper-Patch-vesta.apache.org/100/console
     [exec] 
     [exec] This message is automatically generated.
     [exec] 
     [exec] 
     [exec] ======================================================================
     [exec] ======================================================================
     [exec]     Adding comment to Jira.
     [exec] ======================================================================
     [exec] ======================================================================
     [exec] 
     [exec] 
     [exec]   % Total    % Received % Xferd  Average Speed   Time    Time     Time  Current
     [exec]                                  Dload  Upload   Total   Spent    Left  Speed
     [exec] 
     [exec]   0     0    0     0    0     0      0      0 --:--:-- --:--:-- --:--:--     0  0     0    0     0    0     0      0      0 --:--:-- --:--:-- --:--:--     0
     [exec] 
     [exec] 
     [exec] ======================================================================
     [exec] ======================================================================
     [exec]     Finished build.
     [exec] ======================================================================
     [exec] ======================================================================
     [exec] 
     [exec] 

BUILD FAILED
http://hudson.zones.apache.org/hudson/job/Zookeeper-Patch-vesta.apache.org/ws/trunk/build.xml :958: exec returned: 1

Total time: 17 minutes 39 seconds
Recording test results
Description found: ZOOKEEPER-196