You are viewing a plain text version of this content. The canonical link for it is here.
Posted to builds@beam.apache.org by Apache Jenkins Server <je...@builds.apache.org> on 2022/09/16 03:53:05 UTC

Build failed in Jenkins: beam_PerformanceTests_Kafka_IO #3087

See <https://ci-beam.apache.org/job/beam_PerformanceTests_Kafka_IO/3087/display/redirect>

Changes:


------------------------------------------
[...truncated 1.29 MB...]
    	at org.apache.beam.sdk.testing.PAssert$SingletonCheckerDoFn$DoFnInvoker.invokeProcessElement(Unknown Source)
    	at org.apache.beam.runners.dataflow.****.repackaged.org.apache.beam.runners.core.SimpleDoFnRunner.invokeProcessElement(SimpleDoFnRunner.java:211)
    	at org.apache.beam.runners.dataflow.****.repackaged.org.apache.beam.runners.core.SimpleDoFnRunner.processElement(SimpleDoFnRunner.java:188)
    	at org.apache.beam.runners.dataflow.****.SimpleParDoFn.processElement(SimpleParDoFn.java:340)
    	at org.apache.beam.runners.dataflow.****.util.common.****.ParDoOperation.process(ParDoOperation.java:44)
    	at org.apache.beam.runners.dataflow.****.util.common.****.OutputReceiver.process(OutputReceiver.java:49)
    	at org.apache.beam.runners.dataflow.****.SimpleParDoFn$1.output(SimpleParDoFn.java:285)
    	at org.apache.beam.runners.dataflow.****.repackaged.org.apache.beam.runners.core.SimpleDoFnRunner.outputWindowedValue(SimpleDoFnRunner.java:275)
    	at org.apache.beam.runners.dataflow.****.repackaged.org.apache.beam.runners.core.SimpleDoFnRunner.access$900(SimpleDoFnRunner.java:85)
    	at org.apache.beam.runners.dataflow.****.repackaged.org.apache.beam.runners.core.SimpleDoFnRunner$DoFnProcessContext.output(SimpleDoFnRunner.java:423)
    	at org.apache.beam.sdk.transforms.DoFnOutputReceivers$WindowedContextOutputReceiver.output(DoFnOutputReceivers.java:76)
    	at org.apache.beam.sdk.transforms.MapElements$1.processElement(MapElements.java:142)
    	at org.apache.beam.sdk.transforms.MapElements$1$DoFnInvoker.invokeProcessElement(Unknown Source)
    	at org.apache.beam.runners.dataflow.****.repackaged.org.apache.beam.runners.core.SimpleDoFnRunner.invokeProcessElement(SimpleDoFnRunner.java:211)
    	at org.apache.beam.runners.dataflow.****.repackaged.org.apache.beam.runners.core.SimpleDoFnRunner.processElement(SimpleDoFnRunner.java:188)
    	at org.apache.beam.runners.dataflow.****.SimpleParDoFn.processElement(SimpleParDoFn.java:340)
    	at org.apache.beam.runners.dataflow.****.util.common.****.ParDoOperation.process(ParDoOperation.java:44)
    	at org.apache.beam.runners.dataflow.****.util.common.****.OutputReceiver.process(OutputReceiver.java:49)
    	at org.apache.beam.runners.dataflow.****.SimpleParDoFn$1.output(SimpleParDoFn.java:285)
    	at org.apache.beam.runners.dataflow.****.repackaged.org.apache.beam.runners.core.SimpleDoFnRunner.outputWindowedValue(SimpleDoFnRunner.java:275)
    	at org.apache.beam.runners.dataflow.****.repackaged.org.apache.beam.runners.core.SimpleDoFnRunner.access$900(SimpleDoFnRunner.java:85)
    	at org.apache.beam.runners.dataflow.****.repackaged.org.apache.beam.runners.core.SimpleDoFnRunner$DoFnProcessContext.output(SimpleDoFnRunner.java:423)
    	at org.apache.beam.runners.dataflow.****.repackaged.org.apache.beam.runners.core.SimpleDoFnRunner$DoFnProcessContext.output(SimpleDoFnRunner.java:411)
    	at org.apache.beam.sdk.testing.PAssert$ConcatFn.processElement(PAssert.java:1425)
    	at org.apache.beam.sdk.testing.PAssert$ConcatFn$DoFnInvoker.invokeProcessElement(Unknown Source)
    	at org.apache.beam.runners.dataflow.****.repackaged.org.apache.beam.runners.core.SimpleDoFnRunner.invokeProcessElement(SimpleDoFnRunner.java:211)
    	at org.apache.beam.runners.dataflow.****.repackaged.org.apache.beam.runners.core.SimpleDoFnRunner.processElement(SimpleDoFnRunner.java:188)
    	at org.apache.beam.runners.dataflow.****.SimpleParDoFn.processElement(SimpleParDoFn.java:340)
    	at org.apache.beam.runners.dataflow.****.util.common.****.ParDoOperation.process(ParDoOperation.java:44)
    	at org.apache.beam.runners.dataflow.****.util.common.****.OutputReceiver.process(OutputReceiver.java:49)
    	at org.apache.beam.runners.dataflow.****.SimpleParDoFn$1.output(SimpleParDoFn.java:285)
    	at org.apache.beam.runners.dataflow.****.repackaged.org.apache.beam.runners.core.SimpleDoFnRunner.outputWindowedValue(SimpleDoFnRunner.java:275)
    	at org.apache.beam.runners.dataflow.****.repackaged.org.apache.beam.runners.core.SimpleDoFnRunner.access$900(SimpleDoFnRunner.java:85)
    	at org.apache.beam.runners.dataflow.****.repackaged.org.apache.beam.runners.core.SimpleDoFnRunner$DoFnProcessContext.output(SimpleDoFnRunner.java:423)
    	at org.apache.beam.sdk.transforms.DoFnOutputReceivers$WindowedContextOutputReceiver.output(DoFnOutputReceivers.java:76)
    	at org.apache.beam.sdk.transforms.MapElements$1.processElement(MapElements.java:142)
    	at org.apache.beam.sdk.transforms.MapElements$1$DoFnInvoker.invokeProcessElement(Unknown Source)
    	at org.apache.beam.runners.dataflow.****.repackaged.org.apache.beam.runners.core.SimpleDoFnRunner.invokeProcessElement(SimpleDoFnRunner.java:211)
    	at org.apache.beam.runners.dataflow.****.repackaged.org.apache.beam.runners.core.SimpleDoFnRunner.processElement(SimpleDoFnRunner.java:188)
    	at org.apache.beam.runners.dataflow.****.SimpleParDoFn.processElement(SimpleParDoFn.java:340)
    	at org.apache.beam.runners.dataflow.****.util.common.****.ParDoOperation.process(ParDoOperation.java:44)
    	at org.apache.beam.runners.dataflow.****.util.common.****.OutputReceiver.process(OutputReceiver.java:49)
    	at org.apache.beam.runners.dataflow.****.GroupAlsoByWindowsParDoFn$1.output(GroupAlsoByWindowsParDoFn.java:185)
    	... 21 more
    Caused by: java.lang.AssertionError: Calculate hashcode/Values/Values/Map/ParMultiDo(Anonymous).output: 
    Expected: "4507649971ee7c51abbb446e65a5c660"
         but: was "84a4eebadc22dbc9bd25607f1b64b549"
    	at org.apache.beam.sdk.testing.PAssert$PAssertionSite.capture(PAssert.java:175)
    	at org.apache.beam.sdk.testing.PAssert.thatSingleton(PAssert.java:498)
    	at org.apache.beam.sdk.testing.PAssert.thatSingleton(PAssert.java:490)
    	at org.apache.beam.sdk.io.kafka.KafkaIOIT.testKafkaIOReadsAndWritesCorrectlyInBatch(KafkaIOIT.java:180)
    	at sun.reflect.NativeMethodAccessorImpl.invoke0(Native Method)
    	at sun.reflect.NativeMethodAccessorImpl.invoke(NativeMethodAccessorImpl.java:62)
    	at sun.reflect.DelegatingMethodAccessorImpl.invoke(DelegatingMethodAccessorImpl.java:43)
    	at java.lang.reflect.Method.invoke(Method.java:498)
    	at org.junit.runners.model.FrameworkMethod$1.runReflectiveCall(FrameworkMethod.java:59)
    	at org.junit.internal.runners.model.ReflectiveCallable.run(ReflectiveCallable.java:12)
    	at org.junit.runners.model.FrameworkMethod.invokeExplosively(FrameworkMethod.java:56)
    	at org.junit.internal.runners.statements.InvokeMethod.evaluate(InvokeMethod.java:17)
    	at org.junit.rules.ExternalResource$1.evaluate(ExternalResource.java:54)
    	at org.apache.beam.sdk.testing.TestPipeline$1.evaluate(TestPipeline.java:323)
    	at org.apache.beam.sdk.testing.TestPipeline$1.evaluate(TestPipeline.java:323)
    	at org.apache.beam.sdk.testing.TestPipeline$1.evaluate(TestPipeline.java:323)
    	at org.apache.beam.sdk.testing.TestPipeline$1.evaluate(TestPipeline.java:323)
    	at org.apache.beam.sdk.testing.TestPipeline$1.evaluate(TestPipeline.java:323)
    	at org.junit.runners.ParentRunner$3.evaluate(ParentRunner.java:306)
    	at org.junit.runners.BlockJUnit4ClassRunner$1.evaluate(BlockJUnit4ClassRunner.java:100)
    	at org.junit.runners.ParentRunner.runLeaf(ParentRunner.java:366)
    	at org.junit.runners.BlockJUnit4ClassRunner.runChild(BlockJUnit4ClassRunner.java:103)
    	at org.junit.runners.BlockJUnit4ClassRunner.runChild(BlockJUnit4ClassRunner.java:63)
    	at org.junit.runners.ParentRunner$4.run(ParentRunner.java:331)
    	at org.junit.runners.ParentRunner$1.schedule(ParentRunner.java:79)
    	at org.junit.runners.ParentRunner.runChildren(ParentRunner.java:329)
    	at org.junit.runners.ParentRunner.access$100(ParentRunner.java:66)
    	at org.junit.runners.ParentRunner$2.evaluate(ParentRunner.java:293)
    	at org.junit.internal.runners.statements.RunBefores.evaluate(RunBefores.java:26)
    	at org.junit.internal.runners.statements.RunAfters.evaluate(RunAfters.java:27)
    	at org.junit.runners.ParentRunner$3.evaluate(ParentRunner.java:306)
    	at org.junit.runners.ParentRunner.run(ParentRunner.java:413)
    	at org.gradle.api.internal.tasks.testing.junit.JUnitTestClassExecutor.runTestClass(JUnitTestClassExecutor.java:110)
    	at org.gradle.api.internal.tasks.testing.junit.JUnitTestClassExecutor.execute(JUnitTestClassExecutor.java:58)
    	at org.gradle.api.internal.tasks.testing.junit.JUnitTestClassExecutor.execute(JUnitTestClassExecutor.java:38)
    	at org.gradle.api.internal.tasks.testing.junit.AbstractJUnitTestClassProcessor.processTestClass(AbstractJUnitTestClassProcessor.java:62)
    	at org.gradle.api.internal.tasks.testing.SuiteTestClassProcessor.processTestClass(SuiteTestClassProcessor.java:51)
    	at sun.reflect.NativeMethodAccessorImpl.invoke0(Native Method)
    	at sun.reflect.NativeMethodAccessorImpl.invoke(NativeMethodAccessorImpl.java:62)
    	at sun.reflect.DelegatingMethodAccessorImpl.invoke(DelegatingMethodAccessorImpl.java:43)
    	at java.lang.reflect.Method.invoke(Method.java:498)
    	at org.gradle.internal.dispatch.ReflectionDispatch.dispatch(ReflectionDispatch.java:36)
    	at org.gradle.internal.dispatch.ReflectionDispatch.dispatch(ReflectionDispatch.java:24)
    	at org.gradle.internal.dispatch.ContextClassLoaderDispatch.dispatch(ContextClassLoaderDispatch.java:33)
    	at org.gradle.internal.dispatch.ProxyDispatchAdapter$DispatchingInvocationHandler.invoke(ProxyDispatchAdapter.java:94)
    	at com.sun.proxy.$Proxy2.processTestClass(Unknown Source)
    	at org.gradle.api.internal.tasks.testing.****.TestWorker$2.run(TestWorker.java:176)
    	at org.gradle.api.internal.tasks.testing.****.TestWorker.executeAndMaintainThreadName(TestWorker.java:129)
    	at org.gradle.api.internal.tasks.testing.****.TestWorker.execute(TestWorker.java:100)
    	at org.gradle.api.internal.tasks.testing.****.TestWorker.execute(TestWorker.java:60)
    	at org.gradle.process.internal.****.child.ActionExecutionWorker.execute(ActionExecutionWorker.java:56)
    	at org.gradle.process.internal.****.child.SystemApplicationClassLoaderWorker.call(SystemApplicationClassLoaderWorker.java:133)
    	at org.gradle.process.internal.****.child.SystemApplicationClassLoaderWorker.call(SystemApplicationClassLoaderWorker.java:71)
    	at ****.org.gradle.process.internal.****.GradleWorkerMain.run(GradleWorkerMain.java:69)
    	at ****.org.gradle.process.internal.****.GradleWorkerMain.main(GradleWorkerMain.java:74)
    Caused by: java.lang.AssertionError: 
    Expected: "4507649971ee7c51abbb446e65a5c660"
         but: was "84a4eebadc22dbc9bd25607f1b64b549"
    	at org.hamcrest.MatcherAssert.assertThat(MatcherAssert.java:18)
    	at org.hamcrest.MatcherAssert.assertThat(MatcherAssert.java:6)
    	at org.apache.beam.sdk.testing.PAssert$AssertIsEqualTo.apply(PAssert.java:1643)
    	at org.apache.beam.sdk.testing.PAssert$AssertIsEqualTo.apply(PAssert.java:1634)
    	at org.apache.beam.sdk.testing.PAssert$CheckRelationAgainstExpected.apply(PAssert.java:1299)
    	at org.apache.beam.sdk.testing.PAssert$CheckRelationAgainstExpected.apply(PAssert.java:1279)
    	at org.apache.beam.sdk.testing.PAssert.doChecks(PAssert.java:1621)
    	at org.apache.beam.sdk.testing.PAssert$SingletonCheckerDoFn.processElement(PAssert.java:1614)
    	at org.apache.beam.sdk.testing.PAssert$SingletonCheckerDoFn$DoFnInvoker.invokeProcessElement(Unknown Source)
    	at org.apache.beam.runners.dataflow.****.repackaged.org.apache.beam.runners.core.SimpleDoFnRunner.invokeProcessElement(SimpleDoFnRunner.java:211)
    	at org.apache.beam.runners.dataflow.****.repackaged.org.apache.beam.runners.core.SimpleDoFnRunner.processElement(SimpleDoFnRunner.java:188)
    	at org.apache.beam.runners.dataflow.****.SimpleParDoFn.processElement(SimpleParDoFn.java:340)
    	at org.apache.beam.runners.dataflow.****.util.common.****.ParDoOperation.process(ParDoOperation.java:44)
    	at org.apache.beam.runners.dataflow.****.util.common.****.OutputReceiver.process(OutputReceiver.java:49)
    	at org.apache.beam.runners.dataflow.****.SimpleParDoFn$1.output(SimpleParDoFn.java:285)
    	at org.apache.beam.runners.dataflow.****.repackaged.org.apache.beam.runners.core.SimpleDoFnRunner.outputWindowedValue(SimpleDoFnRunner.java:275)
    	at org.apache.beam.runners.dataflow.****.repackaged.org.apache.beam.runners.core.SimpleDoFnRunner.access$900(SimpleDoFnRunner.java:85)
    	at org.apache.beam.runners.dataflow.****.repackaged.org.apache.beam.runners.core.SimpleDoFnRunner$DoFnProcessContext.output(SimpleDoFnRunner.java:423)
    	at org.apache.beam.sdk.transforms.DoFnOutputReceivers$WindowedContextOutputReceiver.output(DoFnOutputReceivers.java:76)
    	at org.apache.beam.sdk.transforms.MapElements$1.processElement(MapElements.java:142)
    	at org.apache.beam.sdk.transforms.MapElements$1$DoFnInvoker.invokeProcessElement(Unknown Source)
    	at org.apache.beam.runners.dataflow.****.repackaged.org.apache.beam.runners.core.SimpleDoFnRunner.invokeProcessElement(SimpleDoFnRunner.java:211)
    	at org.apache.beam.runners.dataflow.****.repackaged.org.apache.beam.runners.core.SimpleDoFnRunner.processElement(SimpleDoFnRunner.java:188)
    	at org.apache.beam.runners.dataflow.****.SimpleParDoFn.processElement(SimpleParDoFn.java:340)
    	at org.apache.beam.runners.dataflow.****.util.common.****.ParDoOperation.process(ParDoOperation.java:44)
    	at org.apache.beam.runners.dataflow.****.util.common.****.OutputReceiver.process(OutputReceiver.java:49)
    	at org.apache.beam.runners.dataflow.****.SimpleParDoFn$1.output(SimpleParDoFn.java:285)
    	at org.apache.beam.runners.dataflow.****.repackaged.org.apache.beam.runners.core.SimpleDoFnRunner.outputWindowedValue(SimpleDoFnRunner.java:275)
    	at org.apache.beam.runners.dataflow.****.repackaged.org.apache.beam.runners.core.SimpleDoFnRunner.access$900(SimpleDoFnRunner.java:85)
    	at org.apache.beam.runners.dataflow.****.repackaged.org.apache.beam.runners.core.SimpleDoFnRunner$DoFnProcessContext.output(SimpleDoFnRunner.java:423)
    	at org.apache.beam.runners.dataflow.****.repackaged.org.apache.beam.runners.core.SimpleDoFnRunner$DoFnProcessContext.output(SimpleDoFnRunner.java:411)
    	at org.apache.beam.sdk.testing.PAssert$ConcatFn.processElement(PAssert.java:1425)
    	at org.apache.beam.sdk.testing.PAssert$ConcatFn$DoFnInvoker.invokeProcessElement(Unknown Source)
    	at org.apache.beam.runners.dataflow.****.repackaged.org.apache.beam.runners.core.SimpleDoFnRunner.invokeProcessElement(SimpleDoFnRunner.java:211)
    	at org.apache.beam.runners.dataflow.****.repackaged.org.apache.beam.runners.core.SimpleDoFnRunner.processElement(SimpleDoFnRunner.java:188)
    	at org.apache.beam.runners.dataflow.****.SimpleParDoFn.processElement(SimpleParDoFn.java:340)
    	at org.apache.beam.runners.dataflow.****.util.common.****.ParDoOperation.process(ParDoOperation.java:44)
    	at org.apache.beam.runners.dataflow.****.util.common.****.OutputReceiver.process(OutputReceiver.java:49)
    	at org.apache.beam.runners.dataflow.****.SimpleParDoFn$1.output(SimpleParDoFn.java:285)
    	at org.apache.beam.runners.dataflow.****.repackaged.org.apache.beam.runners.core.SimpleDoFnRunner.outputWindowedValue(SimpleDoFnRunner.java:275)
    	at org.apache.beam.runners.dataflow.****.repackaged.org.apache.beam.runners.core.SimpleDoFnRunner.access$900(SimpleDoFnRunner.java:85)
    	at org.apache.beam.runners.dataflow.****.repackaged.org.apache.beam.runners.core.SimpleDoFnRunner$DoFnProcessContext.output(SimpleDoFnRunner.java:423)
    	at org.apache.beam.sdk.transforms.DoFnOutputReceivers$WindowedContextOutputReceiver.output(DoFnOutputReceivers.java:76)
    	at org.apache.beam.sdk.transforms.MapElements$1.processElement(MapElements.java:142)
    	at org.apache.beam.sdk.transforms.MapElements$1$DoFnInvoker.invokeProcessElement(Unknown Source)
    	at org.apache.beam.runners.dataflow.****.repackaged.org.apache.beam.runners.core.SimpleDoFnRunner.invokeProcessElement(SimpleDoFnRunner.java:211)
    	at org.apache.beam.runners.dataflow.****.repackaged.org.apache.beam.runners.core.SimpleDoFnRunner.processElement(SimpleDoFnRunner.java:188)
    	at org.apache.beam.runners.dataflow.****.SimpleParDoFn.processElement(SimpleParDoFn.java:340)
    	at org.apache.beam.runners.dataflow.****.util.common.****.ParDoOperation.process(ParDoOperation.java:44)
    	at org.apache.beam.runners.dataflow.****.util.common.****.OutputReceiver.process(OutputReceiver.java:49)
    	at org.apache.beam.runners.dataflow.****.GroupAlsoByWindowsParDoFn$1.output(GroupAlsoByWindowsParDoFn.java:185)
    	at org.apache.beam.runners.dataflow.****.GroupAlsoByWindowFnRunner$1.outputWindowedValue(GroupAlsoByWindowFnRunner.java:108)
    	at org.apache.beam.runners.dataflow.****.util.BatchGroupAlsoByWindowViaIteratorsFn.processElement(BatchGroupAlsoByWindowViaIteratorsFn.java:128)
    	at org.apache.beam.runners.dataflow.****.util.BatchGroupAlsoByWindowViaIteratorsFn.processElement(BatchGroupAlsoByWindowViaIteratorsFn.java:56)
    	at org.apache.beam.runners.dataflow.****.GroupAlsoByWindowFnRunner.invokeProcessElement(GroupAlsoByWindowFnRunner.java:121)
    	at org.apache.beam.runners.dataflow.****.GroupAlsoByWindowFnRunner.processElement(GroupAlsoByWindowFnRunner.java:73)
    	at org.apache.beam.runners.dataflow.****.GroupAlsoByWindowsParDoFn.processElement(GroupAlsoByWindowsParDoFn.java:117)
    	at org.apache.beam.runners.dataflow.****.util.common.****.ParDoOperation.process(ParDoOperation.java:44)
    	at org.apache.beam.runners.dataflow.****.util.common.****.OutputReceiver.process(OutputReceiver.java:49)
    	at org.apache.beam.runners.dataflow.****.util.common.****.ReadOperation.runReadLoop(ReadOperation.java:218)
    	at org.apache.beam.runners.dataflow.****.util.common.****.ReadOperation.start(ReadOperation.java:169)
    	at org.apache.beam.runners.dataflow.****.util.common.****.MapTaskExecutor.execute(MapTaskExecutor.java:83)
    	at org.apache.beam.runners.dataflow.****.BatchDataflowWorker.executeWork(BatchDataflowWorker.java:420)
    	at org.apache.beam.runners.dataflow.****.BatchDataflowWorker.doWork(BatchDataflowWorker.java:389)
    	at org.apache.beam.runners.dataflow.****.BatchDataflowWorker.getAndPerformWork(BatchDataflowWorker.java:314)
    	at org.apache.beam.runners.dataflow.****.DataflowBatchWorkerHarness$WorkerThread.doWork(DataflowBatchWorkerHarness.java:140)
    	at org.apache.beam.runners.dataflow.****.DataflowBatchWorkerHarness$WorkerThread.call(DataflowBatchWorkerHarness.java:120)
    	at org.apache.beam.runners.dataflow.****.DataflowBatchWorkerHarness$WorkerThread.call(DataflowBatchWorkerHarness.java:107)
    	at java.util.concurrent.FutureTask.run(FutureTask.java:266)
    	at java.util.concurrent.ThreadPoolExecutor.runWorker(ThreadPoolExecutor.java:1149)
    	at java.util.concurrent.ThreadPoolExecutor$Worker.run(ThreadPoolExecutor.java:624)
    	at java.lang.Thread.run(Thread.java:748)

    Sep 16, 2022 3:50:41 AM org.apache.beam.runners.dataflow.util.MonitoringUtil$LoggingHandler process
    INFO: 2022-09-16T03:50:39.723Z: Finished operation PAssert$0/GroupGlobally/GroupByKey/Read+PAssert$0/GroupGlobally/GroupByKey/GroupByWindow+PAssert$0/GroupGlobally/Values/Values/Map+PAssert$0/GroupGlobally/ParDo(Concat)+PAssert$0/GetPane/Map+PAssert$0/RunChecks+PAssert$0/VerifyAssertions/ParDo(DefaultConclude)
    Sep 16, 2022 3:50:41 AM org.apache.beam.runners.dataflow.util.MonitoringUtil$LoggingHandler process
    SEVERE: 2022-09-16T03:50:39.826Z: Workflow failed. Causes: S08:PAssert$0/GroupGlobally/GroupByKey/Read+PAssert$0/GroupGlobally/GroupByKey/GroupByWindow+PAssert$0/GroupGlobally/Values/Values/Map+PAssert$0/GroupGlobally/ParDo(Concat)+PAssert$0/GetPane/Map+PAssert$0/RunChecks+PAssert$0/VerifyAssertions/ParDo(DefaultConclude) failed., The job failed because a work item has failed 4 times. Look in previous log entries for the cause of each one of the 4 failures. For more information, see https://cloud.google.com/dataflow/docs/guides/common-errors. The work item was attempted on these ****s: 

      kafkaioit0testkafkaioread-09152048-kvq0-harness-5j5g
          Root cause: Work item failed.,

      kafkaioit0testkafkaioread-09152048-kvq0-harness-5j5g
          Root cause: Work item failed.,

      kafkaioit0testkafkaioread-09152048-kvq0-harness-zqj7
          Root cause: Work item failed.,

      kafkaioit0testkafkaioread-09152048-kvq0-harness-zqj7
          Root cause: Work item failed.
    Sep 16, 2022 3:50:41 AM org.apache.beam.runners.dataflow.util.MonitoringUtil$LoggingHandler process
    INFO: 2022-09-16T03:50:39.918Z: Cleaning up.
    Sep 16, 2022 3:50:41 AM org.apache.beam.runners.dataflow.util.MonitoringUtil$LoggingHandler process
    INFO: 2022-09-16T03:50:40.009Z: Stopping **** pool...
    Sep 16, 2022 3:52:54 AM org.apache.beam.runners.dataflow.util.MonitoringUtil$LoggingHandler process
    INFO: 2022-09-16T03:52:53.940Z: Autoscaling: Resized **** pool from 5 to 0.
    Sep 16, 2022 3:52:54 AM org.apache.beam.runners.dataflow.util.MonitoringUtil$LoggingHandler process
    INFO: 2022-09-16T03:52:53.988Z: Worker pool stopped.
    Sep 16, 2022 3:53:04 AM org.apache.beam.runners.dataflow.DataflowPipelineJob logTerminalState
    INFO: Job 2022-09-15_20_48_44-8844286838022102683 failed with status FAILED.

Gradle Test Executor 3 finished executing tests.

> Task :sdks:java:io:kafka:integrationTest FAILED

org.apache.beam.sdk.io.kafka.KafkaIOIT > testKafkaIOReadsAndWritesCorrectlyInBatch FAILED
    java.lang.AssertionError: expected:<DONE> but was:<FAILED>
        at org.junit.Assert.fail(Assert.java:89)
        at org.junit.Assert.failNotEquals(Assert.java:835)
        at org.junit.Assert.assertEquals(Assert.java:120)
        at org.junit.Assert.assertEquals(Assert.java:146)
        at org.apache.beam.sdk.io.kafka.KafkaIOIT.testKafkaIOReadsAndWritesCorrectlyInBatch(KafkaIOIT.java:184)

1 test completed, 1 failed
Finished generating test XML results (0.017 secs) into: <https://ci-beam.apache.org/job/beam_PerformanceTests_Kafka_IO/ws/src/sdks/java/io/kafka/build/test-results/integrationTest>
Generating HTML test report...
Finished generating test html results (0.026 secs) into: <https://ci-beam.apache.org/job/beam_PerformanceTests_Kafka_IO/ws/src/sdks/java/io/kafka/build/reports/tests/integrationTest>
:sdks:java:io:kafka:integrationTest (Thread[Execution **** Thread 2,5,main]) completed. Took 4 mins 34.156 secs.

FAILURE: Build failed with an exception.

* What went wrong:
Execution failed for task ':sdks:java:io:kafka:integrationTest'.
> There were failing tests. See the report at: file://<https://ci-beam.apache.org/job/beam_PerformanceTests_Kafka_IO/ws/src/sdks/java/io/kafka/build/reports/tests/integrationTest/index.html>

* Try:
> Run with --stacktrace option to get the stack trace.
> Run with --debug option to get more log output.

* Get more help at https://help.gradle.org

Deprecated Gradle features were used in this build, making it incompatible with Gradle 8.0.

You can use '--warning-mode all' to show the individual deprecation warnings and determine if they come from your own scripts or plugins.

See https://docs.gradle.org/7.5.1/userguide/command_line_interface.html#sec:command_line_warnings

BUILD FAILED in 4m 40s
136 actionable tasks: 1 executed, 135 up-to-date

Publishing build scan...
https://gradle.com/s/h5vhukpz7tjua

Build step 'Invoke Gradle script' changed build result to FAILURE
Build step 'Invoke Gradle script' marked build as failure

---------------------------------------------------------------------
To unsubscribe, e-mail: builds-unsubscribe@beam.apache.org
For additional commands, e-mail: builds-help@beam.apache.org


Jenkins build is back to normal : beam_PerformanceTests_Kafka_IO #3090

Posted by Apache Jenkins Server <je...@builds.apache.org>.
See <https://ci-beam.apache.org/job/beam_PerformanceTests_Kafka_IO/3090/display/redirect>


---------------------------------------------------------------------
To unsubscribe, e-mail: builds-unsubscribe@beam.apache.org
For additional commands, e-mail: builds-help@beam.apache.org


Build failed in Jenkins: beam_PerformanceTests_Kafka_IO #3089

Posted by Apache Jenkins Server <je...@builds.apache.org>.
See <https://ci-beam.apache.org/job/beam_PerformanceTests_Kafka_IO/3089/display/redirect>

Changes:


------------------------------------------
[...truncated 1.33 MB...]
    	at org.apache.beam.sdk.testing.PAssert$SingletonCheckerDoFn$DoFnInvoker.invokeProcessElement(Unknown Source)
    	at org.apache.beam.runners.dataflow.****.repackaged.org.apache.beam.runners.core.SimpleDoFnRunner.invokeProcessElement(SimpleDoFnRunner.java:211)
    	at org.apache.beam.runners.dataflow.****.repackaged.org.apache.beam.runners.core.SimpleDoFnRunner.processElement(SimpleDoFnRunner.java:188)
    	at org.apache.beam.runners.dataflow.****.SimpleParDoFn.processElement(SimpleParDoFn.java:340)
    	at org.apache.beam.runners.dataflow.****.util.common.****.ParDoOperation.process(ParDoOperation.java:44)
    	at org.apache.beam.runners.dataflow.****.util.common.****.OutputReceiver.process(OutputReceiver.java:49)
    	at org.apache.beam.runners.dataflow.****.SimpleParDoFn$1.output(SimpleParDoFn.java:285)
    	at org.apache.beam.runners.dataflow.****.repackaged.org.apache.beam.runners.core.SimpleDoFnRunner.outputWindowedValue(SimpleDoFnRunner.java:275)
    	at org.apache.beam.runners.dataflow.****.repackaged.org.apache.beam.runners.core.SimpleDoFnRunner.access$900(SimpleDoFnRunner.java:85)
    	at org.apache.beam.runners.dataflow.****.repackaged.org.apache.beam.runners.core.SimpleDoFnRunner$DoFnProcessContext.output(SimpleDoFnRunner.java:423)
    	at org.apache.beam.sdk.transforms.DoFnOutputReceivers$WindowedContextOutputReceiver.output(DoFnOutputReceivers.java:76)
    	at org.apache.beam.sdk.transforms.MapElements$1.processElement(MapElements.java:142)
    	at org.apache.beam.sdk.transforms.MapElements$1$DoFnInvoker.invokeProcessElement(Unknown Source)
    	at org.apache.beam.runners.dataflow.****.repackaged.org.apache.beam.runners.core.SimpleDoFnRunner.invokeProcessElement(SimpleDoFnRunner.java:211)
    	at org.apache.beam.runners.dataflow.****.repackaged.org.apache.beam.runners.core.SimpleDoFnRunner.processElement(SimpleDoFnRunner.java:188)
    	at org.apache.beam.runners.dataflow.****.SimpleParDoFn.processElement(SimpleParDoFn.java:340)
    	at org.apache.beam.runners.dataflow.****.util.common.****.ParDoOperation.process(ParDoOperation.java:44)
    	at org.apache.beam.runners.dataflow.****.util.common.****.OutputReceiver.process(OutputReceiver.java:49)
    	at org.apache.beam.runners.dataflow.****.SimpleParDoFn$1.output(SimpleParDoFn.java:285)
    	at org.apache.beam.runners.dataflow.****.repackaged.org.apache.beam.runners.core.SimpleDoFnRunner.outputWindowedValue(SimpleDoFnRunner.java:275)
    	at org.apache.beam.runners.dataflow.****.repackaged.org.apache.beam.runners.core.SimpleDoFnRunner.access$900(SimpleDoFnRunner.java:85)
    	at org.apache.beam.runners.dataflow.****.repackaged.org.apache.beam.runners.core.SimpleDoFnRunner$DoFnProcessContext.output(SimpleDoFnRunner.java:423)
    	at org.apache.beam.runners.dataflow.****.repackaged.org.apache.beam.runners.core.SimpleDoFnRunner$DoFnProcessContext.output(SimpleDoFnRunner.java:411)
    	at org.apache.beam.sdk.testing.PAssert$ConcatFn.processElement(PAssert.java:1425)
    	at org.apache.beam.sdk.testing.PAssert$ConcatFn$DoFnInvoker.invokeProcessElement(Unknown Source)
    	at org.apache.beam.runners.dataflow.****.repackaged.org.apache.beam.runners.core.SimpleDoFnRunner.invokeProcessElement(SimpleDoFnRunner.java:211)
    	at org.apache.beam.runners.dataflow.****.repackaged.org.apache.beam.runners.core.SimpleDoFnRunner.processElement(SimpleDoFnRunner.java:188)
    	at org.apache.beam.runners.dataflow.****.SimpleParDoFn.processElement(SimpleParDoFn.java:340)
    	at org.apache.beam.runners.dataflow.****.util.common.****.ParDoOperation.process(ParDoOperation.java:44)
    	at org.apache.beam.runners.dataflow.****.util.common.****.OutputReceiver.process(OutputReceiver.java:49)
    	at org.apache.beam.runners.dataflow.****.SimpleParDoFn$1.output(SimpleParDoFn.java:285)
    	at org.apache.beam.runners.dataflow.****.repackaged.org.apache.beam.runners.core.SimpleDoFnRunner.outputWindowedValue(SimpleDoFnRunner.java:275)
    	at org.apache.beam.runners.dataflow.****.repackaged.org.apache.beam.runners.core.SimpleDoFnRunner.access$900(SimpleDoFnRunner.java:85)
    	at org.apache.beam.runners.dataflow.****.repackaged.org.apache.beam.runners.core.SimpleDoFnRunner$DoFnProcessContext.output(SimpleDoFnRunner.java:423)
    	at org.apache.beam.sdk.transforms.DoFnOutputReceivers$WindowedContextOutputReceiver.output(DoFnOutputReceivers.java:76)
    	at org.apache.beam.sdk.transforms.MapElements$1.processElement(MapElements.java:142)
    	at org.apache.beam.sdk.transforms.MapElements$1$DoFnInvoker.invokeProcessElement(Unknown Source)
    	at org.apache.beam.runners.dataflow.****.repackaged.org.apache.beam.runners.core.SimpleDoFnRunner.invokeProcessElement(SimpleDoFnRunner.java:211)
    	at org.apache.beam.runners.dataflow.****.repackaged.org.apache.beam.runners.core.SimpleDoFnRunner.processElement(SimpleDoFnRunner.java:188)
    	at org.apache.beam.runners.dataflow.****.SimpleParDoFn.processElement(SimpleParDoFn.java:340)
    	at org.apache.beam.runners.dataflow.****.util.common.****.ParDoOperation.process(ParDoOperation.java:44)
    	at org.apache.beam.runners.dataflow.****.util.common.****.OutputReceiver.process(OutputReceiver.java:49)
    	at org.apache.beam.runners.dataflow.****.GroupAlsoByWindowsParDoFn$1.output(GroupAlsoByWindowsParDoFn.java:185)
    	... 21 more
    Caused by: java.lang.AssertionError: Calculate hashcode/Values/Values/Map/ParMultiDo(Anonymous).output: 
    Expected: "0f12c27c9a7672e14775594be66cad9a"
         but: was "966684bbc4d071c54466678005c86eec"
    	at org.apache.beam.sdk.testing.PAssert$PAssertionSite.capture(PAssert.java:175)
    	at org.apache.beam.sdk.testing.PAssert.thatSingleton(PAssert.java:498)
    	at org.apache.beam.sdk.testing.PAssert.thatSingleton(PAssert.java:490)
    	at org.apache.beam.sdk.io.kafka.KafkaIOIT.testKafkaIOReadsAndWritesCorrectlyInBatch(KafkaIOIT.java:243)
    	at sun.reflect.NativeMethodAccessorImpl.invoke0(Native Method)
    	at sun.reflect.NativeMethodAccessorImpl.invoke(NativeMethodAccessorImpl.java:62)
    	at sun.reflect.DelegatingMethodAccessorImpl.invoke(DelegatingMethodAccessorImpl.java:43)
    	at java.lang.reflect.Method.invoke(Method.java:498)
    	at org.junit.runners.model.FrameworkMethod$1.runReflectiveCall(FrameworkMethod.java:59)
    	at org.junit.internal.runners.model.ReflectiveCallable.run(ReflectiveCallable.java:12)
    	at org.junit.runners.model.FrameworkMethod.invokeExplosively(FrameworkMethod.java:56)
    	at org.junit.internal.runners.statements.InvokeMethod.evaluate(InvokeMethod.java:17)
    	at org.junit.rules.ExternalResource$1.evaluate(ExternalResource.java:54)
    	at org.apache.beam.sdk.testing.TestPipeline$1.evaluate(TestPipeline.java:323)
    	at org.apache.beam.sdk.testing.TestPipeline$1.evaluate(TestPipeline.java:323)
    	at org.apache.beam.sdk.testing.TestPipeline$1.evaluate(TestPipeline.java:323)
    	at org.apache.beam.sdk.testing.TestPipeline$1.evaluate(TestPipeline.java:323)
    	at org.apache.beam.sdk.testing.TestPipeline$1.evaluate(TestPipeline.java:323)
    	at org.junit.runners.ParentRunner$3.evaluate(ParentRunner.java:306)
    	at org.junit.runners.BlockJUnit4ClassRunner$1.evaluate(BlockJUnit4ClassRunner.java:100)
    	at org.junit.runners.ParentRunner.runLeaf(ParentRunner.java:366)
    	at org.junit.runners.BlockJUnit4ClassRunner.runChild(BlockJUnit4ClassRunner.java:103)
    	at org.junit.runners.BlockJUnit4ClassRunner.runChild(BlockJUnit4ClassRunner.java:63)
    	at org.junit.runners.ParentRunner$4.run(ParentRunner.java:331)
    	at org.junit.runners.ParentRunner$1.schedule(ParentRunner.java:79)
    	at org.junit.runners.ParentRunner.runChildren(ParentRunner.java:329)
    	at org.junit.runners.ParentRunner.access$100(ParentRunner.java:66)
    	at org.junit.runners.ParentRunner$2.evaluate(ParentRunner.java:293)
    	at org.junit.internal.runners.statements.RunBefores.evaluate(RunBefores.java:26)
    	at org.junit.internal.runners.statements.RunAfters.evaluate(RunAfters.java:27)
    	at org.junit.runners.ParentRunner$3.evaluate(ParentRunner.java:306)
    	at org.junit.runners.ParentRunner.run(ParentRunner.java:413)
    	at org.gradle.api.internal.tasks.testing.junit.JUnitTestClassExecutor.runTestClass(JUnitTestClassExecutor.java:110)
    	at org.gradle.api.internal.tasks.testing.junit.JUnitTestClassExecutor.execute(JUnitTestClassExecutor.java:58)
    	at org.gradle.api.internal.tasks.testing.junit.JUnitTestClassExecutor.execute(JUnitTestClassExecutor.java:38)
    	at org.gradle.api.internal.tasks.testing.junit.AbstractJUnitTestClassProcessor.processTestClass(AbstractJUnitTestClassProcessor.java:62)
    	at org.gradle.api.internal.tasks.testing.SuiteTestClassProcessor.processTestClass(SuiteTestClassProcessor.java:51)
    	at sun.reflect.NativeMethodAccessorImpl.invoke0(Native Method)
    	at sun.reflect.NativeMethodAccessorImpl.invoke(NativeMethodAccessorImpl.java:62)
    	at sun.reflect.DelegatingMethodAccessorImpl.invoke(DelegatingMethodAccessorImpl.java:43)
    	at java.lang.reflect.Method.invoke(Method.java:498)
    	at org.gradle.internal.dispatch.ReflectionDispatch.dispatch(ReflectionDispatch.java:36)
    	at org.gradle.internal.dispatch.ReflectionDispatch.dispatch(ReflectionDispatch.java:24)
    	at org.gradle.internal.dispatch.ContextClassLoaderDispatch.dispatch(ContextClassLoaderDispatch.java:33)
    	at org.gradle.internal.dispatch.ProxyDispatchAdapter$DispatchingInvocationHandler.invoke(ProxyDispatchAdapter.java:94)
    	at com.sun.proxy.$Proxy2.processTestClass(Unknown Source)
    	at org.gradle.api.internal.tasks.testing.****.TestWorker$2.run(TestWorker.java:176)
    	at org.gradle.api.internal.tasks.testing.****.TestWorker.executeAndMaintainThreadName(TestWorker.java:129)
    	at org.gradle.api.internal.tasks.testing.****.TestWorker.execute(TestWorker.java:100)
    	at org.gradle.api.internal.tasks.testing.****.TestWorker.execute(TestWorker.java:60)
    	at org.gradle.process.internal.****.child.ActionExecutionWorker.execute(ActionExecutionWorker.java:56)
    	at org.gradle.process.internal.****.child.SystemApplicationClassLoaderWorker.call(SystemApplicationClassLoaderWorker.java:133)
    	at org.gradle.process.internal.****.child.SystemApplicationClassLoaderWorker.call(SystemApplicationClassLoaderWorker.java:71)
    	at ****.org.gradle.process.internal.****.GradleWorkerMain.run(GradleWorkerMain.java:69)
    	at ****.org.gradle.process.internal.****.GradleWorkerMain.main(GradleWorkerMain.java:74)
    Caused by: java.lang.AssertionError: 
    Expected: "0f12c27c9a7672e14775594be66cad9a"
         but: was "966684bbc4d071c54466678005c86eec"
    	at org.hamcrest.MatcherAssert.assertThat(MatcherAssert.java:18)
    	at org.hamcrest.MatcherAssert.assertThat(MatcherAssert.java:6)
    	at org.apache.beam.sdk.testing.PAssert$AssertIsEqualTo.apply(PAssert.java:1643)
    	at org.apache.beam.sdk.testing.PAssert$AssertIsEqualTo.apply(PAssert.java:1634)
    	at org.apache.beam.sdk.testing.PAssert$CheckRelationAgainstExpected.apply(PAssert.java:1299)
    	at org.apache.beam.sdk.testing.PAssert$CheckRelationAgainstExpected.apply(PAssert.java:1279)
    	at org.apache.beam.sdk.testing.PAssert.doChecks(PAssert.java:1621)
    	at org.apache.beam.sdk.testing.PAssert$SingletonCheckerDoFn.processElement(PAssert.java:1614)
    	at org.apache.beam.sdk.testing.PAssert$SingletonCheckerDoFn$DoFnInvoker.invokeProcessElement(Unknown Source)
    	at org.apache.beam.runners.dataflow.****.repackaged.org.apache.beam.runners.core.SimpleDoFnRunner.invokeProcessElement(SimpleDoFnRunner.java:211)
    	at org.apache.beam.runners.dataflow.****.repackaged.org.apache.beam.runners.core.SimpleDoFnRunner.processElement(SimpleDoFnRunner.java:188)
    	at org.apache.beam.runners.dataflow.****.SimpleParDoFn.processElement(SimpleParDoFn.java:340)
    	at org.apache.beam.runners.dataflow.****.util.common.****.ParDoOperation.process(ParDoOperation.java:44)
    	at org.apache.beam.runners.dataflow.****.util.common.****.OutputReceiver.process(OutputReceiver.java:49)
    	at org.apache.beam.runners.dataflow.****.SimpleParDoFn$1.output(SimpleParDoFn.java:285)
    	at org.apache.beam.runners.dataflow.****.repackaged.org.apache.beam.runners.core.SimpleDoFnRunner.outputWindowedValue(SimpleDoFnRunner.java:275)
    	at org.apache.beam.runners.dataflow.****.repackaged.org.apache.beam.runners.core.SimpleDoFnRunner.access$900(SimpleDoFnRunner.java:85)
    	at org.apache.beam.runners.dataflow.****.repackaged.org.apache.beam.runners.core.SimpleDoFnRunner$DoFnProcessContext.output(SimpleDoFnRunner.java:423)
    	at org.apache.beam.sdk.transforms.DoFnOutputReceivers$WindowedContextOutputReceiver.output(DoFnOutputReceivers.java:76)
    	at org.apache.beam.sdk.transforms.MapElements$1.processElement(MapElements.java:142)
    	at org.apache.beam.sdk.transforms.MapElements$1$DoFnInvoker.invokeProcessElement(Unknown Source)
    	at org.apache.beam.runners.dataflow.****.repackaged.org.apache.beam.runners.core.SimpleDoFnRunner.invokeProcessElement(SimpleDoFnRunner.java:211)
    	at org.apache.beam.runners.dataflow.****.repackaged.org.apache.beam.runners.core.SimpleDoFnRunner.processElement(SimpleDoFnRunner.java:188)
    	at org.apache.beam.runners.dataflow.****.SimpleParDoFn.processElement(SimpleParDoFn.java:340)
    	at org.apache.beam.runners.dataflow.****.util.common.****.ParDoOperation.process(ParDoOperation.java:44)
    	at org.apache.beam.runners.dataflow.****.util.common.****.OutputReceiver.process(OutputReceiver.java:49)
    	at org.apache.beam.runners.dataflow.****.SimpleParDoFn$1.output(SimpleParDoFn.java:285)
    	at org.apache.beam.runners.dataflow.****.repackaged.org.apache.beam.runners.core.SimpleDoFnRunner.outputWindowedValue(SimpleDoFnRunner.java:275)
    	at org.apache.beam.runners.dataflow.****.repackaged.org.apache.beam.runners.core.SimpleDoFnRunner.access$900(SimpleDoFnRunner.java:85)
    	at org.apache.beam.runners.dataflow.****.repackaged.org.apache.beam.runners.core.SimpleDoFnRunner$DoFnProcessContext.output(SimpleDoFnRunner.java:423)
    	at org.apache.beam.runners.dataflow.****.repackaged.org.apache.beam.runners.core.SimpleDoFnRunner$DoFnProcessContext.output(SimpleDoFnRunner.java:411)
    	at org.apache.beam.sdk.testing.PAssert$ConcatFn.processElement(PAssert.java:1425)
    	at org.apache.beam.sdk.testing.PAssert$ConcatFn$DoFnInvoker.invokeProcessElement(Unknown Source)
    	at org.apache.beam.runners.dataflow.****.repackaged.org.apache.beam.runners.core.SimpleDoFnRunner.invokeProcessElement(SimpleDoFnRunner.java:211)
    	at org.apache.beam.runners.dataflow.****.repackaged.org.apache.beam.runners.core.SimpleDoFnRunner.processElement(SimpleDoFnRunner.java:188)
    	at org.apache.beam.runners.dataflow.****.SimpleParDoFn.processElement(SimpleParDoFn.java:340)
    	at org.apache.beam.runners.dataflow.****.util.common.****.ParDoOperation.process(ParDoOperation.java:44)
    	at org.apache.beam.runners.dataflow.****.util.common.****.OutputReceiver.process(OutputReceiver.java:49)
    	at org.apache.beam.runners.dataflow.****.SimpleParDoFn$1.output(SimpleParDoFn.java:285)
    	at org.apache.beam.runners.dataflow.****.repackaged.org.apache.beam.runners.core.SimpleDoFnRunner.outputWindowedValue(SimpleDoFnRunner.java:275)
    	at org.apache.beam.runners.dataflow.****.repackaged.org.apache.beam.runners.core.SimpleDoFnRunner.access$900(SimpleDoFnRunner.java:85)
    	at org.apache.beam.runners.dataflow.****.repackaged.org.apache.beam.runners.core.SimpleDoFnRunner$DoFnProcessContext.output(SimpleDoFnRunner.java:423)
    	at org.apache.beam.sdk.transforms.DoFnOutputReceivers$WindowedContextOutputReceiver.output(DoFnOutputReceivers.java:76)
    	at org.apache.beam.sdk.transforms.MapElements$1.processElement(MapElements.java:142)
    	at org.apache.beam.sdk.transforms.MapElements$1$DoFnInvoker.invokeProcessElement(Unknown Source)
    	at org.apache.beam.runners.dataflow.****.repackaged.org.apache.beam.runners.core.SimpleDoFnRunner.invokeProcessElement(SimpleDoFnRunner.java:211)
    	at org.apache.beam.runners.dataflow.****.repackaged.org.apache.beam.runners.core.SimpleDoFnRunner.processElement(SimpleDoFnRunner.java:188)
    	at org.apache.beam.runners.dataflow.****.SimpleParDoFn.processElement(SimpleParDoFn.java:340)
    	at org.apache.beam.runners.dataflow.****.util.common.****.ParDoOperation.process(ParDoOperation.java:44)
    	at org.apache.beam.runners.dataflow.****.util.common.****.OutputReceiver.process(OutputReceiver.java:49)
    	at org.apache.beam.runners.dataflow.****.GroupAlsoByWindowsParDoFn$1.output(GroupAlsoByWindowsParDoFn.java:185)
    	at org.apache.beam.runners.dataflow.****.GroupAlsoByWindowFnRunner$1.outputWindowedValue(GroupAlsoByWindowFnRunner.java:108)
    	at org.apache.beam.runners.dataflow.****.util.BatchGroupAlsoByWindowViaIteratorsFn.processElement(BatchGroupAlsoByWindowViaIteratorsFn.java:128)
    	at org.apache.beam.runners.dataflow.****.util.BatchGroupAlsoByWindowViaIteratorsFn.processElement(BatchGroupAlsoByWindowViaIteratorsFn.java:56)
    	at org.apache.beam.runners.dataflow.****.GroupAlsoByWindowFnRunner.invokeProcessElement(GroupAlsoByWindowFnRunner.java:121)
    	at org.apache.beam.runners.dataflow.****.GroupAlsoByWindowFnRunner.processElement(GroupAlsoByWindowFnRunner.java:73)
    	at org.apache.beam.runners.dataflow.****.GroupAlsoByWindowsParDoFn.processElement(GroupAlsoByWindowsParDoFn.java:117)
    	at org.apache.beam.runners.dataflow.****.util.common.****.ParDoOperation.process(ParDoOperation.java:44)
    	at org.apache.beam.runners.dataflow.****.util.common.****.OutputReceiver.process(OutputReceiver.java:49)
    	at org.apache.beam.runners.dataflow.****.util.common.****.ReadOperation.runReadLoop(ReadOperation.java:218)
    	at org.apache.beam.runners.dataflow.****.util.common.****.ReadOperation.start(ReadOperation.java:169)
    	at org.apache.beam.runners.dataflow.****.util.common.****.MapTaskExecutor.execute(MapTaskExecutor.java:83)
    	at org.apache.beam.runners.dataflow.****.BatchDataflowWorker.executeWork(BatchDataflowWorker.java:420)
    	at org.apache.beam.runners.dataflow.****.BatchDataflowWorker.doWork(BatchDataflowWorker.java:389)
    	at org.apache.beam.runners.dataflow.****.BatchDataflowWorker.getAndPerformWork(BatchDataflowWorker.java:314)
    	at org.apache.beam.runners.dataflow.****.DataflowBatchWorkerHarness$WorkerThread.doWork(DataflowBatchWorkerHarness.java:140)
    	at org.apache.beam.runners.dataflow.****.DataflowBatchWorkerHarness$WorkerThread.call(DataflowBatchWorkerHarness.java:120)
    	at org.apache.beam.runners.dataflow.****.DataflowBatchWorkerHarness$WorkerThread.call(DataflowBatchWorkerHarness.java:107)
    	at java.util.concurrent.FutureTask.run(FutureTask.java:266)
    	at java.util.concurrent.ThreadPoolExecutor.runWorker(ThreadPoolExecutor.java:1149)
    	at java.util.concurrent.ThreadPoolExecutor$Worker.run(ThreadPoolExecutor.java:624)
    	at java.lang.Thread.run(Thread.java:748)

    Sep 16, 2022 1:29:16 PM org.apache.beam.runners.dataflow.util.MonitoringUtil$LoggingHandler process
    INFO: 2022-09-16T13:29:15.402Z: Finished operation PAssert$0/GroupGlobally/GroupByKey/Read+PAssert$0/GroupGlobally/GroupByKey/GroupByWindow+PAssert$0/GroupGlobally/Values/Values/Map+PAssert$0/GroupGlobally/ParDo(Concat)+PAssert$0/GetPane/Map+PAssert$0/RunChecks+PAssert$0/VerifyAssertions/ParDo(DefaultConclude)
    Sep 16, 2022 1:29:16 PM org.apache.beam.runners.dataflow.util.MonitoringUtil$LoggingHandler process
    SEVERE: 2022-09-16T13:29:15.661Z: Workflow failed. Causes: S11:PAssert$0/GroupGlobally/GroupByKey/Read+PAssert$0/GroupGlobally/GroupByKey/GroupByWindow+PAssert$0/GroupGlobally/Values/Values/Map+PAssert$0/GroupGlobally/ParDo(Concat)+PAssert$0/GetPane/Map+PAssert$0/RunChecks+PAssert$0/VerifyAssertions/ParDo(DefaultConclude) failed., The job failed because a work item has failed 4 times. Look in previous log entries for the cause of each one of the 4 failures. For more information, see https://cloud.google.com/dataflow/docs/guides/common-errors. The work item was attempted on these ****s: 

      kafkaioit0testkafkaioread-09160612-vr8x-harness-fh1b
          Root cause: Work item failed.,

      kafkaioit0testkafkaioread-09160612-vr8x-harness-61hl
          Root cause: Work item failed.,

      kafkaioit0testkafkaioread-09160612-vr8x-harness-61hl
          Root cause: Work item failed.,

      kafkaioit0testkafkaioread-09160612-vr8x-harness-7w7s
          Root cause: Work item failed.
    Sep 16, 2022 1:29:16 PM org.apache.beam.runners.dataflow.util.MonitoringUtil$LoggingHandler process
    INFO: 2022-09-16T13:29:15.852Z: Cleaning up.
    Sep 16, 2022 1:29:18 PM org.apache.beam.runners.dataflow.util.MonitoringUtil$LoggingHandler process
    INFO: 2022-09-16T13:29:15.965Z: Stopping **** pool...
    Sep 16, 2022 1:31:34 PM org.apache.beam.runners.dataflow.util.MonitoringUtil$LoggingHandler process
    INFO: 2022-09-16T13:31:31.973Z: Autoscaling: Resized **** pool from 5 to 0.
    Sep 16, 2022 1:31:34 PM org.apache.beam.runners.dataflow.util.MonitoringUtil$LoggingHandler process
    INFO: 2022-09-16T13:31:32.065Z: Worker pool stopped.
    Sep 16, 2022 1:31:39 PM org.apache.beam.runners.dataflow.DataflowPipelineJob logTerminalState
    INFO: Job 2022-09-16_06_12_56-12910254288378763372 failed with status FAILED.

Gradle Test Executor 2 finished executing tests.

> Task :sdks:java:io:kafka:integrationTest FAILED

org.apache.beam.sdk.io.kafka.KafkaIOIT > testKafkaIOReadsAndWritesCorrectlyInBatch FAILED
    java.lang.AssertionError: expected:<FAILED> but was:<DONE>
        at org.junit.Assert.fail(Assert.java:89)
        at org.junit.Assert.failNotEquals(Assert.java:835)
        at org.junit.Assert.assertEquals(Assert.java:120)
        at org.junit.Assert.assertEquals(Assert.java:146)
        at org.apache.beam.sdk.io.kafka.KafkaIOIT.testKafkaIOReadsAndWritesCorrectlyInBatch(KafkaIOIT.java:254)

1 test completed, 1 failed
Finished generating test XML results (0.014 secs) into: <https://ci-beam.apache.org/job/beam_PerformanceTests_Kafka_IO/ws/src/sdks/java/io/kafka/build/test-results/integrationTest>
Generating HTML test report...
Finished generating test html results (0.027 secs) into: <https://ci-beam.apache.org/job/beam_PerformanceTests_Kafka_IO/ws/src/sdks/java/io/kafka/build/reports/tests/integrationTest>
:sdks:java:io:kafka:integrationTest (Thread[Execution **** Thread 2,5,main]) completed. Took 26 mins 0.496 secs.

FAILURE: Build failed with an exception.

* What went wrong:
Execution failed for task ':sdks:java:io:kafka:integrationTest'.
> There were failing tests. See the report at: file://<https://ci-beam.apache.org/job/beam_PerformanceTests_Kafka_IO/ws/src/sdks/java/io/kafka/build/reports/tests/integrationTest/index.html>

* Try:
> Run with --stacktrace option to get the stack trace.
> Run with --debug option to get more log output.

* Get more help at https://help.gradle.org

Deprecated Gradle features were used in this build, making it incompatible with Gradle 8.0.

You can use '--warning-mode all' to show the individual deprecation warnings and determine if they come from your own scripts or plugins.

See https://docs.gradle.org/7.5.1/userguide/command_line_interface.html#sec:command_line_warnings

BUILD FAILED in 26m 7s
136 actionable tasks: 1 executed, 135 up-to-date

Publishing build scan...
https://gradle.com/s/7rbqlpkusyuws

Build step 'Invoke Gradle script' changed build result to FAILURE
Build step 'Invoke Gradle script' marked build as failure

---------------------------------------------------------------------
To unsubscribe, e-mail: builds-unsubscribe@beam.apache.org
For additional commands, e-mail: builds-help@beam.apache.org


Build failed in Jenkins: beam_PerformanceTests_Kafka_IO #3088

Posted by Apache Jenkins Server <je...@builds.apache.org>.
See <https://ci-beam.apache.org/job/beam_PerformanceTests_Kafka_IO/3088/display/redirect?page=changes>

Changes:

[noreply] Issue#21430 Avoid pruning DataframeTransforms (#23069)


------------------------------------------
[...truncated 1.34 MB...]
    	at org.apache.beam.sdk.testing.PAssert$SingletonCheckerDoFn$DoFnInvoker.invokeProcessElement(Unknown Source)
    	at org.apache.beam.runners.dataflow.****.repackaged.org.apache.beam.runners.core.SimpleDoFnRunner.invokeProcessElement(SimpleDoFnRunner.java:211)
    	at org.apache.beam.runners.dataflow.****.repackaged.org.apache.beam.runners.core.SimpleDoFnRunner.processElement(SimpleDoFnRunner.java:188)
    	at org.apache.beam.runners.dataflow.****.SimpleParDoFn.processElement(SimpleParDoFn.java:340)
    	at org.apache.beam.runners.dataflow.****.util.common.****.ParDoOperation.process(ParDoOperation.java:44)
    	at org.apache.beam.runners.dataflow.****.util.common.****.OutputReceiver.process(OutputReceiver.java:49)
    	at org.apache.beam.runners.dataflow.****.SimpleParDoFn$1.output(SimpleParDoFn.java:285)
    	at org.apache.beam.runners.dataflow.****.repackaged.org.apache.beam.runners.core.SimpleDoFnRunner.outputWindowedValue(SimpleDoFnRunner.java:275)
    	at org.apache.beam.runners.dataflow.****.repackaged.org.apache.beam.runners.core.SimpleDoFnRunner.access$900(SimpleDoFnRunner.java:85)
    	at org.apache.beam.runners.dataflow.****.repackaged.org.apache.beam.runners.core.SimpleDoFnRunner$DoFnProcessContext.output(SimpleDoFnRunner.java:423)
    	at org.apache.beam.sdk.transforms.DoFnOutputReceivers$WindowedContextOutputReceiver.output(DoFnOutputReceivers.java:76)
    	at org.apache.beam.sdk.transforms.MapElements$1.processElement(MapElements.java:142)
    	at org.apache.beam.sdk.transforms.MapElements$1$DoFnInvoker.invokeProcessElement(Unknown Source)
    	at org.apache.beam.runners.dataflow.****.repackaged.org.apache.beam.runners.core.SimpleDoFnRunner.invokeProcessElement(SimpleDoFnRunner.java:211)
    	at org.apache.beam.runners.dataflow.****.repackaged.org.apache.beam.runners.core.SimpleDoFnRunner.processElement(SimpleDoFnRunner.java:188)
    	at org.apache.beam.runners.dataflow.****.SimpleParDoFn.processElement(SimpleParDoFn.java:340)
    	at org.apache.beam.runners.dataflow.****.util.common.****.ParDoOperation.process(ParDoOperation.java:44)
    	at org.apache.beam.runners.dataflow.****.util.common.****.OutputReceiver.process(OutputReceiver.java:49)
    	at org.apache.beam.runners.dataflow.****.SimpleParDoFn$1.output(SimpleParDoFn.java:285)
    	at org.apache.beam.runners.dataflow.****.repackaged.org.apache.beam.runners.core.SimpleDoFnRunner.outputWindowedValue(SimpleDoFnRunner.java:275)
    	at org.apache.beam.runners.dataflow.****.repackaged.org.apache.beam.runners.core.SimpleDoFnRunner.access$900(SimpleDoFnRunner.java:85)
    	at org.apache.beam.runners.dataflow.****.repackaged.org.apache.beam.runners.core.SimpleDoFnRunner$DoFnProcessContext.output(SimpleDoFnRunner.java:423)
    	at org.apache.beam.runners.dataflow.****.repackaged.org.apache.beam.runners.core.SimpleDoFnRunner$DoFnProcessContext.output(SimpleDoFnRunner.java:411)
    	at org.apache.beam.sdk.testing.PAssert$ConcatFn.processElement(PAssert.java:1425)
    	at org.apache.beam.sdk.testing.PAssert$ConcatFn$DoFnInvoker.invokeProcessElement(Unknown Source)
    	at org.apache.beam.runners.dataflow.****.repackaged.org.apache.beam.runners.core.SimpleDoFnRunner.invokeProcessElement(SimpleDoFnRunner.java:211)
    	at org.apache.beam.runners.dataflow.****.repackaged.org.apache.beam.runners.core.SimpleDoFnRunner.processElement(SimpleDoFnRunner.java:188)
    	at org.apache.beam.runners.dataflow.****.SimpleParDoFn.processElement(SimpleParDoFn.java:340)
    	at org.apache.beam.runners.dataflow.****.util.common.****.ParDoOperation.process(ParDoOperation.java:44)
    	at org.apache.beam.runners.dataflow.****.util.common.****.OutputReceiver.process(OutputReceiver.java:49)
    	at org.apache.beam.runners.dataflow.****.SimpleParDoFn$1.output(SimpleParDoFn.java:285)
    	at org.apache.beam.runners.dataflow.****.repackaged.org.apache.beam.runners.core.SimpleDoFnRunner.outputWindowedValue(SimpleDoFnRunner.java:275)
    	at org.apache.beam.runners.dataflow.****.repackaged.org.apache.beam.runners.core.SimpleDoFnRunner.access$900(SimpleDoFnRunner.java:85)
    	at org.apache.beam.runners.dataflow.****.repackaged.org.apache.beam.runners.core.SimpleDoFnRunner$DoFnProcessContext.output(SimpleDoFnRunner.java:423)
    	at org.apache.beam.sdk.transforms.DoFnOutputReceivers$WindowedContextOutputReceiver.output(DoFnOutputReceivers.java:76)
    	at org.apache.beam.sdk.transforms.MapElements$1.processElement(MapElements.java:142)
    	at org.apache.beam.sdk.transforms.MapElements$1$DoFnInvoker.invokeProcessElement(Unknown Source)
    	at org.apache.beam.runners.dataflow.****.repackaged.org.apache.beam.runners.core.SimpleDoFnRunner.invokeProcessElement(SimpleDoFnRunner.java:211)
    	at org.apache.beam.runners.dataflow.****.repackaged.org.apache.beam.runners.core.SimpleDoFnRunner.processElement(SimpleDoFnRunner.java:188)
    	at org.apache.beam.runners.dataflow.****.SimpleParDoFn.processElement(SimpleParDoFn.java:340)
    	at org.apache.beam.runners.dataflow.****.util.common.****.ParDoOperation.process(ParDoOperation.java:44)
    	at org.apache.beam.runners.dataflow.****.util.common.****.OutputReceiver.process(OutputReceiver.java:49)
    	at org.apache.beam.runners.dataflow.****.GroupAlsoByWindowsParDoFn$1.output(GroupAlsoByWindowsParDoFn.java:185)
    	... 21 more
    Caused by: java.lang.AssertionError: Calculate hashcode/Values/Values/Map/ParMultiDo(Anonymous).output: 
    Expected: "0f12c27c9a7672e14775594be66cad9a"
         but: was "966684bbc4d071c54466678005c86eec"
    	at org.apache.beam.sdk.testing.PAssert$PAssertionSite.capture(PAssert.java:175)
    	at org.apache.beam.sdk.testing.PAssert.thatSingleton(PAssert.java:498)
    	at org.apache.beam.sdk.testing.PAssert.thatSingleton(PAssert.java:490)
    	at org.apache.beam.sdk.io.kafka.KafkaIOIT.testKafkaIOReadsAndWritesCorrectlyInBatch(KafkaIOIT.java:243)
    	at sun.reflect.NativeMethodAccessorImpl.invoke0(Native Method)
    	at sun.reflect.NativeMethodAccessorImpl.invoke(NativeMethodAccessorImpl.java:62)
    	at sun.reflect.DelegatingMethodAccessorImpl.invoke(DelegatingMethodAccessorImpl.java:43)
    	at java.lang.reflect.Method.invoke(Method.java:498)
    	at org.junit.runners.model.FrameworkMethod$1.runReflectiveCall(FrameworkMethod.java:59)
    	at org.junit.internal.runners.model.ReflectiveCallable.run(ReflectiveCallable.java:12)
    	at org.junit.runners.model.FrameworkMethod.invokeExplosively(FrameworkMethod.java:56)
    	at org.junit.internal.runners.statements.InvokeMethod.evaluate(InvokeMethod.java:17)
    	at org.junit.rules.ExternalResource$1.evaluate(ExternalResource.java:54)
    	at org.apache.beam.sdk.testing.TestPipeline$1.evaluate(TestPipeline.java:323)
    	at org.apache.beam.sdk.testing.TestPipeline$1.evaluate(TestPipeline.java:323)
    	at org.apache.beam.sdk.testing.TestPipeline$1.evaluate(TestPipeline.java:323)
    	at org.apache.beam.sdk.testing.TestPipeline$1.evaluate(TestPipeline.java:323)
    	at org.apache.beam.sdk.testing.TestPipeline$1.evaluate(TestPipeline.java:323)
    	at org.junit.runners.ParentRunner$3.evaluate(ParentRunner.java:306)
    	at org.junit.runners.BlockJUnit4ClassRunner$1.evaluate(BlockJUnit4ClassRunner.java:100)
    	at org.junit.runners.ParentRunner.runLeaf(ParentRunner.java:366)
    	at org.junit.runners.BlockJUnit4ClassRunner.runChild(BlockJUnit4ClassRunner.java:103)
    	at org.junit.runners.BlockJUnit4ClassRunner.runChild(BlockJUnit4ClassRunner.java:63)
    	at org.junit.runners.ParentRunner$4.run(ParentRunner.java:331)
    	at org.junit.runners.ParentRunner$1.schedule(ParentRunner.java:79)
    	at org.junit.runners.ParentRunner.runChildren(ParentRunner.java:329)
    	at org.junit.runners.ParentRunner.access$100(ParentRunner.java:66)
    	at org.junit.runners.ParentRunner$2.evaluate(ParentRunner.java:293)
    	at org.junit.internal.runners.statements.RunBefores.evaluate(RunBefores.java:26)
    	at org.junit.internal.runners.statements.RunAfters.evaluate(RunAfters.java:27)
    	at org.junit.runners.ParentRunner$3.evaluate(ParentRunner.java:306)
    	at org.junit.runners.ParentRunner.run(ParentRunner.java:413)
    	at org.gradle.api.internal.tasks.testing.junit.JUnitTestClassExecutor.runTestClass(JUnitTestClassExecutor.java:110)
    	at org.gradle.api.internal.tasks.testing.junit.JUnitTestClassExecutor.execute(JUnitTestClassExecutor.java:58)
    	at org.gradle.api.internal.tasks.testing.junit.JUnitTestClassExecutor.execute(JUnitTestClassExecutor.java:38)
    	at org.gradle.api.internal.tasks.testing.junit.AbstractJUnitTestClassProcessor.processTestClass(AbstractJUnitTestClassProcessor.java:62)
    	at org.gradle.api.internal.tasks.testing.SuiteTestClassProcessor.processTestClass(SuiteTestClassProcessor.java:51)
    	at sun.reflect.NativeMethodAccessorImpl.invoke0(Native Method)
    	at sun.reflect.NativeMethodAccessorImpl.invoke(NativeMethodAccessorImpl.java:62)
    	at sun.reflect.DelegatingMethodAccessorImpl.invoke(DelegatingMethodAccessorImpl.java:43)
    	at java.lang.reflect.Method.invoke(Method.java:498)
    	at org.gradle.internal.dispatch.ReflectionDispatch.dispatch(ReflectionDispatch.java:36)
    	at org.gradle.internal.dispatch.ReflectionDispatch.dispatch(ReflectionDispatch.java:24)
    	at org.gradle.internal.dispatch.ContextClassLoaderDispatch.dispatch(ContextClassLoaderDispatch.java:33)
    	at org.gradle.internal.dispatch.ProxyDispatchAdapter$DispatchingInvocationHandler.invoke(ProxyDispatchAdapter.java:94)
    	at com.sun.proxy.$Proxy2.processTestClass(Unknown Source)
    	at org.gradle.api.internal.tasks.testing.****.TestWorker$2.run(TestWorker.java:176)
    	at org.gradle.api.internal.tasks.testing.****.TestWorker.executeAndMaintainThreadName(TestWorker.java:129)
    	at org.gradle.api.internal.tasks.testing.****.TestWorker.execute(TestWorker.java:100)
    	at org.gradle.api.internal.tasks.testing.****.TestWorker.execute(TestWorker.java:60)
    	at org.gradle.process.internal.****.child.ActionExecutionWorker.execute(ActionExecutionWorker.java:56)
    	at org.gradle.process.internal.****.child.SystemApplicationClassLoaderWorker.call(SystemApplicationClassLoaderWorker.java:133)
    	at org.gradle.process.internal.****.child.SystemApplicationClassLoaderWorker.call(SystemApplicationClassLoaderWorker.java:71)
    	at ****.org.gradle.process.internal.****.GradleWorkerMain.run(GradleWorkerMain.java:69)
    	at ****.org.gradle.process.internal.****.GradleWorkerMain.main(GradleWorkerMain.java:74)
    Caused by: java.lang.AssertionError: 
    Expected: "0f12c27c9a7672e14775594be66cad9a"
         but: was "966684bbc4d071c54466678005c86eec"
    	at org.hamcrest.MatcherAssert.assertThat(MatcherAssert.java:18)
    	at org.hamcrest.MatcherAssert.assertThat(MatcherAssert.java:6)
    	at org.apache.beam.sdk.testing.PAssert$AssertIsEqualTo.apply(PAssert.java:1643)
    	at org.apache.beam.sdk.testing.PAssert$AssertIsEqualTo.apply(PAssert.java:1634)
    	at org.apache.beam.sdk.testing.PAssert$CheckRelationAgainstExpected.apply(PAssert.java:1299)
    	at org.apache.beam.sdk.testing.PAssert$CheckRelationAgainstExpected.apply(PAssert.java:1279)
    	at org.apache.beam.sdk.testing.PAssert.doChecks(PAssert.java:1621)
    	at org.apache.beam.sdk.testing.PAssert$SingletonCheckerDoFn.processElement(PAssert.java:1614)
    	at org.apache.beam.sdk.testing.PAssert$SingletonCheckerDoFn$DoFnInvoker.invokeProcessElement(Unknown Source)
    	at org.apache.beam.runners.dataflow.****.repackaged.org.apache.beam.runners.core.SimpleDoFnRunner.invokeProcessElement(SimpleDoFnRunner.java:211)
    	at org.apache.beam.runners.dataflow.****.repackaged.org.apache.beam.runners.core.SimpleDoFnRunner.processElement(SimpleDoFnRunner.java:188)
    	at org.apache.beam.runners.dataflow.****.SimpleParDoFn.processElement(SimpleParDoFn.java:340)
    	at org.apache.beam.runners.dataflow.****.util.common.****.ParDoOperation.process(ParDoOperation.java:44)
    	at org.apache.beam.runners.dataflow.****.util.common.****.OutputReceiver.process(OutputReceiver.java:49)
    	at org.apache.beam.runners.dataflow.****.SimpleParDoFn$1.output(SimpleParDoFn.java:285)
    	at org.apache.beam.runners.dataflow.****.repackaged.org.apache.beam.runners.core.SimpleDoFnRunner.outputWindowedValue(SimpleDoFnRunner.java:275)
    	at org.apache.beam.runners.dataflow.****.repackaged.org.apache.beam.runners.core.SimpleDoFnRunner.access$900(SimpleDoFnRunner.java:85)
    	at org.apache.beam.runners.dataflow.****.repackaged.org.apache.beam.runners.core.SimpleDoFnRunner$DoFnProcessContext.output(SimpleDoFnRunner.java:423)
    	at org.apache.beam.sdk.transforms.DoFnOutputReceivers$WindowedContextOutputReceiver.output(DoFnOutputReceivers.java:76)
    	at org.apache.beam.sdk.transforms.MapElements$1.processElement(MapElements.java:142)
    	at org.apache.beam.sdk.transforms.MapElements$1$DoFnInvoker.invokeProcessElement(Unknown Source)
    	at org.apache.beam.runners.dataflow.****.repackaged.org.apache.beam.runners.core.SimpleDoFnRunner.invokeProcessElement(SimpleDoFnRunner.java:211)
    	at org.apache.beam.runners.dataflow.****.repackaged.org.apache.beam.runners.core.SimpleDoFnRunner.processElement(SimpleDoFnRunner.java:188)
    	at org.apache.beam.runners.dataflow.****.SimpleParDoFn.processElement(SimpleParDoFn.java:340)
    	at org.apache.beam.runners.dataflow.****.util.common.****.ParDoOperation.process(ParDoOperation.java:44)
    	at org.apache.beam.runners.dataflow.****.util.common.****.OutputReceiver.process(OutputReceiver.java:49)
    	at org.apache.beam.runners.dataflow.****.SimpleParDoFn$1.output(SimpleParDoFn.java:285)
    	at org.apache.beam.runners.dataflow.****.repackaged.org.apache.beam.runners.core.SimpleDoFnRunner.outputWindowedValue(SimpleDoFnRunner.java:275)
    	at org.apache.beam.runners.dataflow.****.repackaged.org.apache.beam.runners.core.SimpleDoFnRunner.access$900(SimpleDoFnRunner.java:85)
    	at org.apache.beam.runners.dataflow.****.repackaged.org.apache.beam.runners.core.SimpleDoFnRunner$DoFnProcessContext.output(SimpleDoFnRunner.java:423)
    	at org.apache.beam.runners.dataflow.****.repackaged.org.apache.beam.runners.core.SimpleDoFnRunner$DoFnProcessContext.output(SimpleDoFnRunner.java:411)
    	at org.apache.beam.sdk.testing.PAssert$ConcatFn.processElement(PAssert.java:1425)
    	at org.apache.beam.sdk.testing.PAssert$ConcatFn$DoFnInvoker.invokeProcessElement(Unknown Source)
    	at org.apache.beam.runners.dataflow.****.repackaged.org.apache.beam.runners.core.SimpleDoFnRunner.invokeProcessElement(SimpleDoFnRunner.java:211)
    	at org.apache.beam.runners.dataflow.****.repackaged.org.apache.beam.runners.core.SimpleDoFnRunner.processElement(SimpleDoFnRunner.java:188)
    	at org.apache.beam.runners.dataflow.****.SimpleParDoFn.processElement(SimpleParDoFn.java:340)
    	at org.apache.beam.runners.dataflow.****.util.common.****.ParDoOperation.process(ParDoOperation.java:44)
    	at org.apache.beam.runners.dataflow.****.util.common.****.OutputReceiver.process(OutputReceiver.java:49)
    	at org.apache.beam.runners.dataflow.****.SimpleParDoFn$1.output(SimpleParDoFn.java:285)
    	at org.apache.beam.runners.dataflow.****.repackaged.org.apache.beam.runners.core.SimpleDoFnRunner.outputWindowedValue(SimpleDoFnRunner.java:275)
    	at org.apache.beam.runners.dataflow.****.repackaged.org.apache.beam.runners.core.SimpleDoFnRunner.access$900(SimpleDoFnRunner.java:85)
    	at org.apache.beam.runners.dataflow.****.repackaged.org.apache.beam.runners.core.SimpleDoFnRunner$DoFnProcessContext.output(SimpleDoFnRunner.java:423)
    	at org.apache.beam.sdk.transforms.DoFnOutputReceivers$WindowedContextOutputReceiver.output(DoFnOutputReceivers.java:76)
    	at org.apache.beam.sdk.transforms.MapElements$1.processElement(MapElements.java:142)
    	at org.apache.beam.sdk.transforms.MapElements$1$DoFnInvoker.invokeProcessElement(Unknown Source)
    	at org.apache.beam.runners.dataflow.****.repackaged.org.apache.beam.runners.core.SimpleDoFnRunner.invokeProcessElement(SimpleDoFnRunner.java:211)
    	at org.apache.beam.runners.dataflow.****.repackaged.org.apache.beam.runners.core.SimpleDoFnRunner.processElement(SimpleDoFnRunner.java:188)
    	at org.apache.beam.runners.dataflow.****.SimpleParDoFn.processElement(SimpleParDoFn.java:340)
    	at org.apache.beam.runners.dataflow.****.util.common.****.ParDoOperation.process(ParDoOperation.java:44)
    	at org.apache.beam.runners.dataflow.****.util.common.****.OutputReceiver.process(OutputReceiver.java:49)
    	at org.apache.beam.runners.dataflow.****.GroupAlsoByWindowsParDoFn$1.output(GroupAlsoByWindowsParDoFn.java:185)
    	at org.apache.beam.runners.dataflow.****.GroupAlsoByWindowFnRunner$1.outputWindowedValue(GroupAlsoByWindowFnRunner.java:108)
    	at org.apache.beam.runners.dataflow.****.util.BatchGroupAlsoByWindowViaIteratorsFn.processElement(BatchGroupAlsoByWindowViaIteratorsFn.java:128)
    	at org.apache.beam.runners.dataflow.****.util.BatchGroupAlsoByWindowViaIteratorsFn.processElement(BatchGroupAlsoByWindowViaIteratorsFn.java:56)
    	at org.apache.beam.runners.dataflow.****.GroupAlsoByWindowFnRunner.invokeProcessElement(GroupAlsoByWindowFnRunner.java:121)
    	at org.apache.beam.runners.dataflow.****.GroupAlsoByWindowFnRunner.processElement(GroupAlsoByWindowFnRunner.java:73)
    	at org.apache.beam.runners.dataflow.****.GroupAlsoByWindowsParDoFn.processElement(GroupAlsoByWindowsParDoFn.java:117)
    	at org.apache.beam.runners.dataflow.****.util.common.****.ParDoOperation.process(ParDoOperation.java:44)
    	at org.apache.beam.runners.dataflow.****.util.common.****.OutputReceiver.process(OutputReceiver.java:49)
    	at org.apache.beam.runners.dataflow.****.util.common.****.ReadOperation.runReadLoop(ReadOperation.java:218)
    	at org.apache.beam.runners.dataflow.****.util.common.****.ReadOperation.start(ReadOperation.java:169)
    	at org.apache.beam.runners.dataflow.****.util.common.****.MapTaskExecutor.execute(MapTaskExecutor.java:83)
    	at org.apache.beam.runners.dataflow.****.BatchDataflowWorker.executeWork(BatchDataflowWorker.java:420)
    	at org.apache.beam.runners.dataflow.****.BatchDataflowWorker.doWork(BatchDataflowWorker.java:389)
    	at org.apache.beam.runners.dataflow.****.BatchDataflowWorker.getAndPerformWork(BatchDataflowWorker.java:314)
    	at org.apache.beam.runners.dataflow.****.DataflowBatchWorkerHarness$WorkerThread.doWork(DataflowBatchWorkerHarness.java:140)
    	at org.apache.beam.runners.dataflow.****.DataflowBatchWorkerHarness$WorkerThread.call(DataflowBatchWorkerHarness.java:120)
    	at org.apache.beam.runners.dataflow.****.DataflowBatchWorkerHarness$WorkerThread.call(DataflowBatchWorkerHarness.java:107)
    	at java.util.concurrent.FutureTask.run(FutureTask.java:266)
    	at java.util.concurrent.ThreadPoolExecutor.runWorker(ThreadPoolExecutor.java:1149)
    	at java.util.concurrent.ThreadPoolExecutor$Worker.run(ThreadPoolExecutor.java:624)
    	at java.lang.Thread.run(Thread.java:748)

    Sep 16, 2022 7:39:45 AM org.apache.beam.runners.dataflow.util.MonitoringUtil$LoggingHandler process
    INFO: 2022-09-16T07:39:43.491Z: Finished operation PAssert$0/GroupGlobally/GroupByKey/Read+PAssert$0/GroupGlobally/GroupByKey/GroupByWindow+PAssert$0/GroupGlobally/Values/Values/Map+PAssert$0/GroupGlobally/ParDo(Concat)+PAssert$0/GetPane/Map+PAssert$0/RunChecks+PAssert$0/VerifyAssertions/ParDo(DefaultConclude)
    Sep 16, 2022 7:39:45 AM org.apache.beam.runners.dataflow.util.MonitoringUtil$LoggingHandler process
    SEVERE: 2022-09-16T07:39:43.592Z: Workflow failed. Causes: S11:PAssert$0/GroupGlobally/GroupByKey/Read+PAssert$0/GroupGlobally/GroupByKey/GroupByWindow+PAssert$0/GroupGlobally/Values/Values/Map+PAssert$0/GroupGlobally/ParDo(Concat)+PAssert$0/GetPane/Map+PAssert$0/RunChecks+PAssert$0/VerifyAssertions/ParDo(DefaultConclude) failed., The job failed because a work item has failed 4 times. Look in previous log entries for the cause of each one of the 4 failures. For more information, see https://cloud.google.com/dataflow/docs/guides/common-errors. The work item was attempted on these ****s: 

      kafkaioit0testkafkaioread-09160022-2012-harness-gzgn
          Root cause: Work item failed.,

      kafkaioit0testkafkaioread-09160022-2012-harness-ksgl
          Root cause: Work item failed.,

      kafkaioit0testkafkaioread-09160022-2012-harness-66h4
          Root cause: Work item failed.,

      kafkaioit0testkafkaioread-09160022-2012-harness-66h4
          Root cause: Work item failed.
    Sep 16, 2022 7:39:45 AM org.apache.beam.runners.dataflow.util.MonitoringUtil$LoggingHandler process
    INFO: 2022-09-16T07:39:43.677Z: Cleaning up.
    Sep 16, 2022 7:39:45 AM org.apache.beam.runners.dataflow.util.MonitoringUtil$LoggingHandler process
    INFO: 2022-09-16T07:39:43.791Z: Stopping **** pool...
    Sep 16, 2022 7:41:56 AM org.apache.beam.runners.dataflow.util.MonitoringUtil$LoggingHandler process
    INFO: 2022-09-16T07:41:56.574Z: Autoscaling: Resized **** pool from 5 to 0.
    Sep 16, 2022 7:41:56 AM org.apache.beam.runners.dataflow.util.MonitoringUtil$LoggingHandler process
    INFO: 2022-09-16T07:41:56.607Z: Worker pool stopped.
    Sep 16, 2022 7:42:03 AM org.apache.beam.runners.dataflow.DataflowPipelineJob logTerminalState
    INFO: Job 2022-09-16_00_22_58-1844280272156431073 failed with status FAILED.

Gradle Test Executor 35 finished executing tests.

> Task :sdks:java:io:kafka:integrationTest FAILED

org.apache.beam.sdk.io.kafka.KafkaIOIT > testKafkaIOReadsAndWritesCorrectlyInBatch FAILED
    java.lang.AssertionError: expected:<FAILED> but was:<DONE>
        at org.junit.Assert.fail(Assert.java:89)
        at org.junit.Assert.failNotEquals(Assert.java:835)
        at org.junit.Assert.assertEquals(Assert.java:120)
        at org.junit.Assert.assertEquals(Assert.java:146)
        at org.apache.beam.sdk.io.kafka.KafkaIOIT.testKafkaIOReadsAndWritesCorrectlyInBatch(KafkaIOIT.java:254)

1 test completed, 1 failed
Finished generating test XML results (0.004 secs) into: <https://ci-beam.apache.org/job/beam_PerformanceTests_Kafka_IO/ws/src/sdks/java/io/kafka/build/test-results/integrationTest>
Generating HTML test report...
Finished generating test html results (0.006 secs) into: <https://ci-beam.apache.org/job/beam_PerformanceTests_Kafka_IO/ws/src/sdks/java/io/kafka/build/reports/tests/integrationTest>
:sdks:java:io:kafka:integrationTest (Thread[included builds,5,main]) completed. Took 26 mins 27.463 secs.

FAILURE: Build failed with an exception.

* What went wrong:
Execution failed for task ':sdks:java:io:kafka:integrationTest'.
> There were failing tests. See the report at: file://<https://ci-beam.apache.org/job/beam_PerformanceTests_Kafka_IO/ws/src/sdks/java/io/kafka/build/reports/tests/integrationTest/index.html>

* Try:
> Run with --stacktrace option to get the stack trace.
> Run with --debug option to get more log output.

* Get more help at https://help.gradle.org

Deprecated Gradle features were used in this build, making it incompatible with Gradle 8.0.

You can use '--warning-mode all' to show the individual deprecation warnings and determine if they come from your own scripts or plugins.

See https://docs.gradle.org/7.5.1/userguide/command_line_interface.html#sec:command_line_warnings

BUILD FAILED in 26m 34s
136 actionable tasks: 1 executed, 135 up-to-date

Publishing build scan...
https://gradle.com/s/zgsvpuqig6lws

Build step 'Invoke Gradle script' changed build result to FAILURE
Build step 'Invoke Gradle script' marked build as failure

---------------------------------------------------------------------
To unsubscribe, e-mail: builds-unsubscribe@beam.apache.org
For additional commands, e-mail: builds-help@beam.apache.org