You are viewing a plain text version of this content. The canonical link for it is here.
Posted to commits@olingo.apache.org by Apache Jenkins Server <je...@builds.apache.org> on 2013/08/03 03:26:13 UTC
Build failed in Jenkins: olingo-odata2-quality #4
See <https://builds.apache.org/job/olingo-odata2-quality/4/>
------------------------------------------
Started by timer
Building remotely on solaris1 in workspace <https://builds.apache.org/job/olingo-odata2-quality/ws/>
Checkout:olingo-odata2-quality / <https://builds.apache.org/job/olingo-odata2-quality/ws/> - hudson.remoting.Channel@49affffb:solaris1
Using strategy: Default
Last Built Revision: Revision 189835dd085b15730ad9fcfb4c57e094fb473a6f (origin/master, origin/HEAD)
Cloning the remote Git repository
Cloning repository https://git-wip-us.apache.org/repos/asf/incubator-olingo-odata2.git
Error trying to determine the git version: Error performing command: git --version
Assuming 1.6
ERROR: Error cloning remote repo 'origin' : Could not clone https://git-wip-us.apache.org/repos/asf/incubator-olingo-odata2.git
hudson.plugins.git.GitException: Could not clone https://git-wip-us.apache.org/repos/asf/incubator-olingo-odata2.git
at org.jenkinsci.plugins.gitclient.CliGitAPIImpl.clone(CliGitAPIImpl.java:220)
at hudson.plugins.git.GitSCM$2.invoke(GitSCM.java:1006)
at hudson.plugins.git.GitSCM$2.invoke(GitSCM.java:942)
at hudson.FilePath$FileCallableWrapper.call(FilePath.java:2415)
at hudson.remoting.UserRequest.perform(UserRequest.java:118)
at hudson.remoting.UserRequest.perform(UserRequest.java:48)
at hudson.remoting.Request$2.run(Request.java:326)
at hudson.remoting.InterceptingExecutorService$1.call(InterceptingExecutorService.java:72)
at java.util.concurrent.FutureTask$Sync.innerRun(FutureTask.java:303)
at java.util.concurrent.FutureTask.run(FutureTask.java:138)
at java.util.concurrent.ThreadPoolExecutor$Worker.runTask(ThreadPoolExecutor.java:886)
at java.util.concurrent.ThreadPoolExecutor$Worker.run(ThreadPoolExecutor.java:908)
at java.lang.Thread.run(Thread.java:662)
Caused by: hudson.plugins.git.GitException: Error performing command: git clone -o origin https://git-wip-us.apache.org/repos/asf/incubator-olingo-odata2.git <https://builds.apache.org/job/olingo-odata2-quality/ws/>
at org.jenkinsci.plugins.gitclient.CliGitAPIImpl.launchCommandIn(CliGitAPIImpl.java:781)
at org.jenkinsci.plugins.gitclient.CliGitAPIImpl.clone(CliGitAPIImpl.java:218)
... 12 more
Caused by: java.io.IOException: Cannot run program "git": error=2, No such file or directory
at java.lang.ProcessBuilder.start(ProcessBuilder.java:460)
at hudson.Proc$LocalProc.<init>(Proc.java:244)
at hudson.Proc$LocalProc.<init>(Proc.java:216)
at hudson.Launcher$LocalLauncher.launch(Launcher.java:773)
at hudson.Launcher$ProcStarter.start(Launcher.java:353)
at hudson.Launcher$ProcStarter.join(Launcher.java:360)
at org.jenkinsci.plugins.gitclient.CliGitAPIImpl.launchCommandIn(CliGitAPIImpl.java:770)
... 13 more
Caused by: java.io.IOException: error=2, No such file or directory
at java.lang.UNIXProcess.forkAndExec(Native Method)
at java.lang.UNIXProcess.<init>(UNIXProcess.java:53)
at java.lang.ProcessImpl.start(ProcessImpl.java:65)
at java.lang.ProcessBuilder.start(ProcessBuilder.java:453)
... 19 more
Trying next repository
ERROR: Could not clone repository
hudson.util.IOException2: remote file operation failed: <https://builds.apache.org/job/olingo-odata2-quality/ws/> at hudson.remoting.Channel@49affffb:solaris1
at hudson.FilePath.act(FilePath.java:902)
at hudson.FilePath.act(FilePath.java:879)
at hudson.plugins.git.GitSCM.determineRevisionToBuild(GitSCM.java:942)
at hudson.plugins.git.GitSCM.checkout(GitSCM.java:1108)
at hudson.model.AbstractProject.checkout(AbstractProject.java:1394)
at hudson.model.AbstractBuild$AbstractBuildExecution.defaultCheckout(AbstractBuild.java:676)
at jenkins.scm.SCMCheckoutStrategy.checkout(SCMCheckoutStrategy.java:88)
at hudson.model.AbstractBuild$AbstractBuildExecution.run(AbstractBuild.java:581)
at hudson.model.Run.execute(Run.java:1593)
at hudson.model.FreeStyleBuild.run(FreeStyleBuild.java:46)
at hudson.model.ResourceController.execute(ResourceController.java:88)
at hudson.model.Executor.run(Executor.java:247)
Caused by: java.io.IOException: Could not clone
at hudson.plugins.git.GitSCM$2.invoke(GitSCM.java:1019)
at hudson.plugins.git.GitSCM$2.invoke(GitSCM.java:942)
at hudson.FilePath$FileCallableWrapper.call(FilePath.java:2415)
at hudson.remoting.UserRequest.perform(UserRequest.java:118)
at hudson.remoting.UserRequest.perform(UserRequest.java:48)
at hudson.remoting.Request$2.run(Request.java:326)
at hudson.remoting.InterceptingExecutorService$1.call(InterceptingExecutorService.java:72)
at java.util.concurrent.FutureTask$Sync.innerRun(FutureTask.java:303)
at java.util.concurrent.FutureTask.run(FutureTask.java:138)
at java.util.concurrent.ThreadPoolExecutor$Worker.runTask(ThreadPoolExecutor.java:886)
at java.util.concurrent.ThreadPoolExecutor$Worker.run(ThreadPoolExecutor.java:908)
at java.lang.Thread.run(Thread.java:662)
Retrying after 10 seconds
Checkout:olingo-odata2-quality / <https://builds.apache.org/job/olingo-odata2-quality/ws/> - hudson.remoting.Channel@49affffb:solaris1
Using strategy: Default
Last Built Revision: Revision 189835dd085b15730ad9fcfb4c57e094fb473a6f (origin/master, origin/HEAD)
Cloning the remote Git repository
Cloning repository https://git-wip-us.apache.org/repos/asf/incubator-olingo-odata2.git
Error trying to determine the git version: Error performing command: git --version
Assuming 1.6
ERROR: Error cloning remote repo 'origin' : Could not clone https://git-wip-us.apache.org/repos/asf/incubator-olingo-odata2.git
hudson.plugins.git.GitException: Could not clone https://git-wip-us.apache.org/repos/asf/incubator-olingo-odata2.git
at org.jenkinsci.plugins.gitclient.CliGitAPIImpl.clone(CliGitAPIImpl.java:220)
at hudson.plugins.git.GitSCM$2.invoke(GitSCM.java:1006)
at hudson.plugins.git.GitSCM$2.invoke(GitSCM.java:942)
at hudson.FilePath$FileCallableWrapper.call(FilePath.java:2415)
at hudson.remoting.UserRequest.perform(UserRequest.java:118)
at hudson.remoting.UserRequest.perform(UserRequest.java:48)
at hudson.remoting.Request$2.run(Request.java:326)
at hudson.remoting.InterceptingExecutorService$1.call(InterceptingExecutorService.java:72)
at java.util.concurrent.FutureTask$Sync.innerRun(FutureTask.java:303)
at java.util.concurrent.FutureTask.run(FutureTask.java:138)
at java.util.concurrent.ThreadPoolExecutor$Worker.runTask(ThreadPoolExecutor.java:886)
at java.util.concurrent.ThreadPoolExecutor$Worker.run(ThreadPoolExecutor.java:908)
at java.lang.Thread.run(Thread.java:662)
Caused by: hudson.plugins.git.GitException: Error performing command: git clone -o origin https://git-wip-us.apache.org/repos/asf/incubator-olingo-odata2.git <https://builds.apache.org/job/olingo-odata2-quality/ws/>
at org.jenkinsci.plugins.gitclient.CliGitAPIImpl.launchCommandIn(CliGitAPIImpl.java:781)
at org.jenkinsci.plugins.gitclient.CliGitAPIImpl.clone(CliGitAPIImpl.java:218)
... 12 more
Caused by: java.io.IOException: Cannot run program "git": error=2, No such file or directory
at java.lang.ProcessBuilder.start(ProcessBuilder.java:460)
at hudson.Proc$LocalProc.<init>(Proc.java:244)
at hudson.Proc$LocalProc.<init>(Proc.java:216)
at hudson.Launcher$LocalLauncher.launch(Launcher.java:773)
at hudson.Launcher$ProcStarter.start(Launcher.java:353)
at hudson.Launcher$ProcStarter.join(Launcher.java:360)
at org.jenkinsci.plugins.gitclient.CliGitAPIImpl.launchCommandIn(CliGitAPIImpl.java:770)
... 13 more
Caused by: java.io.IOException: error=2, No such file or directory
at java.lang.UNIXProcess.forkAndExec(Native Method)
at java.lang.UNIXProcess.<init>(UNIXProcess.java:53)
at java.lang.ProcessImpl.start(ProcessImpl.java:65)
at java.lang.ProcessBuilder.start(ProcessBuilder.java:453)
... 19 more
Trying next repository
ERROR: Could not clone repository
hudson.util.IOException2: remote file operation failed: <https://builds.apache.org/job/olingo-odata2-quality/ws/> at hudson.remoting.Channel@49affffb:solaris1
at hudson.FilePath.act(FilePath.java:902)
at hudson.FilePath.act(FilePath.java:879)
at hudson.plugins.git.GitSCM.determineRevisionToBuild(GitSCM.java:942)
at hudson.plugins.git.GitSCM.checkout(GitSCM.java:1108)
at hudson.model.AbstractProject.checkout(AbstractProject.java:1394)
at hudson.model.AbstractBuild$AbstractBuildExecution.defaultCheckout(AbstractBuild.java:676)
at jenkins.scm.SCMCheckoutStrategy.checkout(SCMCheckoutStrategy.java:88)
at hudson.model.AbstractBuild$AbstractBuildExecution.run(AbstractBuild.java:581)
at hudson.model.Run.execute(Run.java:1593)
at hudson.model.FreeStyleBuild.run(FreeStyleBuild.java:46)
at hudson.model.ResourceController.execute(ResourceController.java:88)
at hudson.model.Executor.run(Executor.java:247)
Caused by: java.io.IOException: Could not clone
at hudson.plugins.git.GitSCM$2.invoke(GitSCM.java:1019)
at hudson.plugins.git.GitSCM$2.invoke(GitSCM.java:942)
at hudson.FilePath$FileCallableWrapper.call(FilePath.java:2415)
at hudson.remoting.UserRequest.perform(UserRequest.java:118)
at hudson.remoting.UserRequest.perform(UserRequest.java:48)
at hudson.remoting.Request$2.run(Request.java:326)
at hudson.remoting.InterceptingExecutorService$1.call(InterceptingExecutorService.java:72)
at java.util.concurrent.FutureTask$Sync.innerRun(FutureTask.java:303)
at java.util.concurrent.FutureTask.run(FutureTask.java:138)
at java.util.concurrent.ThreadPoolExecutor$Worker.runTask(ThreadPoolExecutor.java:886)
at java.util.concurrent.ThreadPoolExecutor$Worker.run(ThreadPoolExecutor.java:908)
at java.lang.Thread.run(Thread.java:662)
Retrying after 10 seconds
Checkout:olingo-odata2-quality / <https://builds.apache.org/job/olingo-odata2-quality/ws/> - hudson.remoting.Channel@49affffb:solaris1
Using strategy: Default
Last Built Revision: Revision 189835dd085b15730ad9fcfb4c57e094fb473a6f (origin/master, origin/HEAD)
Cloning the remote Git repository
Cloning repository https://git-wip-us.apache.org/repos/asf/incubator-olingo-odata2.git
Error trying to determine the git version: Error performing command: git --version
Assuming 1.6
ERROR: Error cloning remote repo 'origin' : Could not clone https://git-wip-us.apache.org/repos/asf/incubator-olingo-odata2.git
hudson.plugins.git.GitException: Could not clone https://git-wip-us.apache.org/repos/asf/incubator-olingo-odata2.git
at org.jenkinsci.plugins.gitclient.CliGitAPIImpl.clone(CliGitAPIImpl.java:220)
at hudson.plugins.git.GitSCM$2.invoke(GitSCM.java:1006)
at hudson.plugins.git.GitSCM$2.invoke(GitSCM.java:942)
at hudson.FilePath$FileCallableWrapper.call(FilePath.java:2415)
at hudson.remoting.UserRequest.perform(UserRequest.java:118)
at hudson.remoting.UserRequest.perform(UserRequest.java:48)
at hudson.remoting.Request$2.run(Request.java:326)
at hudson.remoting.InterceptingExecutorService$1.call(InterceptingExecutorService.java:72)
at java.util.concurrent.FutureTask$Sync.innerRun(FutureTask.java:303)
at java.util.concurrent.FutureTask.run(FutureTask.java:138)
at java.util.concurrent.ThreadPoolExecutor$Worker.runTask(ThreadPoolExecutor.java:886)
at java.util.concurrent.ThreadPoolExecutor$Worker.run(ThreadPoolExecutor.java:908)
at java.lang.Thread.run(Thread.java:662)
Caused by: hudson.plugins.git.GitException: Error performing command: git clone -o origin https://git-wip-us.apache.org/repos/asf/incubator-olingo-odata2.git <https://builds.apache.org/job/olingo-odata2-quality/ws/>
at org.jenkinsci.plugins.gitclient.CliGitAPIImpl.launchCommandIn(CliGitAPIImpl.java:781)
at org.jenkinsci.plugins.gitclient.CliGitAPIImpl.clone(CliGitAPIImpl.java:218)
... 12 more
Caused by: java.io.IOException: Cannot run program "git": error=2, No such file or directory
at java.lang.ProcessBuilder.start(ProcessBuilder.java:460)
at hudson.Proc$LocalProc.<init>(Proc.java:244)
at hudson.Proc$LocalProc.<init>(Proc.java:216)
at hudson.Launcher$LocalLauncher.launch(Launcher.java:773)
at hudson.Launcher$ProcStarter.start(Launcher.java:353)
at hudson.Launcher$ProcStarter.join(Launcher.java:360)
at org.jenkinsci.plugins.gitclient.CliGitAPIImpl.launchCommandIn(CliGitAPIImpl.java:770)
... 13 more
Caused by: java.io.IOException: error=2, No such file or directory
at java.lang.UNIXProcess.forkAndExec(Native Method)
at java.lang.UNIXProcess.<init>(UNIXProcess.java:53)
at java.lang.ProcessImpl.start(ProcessImpl.java:65)
at java.lang.ProcessBuilder.start(ProcessBuilder.java:453)
... 19 more
Trying next repository
ERROR: Could not clone repository
hudson.util.IOException2: remote file operation failed: <https://builds.apache.org/job/olingo-odata2-quality/ws/> at hudson.remoting.Channel@49affffb:solaris1
at hudson.FilePath.act(FilePath.java:902)
at hudson.FilePath.act(FilePath.java:879)
at hudson.plugins.git.GitSCM.determineRevisionToBuild(GitSCM.java:942)
at hudson.plugins.git.GitSCM.checkout(GitSCM.java:1108)
at hudson.model.AbstractProject.checkout(AbstractProject.java:1394)
at hudson.model.AbstractBuild$AbstractBuildExecution.defaultCheckout(AbstractBuild.java:676)
at jenkins.scm.SCMCheckoutStrategy.checkout(SCMCheckoutStrategy.java:88)
at hudson.model.AbstractBuild$AbstractBuildExecution.run(AbstractBuild.java:581)
at hudson.model.Run.execute(Run.java:1593)
at hudson.model.FreeStyleBuild.run(FreeStyleBuild.java:46)
at hudson.model.ResourceController.execute(ResourceController.java:88)
at hudson.model.Executor.run(Executor.java:247)
Caused by: java.io.IOException: Could not clone
at hudson.plugins.git.GitSCM$2.invoke(GitSCM.java:1019)
at hudson.plugins.git.GitSCM$2.invoke(GitSCM.java:942)
at hudson.FilePath$FileCallableWrapper.call(FilePath.java:2415)
at hudson.remoting.UserRequest.perform(UserRequest.java:118)
at hudson.remoting.UserRequest.perform(UserRequest.java:48)
at hudson.remoting.Request$2.run(Request.java:326)
at hudson.remoting.InterceptingExecutorService$1.call(InterceptingExecutorService.java:72)
at java.util.concurrent.FutureTask$Sync.innerRun(FutureTask.java:303)
at java.util.concurrent.FutureTask.run(FutureTask.java:138)
at java.util.concurrent.ThreadPoolExecutor$Worker.runTask(ThreadPoolExecutor.java:886)
at java.util.concurrent.ThreadPoolExecutor$Worker.run(ThreadPoolExecutor.java:908)
at java.lang.Thread.run(Thread.java:662)
Jenkins build is back to normal : olingo-odata2-quality #6
Posted by Apache Jenkins Server <je...@builds.apache.org>.
See <https://builds.apache.org/job/olingo-odata2-quality/6/changes>
Build failed in Jenkins: olingo-odata2-quality #5
Posted by Apache Jenkins Server <je...@builds.apache.org>.
See <https://builds.apache.org/job/olingo-odata2-quality/5/changes>
Changes:
[sklevenz] delete readme (obsolete)
[unknown] Removed developers from pom (no site proj exists)
[chandan.v.a] Fixed issue in Facets for Null Column instance
[jhuesken] Cleanup 'sap' in test sources and files (core,fit)
[chandanva] Changes to xml namespace in JPA Mapping model xsd
------------------------------------------
[...truncated 956 lines...]
at java.lang.reflect.Method.invoke(Method.java:597)
at org.junit.runners.model.FrameworkMethod$1.runReflectiveCall(FrameworkMethod.java:45)
at org.junit.internal.runners.model.ReflectiveCallable.run(ReflectiveCallable.java:15)
at org.junit.runners.model.FrameworkMethod.invokeExplosively(FrameworkMethod.java:42)
at org.junit.internal.runners.statements.InvokeMethod.evaluate(InvokeMethod.java:20)
at org.junit.rules.TestWatcher$1.evaluate(TestWatcher.java:47)
at org.junit.rules.RunRules.evaluate(RunRules.java:18)
at org.junit.runners.ParentRunner.runLeaf(ParentRunner.java:263)
at org.junit.runners.BlockJUnit4ClassRunner.runChild(BlockJUnit4ClassRunner.java:68)
at org.junit.runners.BlockJUnit4ClassRunner.runChild(BlockJUnit4ClassRunner.java:47)
at org.junit.runners.ParentRunner$3.run(ParentRunner.java:231)
at org.junit.runners.ParentRunner$1.schedule(ParentRunner.java:60)
at org.junit.runners.ParentRunner.runChildren(ParentRunner.java:229)
at org.junit.runners.ParentRunner.access$000(ParentRunner.java:50)
at org.junit.runners.ParentRunner$2.evaluate(ParentRunner.java:222)
at org.junit.runners.ParentRunner.run(ParentRunner.java:300)
at org.apache.maven.surefire.junit4.JUnit4Provider.execute(JUnit4Provider.java:252)
at org.apache.maven.surefire.junit4.JUnit4Provider.executeTestSet(JUnit4Provider.java:141)
at org.apache.maven.surefire.junit4.JUnit4Provider.invoke(JUnit4Provider.java:112)
at sun.reflect.NativeMethodAccessorImpl.invoke0(Native Method)
at sun.reflect.NativeMethodAccessorImpl.invoke(NativeMethodAccessorImpl.java:39)
at sun.reflect.DelegatingMethodAccessorImpl.invoke(DelegatingMethodAccessorImpl.java:25)
at java.lang.reflect.Method.invoke(Method.java:597)
at org.apache.maven.surefire.util.ReflectionUtils.invokeMethodWithArray(ReflectionUtils.java:189)
at org.apache.maven.surefire.booter.ProviderFactory$ProviderProxy.invoke(ProviderFactory.java:165)
at org.apache.maven.surefire.booter.ProviderFactory.invokeProvider(ProviderFactory.java:85)
at org.apache.maven.surefire.booter.ForkedBooter.runSuitesInProcess(ForkedBooter.java:115)
at org.apache.maven.surefire.booter.ForkedBooter.main(ForkedBooter.java:75)
testTwoParametersWithTwoAddContent(org.apache.olingo.odata2.core.exception.MessageServiceTest) Time elapsed: 0.001 sec <<< FAILURE!
org.junit.ComparisonFailure: expected:<[First was [first] and second was [second]]!> but was:<[Missing message for key 'org.apache.olingo.odata2.api.exception.ODataMessageException.TWO_REPLACEMENTS']!>
at org.junit.Assert.assertEquals(Assert.java:125)
at org.junit.Assert.assertEquals(Assert.java:147)
at org.apache.olingo.odata2.core.exception.MessageServiceTest.testTwoParametersWithTwoAddContent(MessageServiceTest.java:84)
at sun.reflect.NativeMethodAccessorImpl.invoke0(Native Method)
at sun.reflect.NativeMethodAccessorImpl.invoke(NativeMethodAccessorImpl.java:39)
at sun.reflect.DelegatingMethodAccessorImpl.invoke(DelegatingMethodAccessorImpl.java:25)
at java.lang.reflect.Method.invoke(Method.java:597)
at org.junit.runners.model.FrameworkMethod$1.runReflectiveCall(FrameworkMethod.java:45)
at org.junit.internal.runners.model.ReflectiveCallable.run(ReflectiveCallable.java:15)
at org.junit.runners.model.FrameworkMethod.invokeExplosively(FrameworkMethod.java:42)
at org.junit.internal.runners.statements.InvokeMethod.evaluate(InvokeMethod.java:20)
at org.junit.rules.TestWatcher$1.evaluate(TestWatcher.java:47)
at org.junit.rules.RunRules.evaluate(RunRules.java:18)
at org.junit.runners.ParentRunner.runLeaf(ParentRunner.java:263)
at org.junit.runners.BlockJUnit4ClassRunner.runChild(BlockJUnit4ClassRunner.java:68)
at org.junit.runners.BlockJUnit4ClassRunner.runChild(BlockJUnit4ClassRunner.java:47)
at org.junit.runners.ParentRunner$3.run(ParentRunner.java:231)
at org.junit.runners.ParentRunner$1.schedule(ParentRunner.java:60)
at org.junit.runners.ParentRunner.runChildren(ParentRunner.java:229)
at org.junit.runners.ParentRunner.access$000(ParentRunner.java:50)
at org.junit.runners.ParentRunner$2.evaluate(ParentRunner.java:222)
at org.junit.runners.ParentRunner.run(ParentRunner.java:300)
at org.apache.maven.surefire.junit4.JUnit4Provider.execute(JUnit4Provider.java:252)
at org.apache.maven.surefire.junit4.JUnit4Provider.executeTestSet(JUnit4Provider.java:141)
at org.apache.maven.surefire.junit4.JUnit4Provider.invoke(JUnit4Provider.java:112)
at sun.reflect.NativeMethodAccessorImpl.invoke0(Native Method)
at sun.reflect.NativeMethodAccessorImpl.invoke(NativeMethodAccessorImpl.java:39)
at sun.reflect.DelegatingMethodAccessorImpl.invoke(DelegatingMethodAccessorImpl.java:25)
at java.lang.reflect.Method.invoke(Method.java:597)
at org.apache.maven.surefire.util.ReflectionUtils.invokeMethodWithArray(ReflectionUtils.java:189)
at org.apache.maven.surefire.booter.ProviderFactory$ProviderProxy.invoke(ProviderFactory.java:165)
at org.apache.maven.surefire.booter.ProviderFactory.invokeProvider(ProviderFactory.java:85)
at org.apache.maven.surefire.booter.ForkedBooter.runSuitesInProcess(ForkedBooter.java:115)
at org.apache.maven.surefire.booter.ForkedBooter.main(ForkedBooter.java:75)
testThreeParametersForTwo(org.apache.olingo.odata2.core.exception.MessageServiceTest) Time elapsed: 0.001 sec <<< FAILURE!
org.junit.ComparisonFailure: expected:<[First was [first] and second was [second]]!> but was:<[Missing message for key 'org.apache.olingo.odata2.api.exception.ODataMessageException.TWO_REPLACEMENTS']!>
at org.junit.Assert.assertEquals(Assert.java:125)
at org.junit.Assert.assertEquals(Assert.java:147)
at org.apache.olingo.odata2.core.exception.MessageServiceTest.testThreeParametersForTwo(MessageServiceTest.java:92)
at sun.reflect.NativeMethodAccessorImpl.invoke0(Native Method)
at sun.reflect.NativeMethodAccessorImpl.invoke(NativeMethodAccessorImpl.java:39)
at sun.reflect.DelegatingMethodAccessorImpl.invoke(DelegatingMethodAccessorImpl.java:25)
at java.lang.reflect.Method.invoke(Method.java:597)
at org.junit.runners.model.FrameworkMethod$1.runReflectiveCall(FrameworkMethod.java:45)
at org.junit.internal.runners.model.ReflectiveCallable.run(ReflectiveCallable.java:15)
at org.junit.runners.model.FrameworkMethod.invokeExplosively(FrameworkMethod.java:42)
at org.junit.internal.runners.statements.InvokeMethod.evaluate(InvokeMethod.java:20)
at org.junit.rules.TestWatcher$1.evaluate(TestWatcher.java:47)
at org.junit.rules.RunRules.evaluate(RunRules.java:18)
at org.junit.runners.ParentRunner.runLeaf(ParentRunner.java:263)
at org.junit.runners.BlockJUnit4ClassRunner.runChild(BlockJUnit4ClassRunner.java:68)
at org.junit.runners.BlockJUnit4ClassRunner.runChild(BlockJUnit4ClassRunner.java:47)
at org.junit.runners.ParentRunner$3.run(ParentRunner.java:231)
at org.junit.runners.ParentRunner$1.schedule(ParentRunner.java:60)
at org.junit.runners.ParentRunner.runChildren(ParentRunner.java:229)
at org.junit.runners.ParentRunner.access$000(ParentRunner.java:50)
at org.junit.runners.ParentRunner$2.evaluate(ParentRunner.java:222)
at org.junit.runners.ParentRunner.run(ParentRunner.java:300)
at org.apache.maven.surefire.junit4.JUnit4Provider.execute(JUnit4Provider.java:252)
at org.apache.maven.surefire.junit4.JUnit4Provider.executeTestSet(JUnit4Provider.java:141)
at org.apache.maven.surefire.junit4.JUnit4Provider.invoke(JUnit4Provider.java:112)
at sun.reflect.NativeMethodAccessorImpl.invoke0(Native Method)
at sun.reflect.NativeMethodAccessorImpl.invoke(NativeMethodAccessorImpl.java:39)
at sun.reflect.DelegatingMethodAccessorImpl.invoke(DelegatingMethodAccessorImpl.java:25)
at java.lang.reflect.Method.invoke(Method.java:597)
at org.apache.maven.surefire.util.ReflectionUtils.invokeMethodWithArray(ReflectionUtils.java:189)
at org.apache.maven.surefire.booter.ProviderFactory$ProviderProxy.invoke(ProviderFactory.java:165)
at org.apache.maven.surefire.booter.ProviderFactory.invokeProvider(ProviderFactory.java:85)
at org.apache.maven.surefire.booter.ForkedBooter.runSuitesInProcess(ForkedBooter.java:115)
at org.apache.maven.surefire.booter.ForkedBooter.main(ForkedBooter.java:75)
testThreeParametersPerAddContentForTwo(org.apache.olingo.odata2.core.exception.MessageServiceTest) Time elapsed: 0.001 sec <<< FAILURE!
org.junit.ComparisonFailure: expected:<[First was [first] and second was [second]]!> but was:<[Missing message for key 'org.apache.olingo.odata2.api.exception.ODataMessageException.TWO_REPLACEMENTS']!>
at org.junit.Assert.assertEquals(Assert.java:125)
at org.junit.Assert.assertEquals(Assert.java:147)
at org.apache.olingo.odata2.core.exception.MessageServiceTest.testThreeParametersPerAddContentForTwo(MessageServiceTest.java:101)
at sun.reflect.NativeMethodAccessorImpl.invoke0(Native Method)
at sun.reflect.NativeMethodAccessorImpl.invoke(NativeMethodAccessorImpl.java:39)
at sun.reflect.DelegatingMethodAccessorImpl.invoke(DelegatingMethodAccessorImpl.java:25)
at java.lang.reflect.Method.invoke(Method.java:597)
at org.junit.runners.model.FrameworkMethod$1.runReflectiveCall(FrameworkMethod.java:45)
at org.junit.internal.runners.model.ReflectiveCallable.run(ReflectiveCallable.java:15)
at org.junit.runners.model.FrameworkMethod.invokeExplosively(FrameworkMethod.java:42)
at org.junit.internal.runners.statements.InvokeMethod.evaluate(InvokeMethod.java:20)
at org.junit.rules.TestWatcher$1.evaluate(TestWatcher.java:47)
at org.junit.rules.RunRules.evaluate(RunRules.java:18)
at org.junit.runners.ParentRunner.runLeaf(ParentRunner.java:263)
at org.junit.runners.BlockJUnit4ClassRunner.runChild(BlockJUnit4ClassRunner.java:68)
at org.junit.runners.BlockJUnit4ClassRunner.runChild(BlockJUnit4ClassRunner.java:47)
at org.junit.runners.ParentRunner$3.run(ParentRunner.java:231)
at org.junit.runners.ParentRunner$1.schedule(ParentRunner.java:60)
at org.junit.runners.ParentRunner.runChildren(ParentRunner.java:229)
at org.junit.runners.ParentRunner.access$000(ParentRunner.java:50)
at org.junit.runners.ParentRunner$2.evaluate(ParentRunner.java:222)
at org.junit.runners.ParentRunner.run(ParentRunner.java:300)
at org.apache.maven.surefire.junit4.JUnit4Provider.execute(JUnit4Provider.java:252)
at org.apache.maven.surefire.junit4.JUnit4Provider.executeTestSet(JUnit4Provider.java:141)
at org.apache.maven.surefire.junit4.JUnit4Provider.invoke(JUnit4Provider.java:112)
at sun.reflect.NativeMethodAccessorImpl.invoke0(Native Method)
at sun.reflect.NativeMethodAccessorImpl.invoke(NativeMethodAccessorImpl.java:39)
at sun.reflect.DelegatingMethodAccessorImpl.invoke(DelegatingMethodAccessorImpl.java:25)
at java.lang.reflect.Method.invoke(Method.java:597)
at org.apache.maven.surefire.util.ReflectionUtils.invokeMethodWithArray(ReflectionUtils.java:189)
at org.apache.maven.surefire.booter.ProviderFactory$ProviderProxy.invoke(ProviderFactory.java:165)
at org.apache.maven.surefire.booter.ProviderFactory.invokeProvider(ProviderFactory.java:85)
at org.apache.maven.surefire.booter.ForkedBooter.runSuitesInProcess(ForkedBooter.java:115)
at org.apache.maven.surefire.booter.ForkedBooter.main(ForkedBooter.java:75)
testThreeParametersPerMixedForTwo(org.apache.olingo.odata2.core.exception.MessageServiceTest) Time elapsed: 0.001 sec <<< FAILURE!
org.junit.ComparisonFailure: expected:<[First was [first] and second was [second]]!> but was:<[Missing message for key 'org.apache.olingo.odata2.api.exception.ODataMessageException.TWO_REPLACEMENTS']!>
at org.junit.Assert.assertEquals(Assert.java:125)
at org.junit.Assert.assertEquals(Assert.java:147)
at org.apache.olingo.odata2.core.exception.MessageServiceTest.testThreeParametersPerMixedForTwo(MessageServiceTest.java:110)
at sun.reflect.NativeMethodAccessorImpl.invoke0(Native Method)
at sun.reflect.NativeMethodAccessorImpl.invoke(NativeMethodAccessorImpl.java:39)
at sun.reflect.DelegatingMethodAccessorImpl.invoke(DelegatingMethodAccessorImpl.java:25)
at java.lang.reflect.Method.invoke(Method.java:597)
at org.junit.runners.model.FrameworkMethod$1.runReflectiveCall(FrameworkMethod.java:45)
at org.junit.internal.runners.model.ReflectiveCallable.run(ReflectiveCallable.java:15)
at org.junit.runners.model.FrameworkMethod.invokeExplosively(FrameworkMethod.java:42)
at org.junit.internal.runners.statements.InvokeMethod.evaluate(InvokeMethod.java:20)
at org.junit.rules.TestWatcher$1.evaluate(TestWatcher.java:47)
at org.junit.rules.RunRules.evaluate(RunRules.java:18)
at org.junit.runners.ParentRunner.runLeaf(ParentRunner.java:263)
at org.junit.runners.BlockJUnit4ClassRunner.runChild(BlockJUnit4ClassRunner.java:68)
at org.junit.runners.BlockJUnit4ClassRunner.runChild(BlockJUnit4ClassRunner.java:47)
at org.junit.runners.ParentRunner$3.run(ParentRunner.java:231)
at org.junit.runners.ParentRunner$1.schedule(ParentRunner.java:60)
at org.junit.runners.ParentRunner.runChildren(ParentRunner.java:229)
at org.junit.runners.ParentRunner.access$000(ParentRunner.java:50)
at org.junit.runners.ParentRunner$2.evaluate(ParentRunner.java:222)
at org.junit.runners.ParentRunner.run(ParentRunner.java:300)
at org.apache.maven.surefire.junit4.JUnit4Provider.execute(JUnit4Provider.java:252)
at org.apache.maven.surefire.junit4.JUnit4Provider.executeTestSet(JUnit4Provider.java:141)
at org.apache.maven.surefire.junit4.JUnit4Provider.invoke(JUnit4Provider.java:112)
at sun.reflect.NativeMethodAccessorImpl.invoke0(Native Method)
at sun.reflect.NativeMethodAccessorImpl.invoke(NativeMethodAccessorImpl.java:39)
at sun.reflect.DelegatingMethodAccessorImpl.invoke(DelegatingMethodAccessorImpl.java:25)
at java.lang.reflect.Method.invoke(Method.java:597)
at org.apache.maven.surefire.util.ReflectionUtils.invokeMethodWithArray(ReflectionUtils.java:189)
at org.apache.maven.surefire.booter.ProviderFactory$ProviderProxy.invoke(ProviderFactory.java:165)
at org.apache.maven.surefire.booter.ProviderFactory.invokeProvider(ProviderFactory.java:85)
at org.apache.maven.surefire.booter.ForkedBooter.runSuitesInProcess(ForkedBooter.java:115)
at org.apache.maven.surefire.booter.ForkedBooter.main(ForkedBooter.java:75)
Running org.apache.olingo.odata2.core.exception.ODataMessageTextVerifierTest
Tests run: 1, Failures: 0, Errors: 0, Skipped: 0, Time elapsed: 0.001 sec
Running org.apache.olingo.odata2.core.exception.MessageReferenceTest
Tests run: 3, Failures: 0, Errors: 0, Skipped: 0, Time elapsed: 0 sec
Running org.apache.olingo.odata2.core.exception.ODataExceptionTest
Tests run: 5, Failures: 0, Errors: 0, Skipped: 0, Time elapsed: 0.001 sec
Running org.apache.olingo.odata2.core.ODataExceptionWrapperTest
Tests run: 1, Failures: 0, Errors: 0, Skipped: 0, Time elapsed: 0.01 sec
Running org.apache.olingo.odata2.core.ODataContextImplTest
Tests run: 3, Failures: 0, Errors: 0, Skipped: 0, Time elapsed: 0.005 sec
Running org.apache.olingo.odata2.core.rest.ODataExceptionMapperImplTest
Tests run: 24, Failures: 0, Errors: 0, Skipped: 0, Time elapsed: 0.646 sec
Running org.apache.olingo.odata2.core.ContentNegotiatorTest
Tests run: 16, Failures: 0, Errors: 0, Skipped: 0, Time elapsed: 0.005 sec
Running org.apache.olingo.odata2.core.ODataRequestHandlerValidationTest
Tests run: 14, Failures: 0, Errors: 0, Skipped: 0, Time elapsed: 1.515 sec
Running org.apache.olingo.odata2.core.ODataResponseTest
Tests run: 5, Failures: 0, Errors: 0, Skipped: 0, Time elapsed: 0.001 sec
Running org.apache.olingo.odata2.core.processor.ODataSingleProcessorServiceTest
Tests run: 14, Failures: 0, Errors: 0, Skipped: 0, Time elapsed: 0.015 sec
Results :
Failed tests: testOPMparseOrderByString(org.apache.olingo.odata2.core.uri.expression.TestParserExceptions): aExMessageText(String ascc)-->Expected: 'Invalid sort order in OData orderby parser at position 8 in "String ascc".' Actual: 'Invalid sort order in OData orderby parser at position 8 in String ascc.' expected:<...er at position 8 in ["String ascc"].> but was:<...er at position 8 in [String ascc].>
testPMreadParameters(org.apache.olingo.odata2.core.uri.expression.TestParserExceptions): aExMessageText(concat(123)-->Expected: '")" or "," expected after position 10 in "concat(123".' Actual: '")" or "," expected after position 10.' expected:<...ed after position 10[ in "concat(123"].> but was:<...ed after position 10[].>
testAdditionalStuff(org.apache.olingo.odata2.core.uri.expression.TestParserExceptions): aExMessageText(Address\NotAProperty)-->Expected: 'Error while tokenizing a ODATA expression on token "\" at position 8 in "Address\NotAProperty".' Actual: 'Error while tokenizing a ODATA expression on token '\' at position '8'.' expected:<...expression on token ["\" at position 8 in "Address\NotAProperty"].> but was:<...expression on token ['\' at position '8'].>
abapTestFilterParser(org.apache.olingo.odata2.core.uri.expression.TestAbapCompatibility): aExMessageText(concat('a' 'b'))-->Expected: '")" or "," expected after position 10 in "concat('a' 'b')".' Actual: '")" or "," expected after position 10.' expected:<...ed after position 10[ in "concat('a' 'b')"].> but was:<...ed after position 10[].>
testExceptions(org.apache.olingo.odata2.core.uri.expression.TestTokenizer): aExMessageText(\)-->Expected: 'Unknown character '\' at position '0' detected in "\".' Actual: 'Unknown character '\' at position '0' detected.' expected:<...osition '0' detected[ in "\"].> but was:<...osition '0' detected[].>
testParameter(org.apache.olingo.odata2.core.exception.MessageServiceTest): expected:<[Only replacement is [first]]!> but was:<[Missing message for key 'org.apache.olingo.odata2.api.exception.ODataMessageException.ONE_REPLACEMENTS']!>
testOneParameterForTwo(org.apache.olingo.odata2.core.exception.MessageServiceTest): expected:<Missing [replacement for place holder in value 'First was [%1$s] and second was [%2$s]!' for following arguments '[first]]'!> but was:<Missing [message for key 'org.apache.olingo.odata2.api.exception.ODataMessageException.TWO_REPLACEMENTS]'!>
testTwoParameters(org.apache.olingo.odata2.core.exception.MessageServiceTest): expected:<[First was [first] and second was [second]]!> but was:<[Missing message for key 'org.apache.olingo.odata2.api.exception.ODataMessageException.TWO_REPLACEMENTS']!>
testTwoParametersWithTwoAddContent(org.apache.olingo.odata2.core.exception.MessageServiceTest): expected:<[First was [first] and second was [second]]!> but was:<[Missing message for key 'org.apache.olingo.odata2.api.exception.ODataMessageException.TWO_REPLACEMENTS']!>
testThreeParametersForTwo(org.apache.olingo.odata2.core.exception.MessageServiceTest): expected:<[First was [first] and second was [second]]!> but was:<[Missing message for key 'org.apache.olingo.odata2.api.exception.ODataMessageException.TWO_REPLACEMENTS']!>
testThreeParametersPerAddContentForTwo(org.apache.olingo.odata2.core.exception.MessageServiceTest): expected:<[First was [first] and second was [second]]!> but was:<[Missing message for key 'org.apache.olingo.odata2.api.exception.ODataMessageException.TWO_REPLACEMENTS']!>
testThreeParametersPerMixedForTwo(org.apache.olingo.odata2.core.exception.MessageServiceTest): expected:<[First was [first] and second was [second]]!> but was:<[Missing message for key 'org.apache.olingo.odata2.api.exception.ODataMessageException.TWO_REPLACEMENTS']!>
Tests run: 1193, Failures: 12, Errors: 0, Skipped: 2
[INFO] ------------------------------------------------------------------------
[INFO] Reactor Summary:
[INFO]
[INFO] org.apache.olingo.odata2-parent ................... SUCCESS [26.471s]
[INFO] org.apache.olingo.odata2-api ...................... SUCCESS [17.469s]
[INFO] org.apache.olingo.odata2-testutil ................. SUCCESS [8.450s]
[INFO] org.apache.olingo.odata2-core ..................... FAILURE [27.922s]
[INFO] org.apache.olingo.odata2-ref ...................... SKIPPED
[INFO] org.apache.olingo.odata2-fit ...................... SKIPPED
[INFO] org.apache.olingo.odata2-ref.web .................. SKIPPED
[INFO] org.apache.olingo.odata2-api.annotation ........... SKIPPED
[INFO] org.apache.olingo.odata2-jpa.processor.api ........ SKIPPED
[INFO] org.apache.olingo.odata2-jpa.processor.core ....... SKIPPED
[INFO] ------------------------------------------------------------------------
[INFO] BUILD FAILURE
[INFO] ------------------------------------------------------------------------
[INFO] Total time: 1:22.529s
[INFO] Finished at: Sun Aug 04 01:23:21 UTC 2013
[INFO] Final Memory: 46M/145M
[INFO] ------------------------------------------------------------------------
[ERROR] Failed to execute goal org.apache.maven.plugins:maven-surefire-plugin:2.12.4:test (default-test) on project core: There are test failures.
[ERROR]
[ERROR] Please refer to <https://builds.apache.org/job/olingo-odata2-quality/ws/odata-core/target/surefire-reports> for the individual test results.
[ERROR] -> [Help 1]
[ERROR]
[ERROR] To see the full stack trace of the errors, re-run Maven with the -e switch.
[ERROR] Re-run Maven using the -X switch to enable full debug logging.
[ERROR]
[ERROR] For more information about the errors and possible solutions, please read the following articles:
[ERROR] [Help 1] http://cwiki.apache.org/confluence/display/MAVEN/MojoFailureException
[ERROR]
[ERROR] After correcting the problems, you can resume the build with the command
[ERROR] mvn <goals> -rf :core
Build step 'Invoke top-level Maven targets' marked build as failure