You are viewing a plain text version of this content. The canonical link for it is here.
Posted to notifications@maven.apache.org by Apache Jenkins Server <je...@builds.apache.org> on 2019/07/31 00:34:21 UTC
Build failed in Jenkins: Maven TLP » maven » MNG-6726 #3
See https://builds.apache.org/job/maven-box/job/maven/job/MNG-6726/3/
Changes:
* investigating tests in embedded mode which fail on assertion failures
15 tests failed.
FAILED: org.apache.maven.it.MavenITmng4387QuietLoggingTest.windows-jdk8 / Run ITs Windows Java 8 / testit
Error Message:
expected:<[]> but was:<[Picked up JAVA_TOOL_OPTIONS: -Dmaven.ext.class.path="c:\mvn-it-0.tmp@tmp\withMavenedb494c8\pipeline-maven-spy.jar" -Dorg.jenkinsci.plugins.pipeline.maven.reportsFolder="c:\mvn-it-0.tmp@tmp\withMavenedb494c8" ]>
Stack Trace:
junit.framework.AssertionFailedError: expected:<[]> but was:<[Picked up JAVA_TOOL_OPTIONS: -Dmaven.ext.class.path="c:\mvn-it-0.tmp@tmp\withMavenedb494c8\pipeline-maven-spy.jar" -Dorg.jenkinsci.plugins.pipeline.maven.reportsFolder="c:\mvn-it-0.tmp@tmp\withMavenedb494c8" ]>
at org.apache.maven.it.MavenITmng4387QuietLoggingTest.testit(MavenITmng4387QuietLoggingTest.java:71)
FAILED: org.apache.maven.it.MavenITmng3183LoggingToFileTest.windows-jdk8 / Run ITs Windows Java 8 / testit
Error Message:
expected:<[]> but was:<[Picked up JAVA_TOOL_OPTIONS: -Dmaven.ext.class.path="c:\mvn-it-0.tmp@tmp\withMavenedb494c8\pipeline-maven-spy.jar" -Dorg.jenkinsci.plugins.pipeline.maven.reportsFolder="c:\mvn-it-0.tmp@tmp\withMavenedb494c8" ]>
Stack Trace:
junit.framework.AssertionFailedError: expected:<[]> but was:<[Picked up JAVA_TOOL_OPTIONS: -Dmaven.ext.class.path="c:\mvn-it-0.tmp@tmp\withMavenedb494c8\pipeline-maven-spy.jar" -Dorg.jenkinsci.plugins.pipeline.maven.reportsFolder="c:\mvn-it-0.tmp@tmp\withMavenedb494c8" ]>
at org.apache.maven.it.MavenITmng3183LoggingToFileTest.testit(MavenITmng3183LoggingToFileTest.java:74)
FAILED: org.apache.maven.it.MavenITmng4387QuietLoggingTest.windows-jdk12 / Run ITs Windows Java 12 / testit
Error Message:
expected:<[]> but was:<[Picked up JAVA_TOOL_OPTIONS: -Dmaven.ext.class.path="c:\mvn-it-0.tmp@tmp\withMaven26145ed2\pipeline-maven-spy.jar" -Dorg.jenkinsci.plugins.pipeline.maven.reportsFolder="c:\mvn-it-0.tmp@tmp\withMaven26145ed2" , WARNING: An illegal reflective access operation has occurred, WARNING: Illegal reflective access by org.apache.maven.model.interpolation.StringSearchModelInterpolator$InterpolateObjectAction$CacheField (file:/C:/mvn-it-0.tmp/core-it-suite/target/apache-maven/bin/../lib/maven-model-builder-3.6.2-SNAPSHOT.jar) to field java.io.File.fs, WARNING: Please consider reporting this to the maintainers of org.apache.maven.model.interpolation.StringSearchModelInterpolator$InterpolateObjectAction$CacheField, WARNING: Use --illegal-access=warn to enable warnings of further illegal reflective access operations, WARNING: All illegal access operations will be denied in a future release]>
Stack Trace:
junit.framework.AssertionFailedError: expected:<[]> but was:<[Picked up JAVA_TOOL_OPTIONS: -Dmaven.ext.class.path="c:\mvn-it-0.tmp@tmp\withMaven26145ed2\pipeline-maven-spy.jar" -Dorg.jenkinsci.plugins.pipeline.maven.reportsFolder="c:\mvn-it-0.tmp@tmp\withMaven26145ed2" , WARNING: An illegal reflective access operation has occurred, WARNING: Illegal reflective access by org.apache.maven.model.interpolation.StringSearchModelInterpolator$InterpolateObjectAction$CacheField (file:/C:/mvn-it-0.tmp/core-it-suite/target/apache-maven/bin/../lib/maven-model-builder-3.6.2-SNAPSHOT.jar) to field java.io.File.fs, WARNING: Please consider reporting this to the maintainers of org.apache.maven.model.interpolation.StringSearchModelInterpolator$InterpolateObjectAction$CacheField, WARNING: Use --illegal-access=warn to enable warnings of further illegal reflective access operations, WARNING: All illegal access operations will be denied in a future release]>
at org.apache.maven.it.MavenITmng4387QuietLoggingTest.testit(MavenITmng4387QuietLoggingTest.java:71)
FAILED: org.apache.maven.it.MavenITmng3183LoggingToFileTest.windows-jdk12 / Run ITs Windows Java 12 / testit
Error Message:
expected:<[]> but was:<[Picked up JAVA_TOOL_OPTIONS: -Dmaven.ext.class.path="c:\mvn-it-0.tmp@tmp\withMaven26145ed2\pipeline-maven-spy.jar" -Dorg.jenkinsci.plugins.pipeline.maven.reportsFolder="c:\mvn-it-0.tmp@tmp\withMaven26145ed2" , WARNING: An illegal reflective access operation has occurred, WARNING: Illegal reflective access by org.apache.maven.model.interpolation.StringSearchModelInterpolator$InterpolateObjectAction$CacheField (file:/C:/mvn-it-0.tmp/core-it-suite/target/apache-maven/bin/../lib/maven-model-builder-3.6.2-SNAPSHOT.jar) to field java.io.File.fs, WARNING: Please consider reporting this to the maintainers of org.apache.maven.model.interpolation.StringSearchModelInterpolator$InterpolateObjectAction$CacheField, WARNING: Use --illegal-access=warn to enable warnings of further illegal reflective access operations, WARNING: All illegal access operations will be denied in a future release]>
Stack Trace:
junit.framework.AssertionFailedError: expected:<[]> but was:<[Picked up JAVA_TOOL_OPTIONS: -Dmaven.ext.class.path="c:\mvn-it-0.tmp@tmp\withMaven26145ed2\pipeline-maven-spy.jar" -Dorg.jenkinsci.plugins.pipeline.maven.reportsFolder="c:\mvn-it-0.tmp@tmp\withMaven26145ed2" , WARNING: An illegal reflective access operation has occurred, WARNING: Illegal reflective access by org.apache.maven.model.interpolation.StringSearchModelInterpolator$InterpolateObjectAction$CacheField (file:/C:/mvn-it-0.tmp/core-it-suite/target/apache-maven/bin/../lib/maven-model-builder-3.6.2-SNAPSHOT.jar) to field java.io.File.fs, WARNING: Please consider reporting this to the maintainers of org.apache.maven.model.interpolation.StringSearchModelInterpolator$InterpolateObjectAction$CacheField, WARNING: Use --illegal-access=warn to enable warnings of further illegal reflective access operations, WARNING: All illegal access operations will be denied in a future release]>
at org.apache.maven.it.MavenITmng3183LoggingToFileTest.testit(MavenITmng3183LoggingToFileTest.java:74)
FAILED: org.apache.maven.it.MavenITmng5280SettingsProfilesRepositoriesOrderTest.windows-jdk11 / Run ITs Windows Java 11 / testRepositoriesOrder
Error Message:
Exit code was non-zero: 1; command line and log =
C:\mvn-it-2.tmp\core-it-suite\target\apache-maven\bin\mvn --global-settings C:\mvn-it-2.tmp\core-it-suite\target\test-classes\settings.xml --settings settings.xml -e --batch-mode -Dmaven.repo.local=c:\mvn-it-2.tmp\it-local-repo org.apache.maven.its.plugins:maven-it-plugin-dependency-resolution:2.1-SNAPSHOT:compile
Picked up JAVA_TOOL_OPTIONS: -Dmaven.ext.class.path="c:\mvn-it-2.tmp@tmp\withMavenbafc2b1a\pipeline-maven-spy.jar" -Dorg.jenkinsci.plugins.pipeline.maven.reportsFolder="c:\mvn-it-2.tmp@tmp\withMavenbafc2b1a"
[INFO] [jenkins-event-spy] Jenkins Maven Event Spy is disabled
[INFO] Error stacktraces are turned on.
[INFO] Scanning for projects...
WARNING: An illegal reflective access operation has occurred
WARNING: Illegal reflective access by org.apache.maven.model.interpolation.StringSearchModelInterpolator$InterpolateObjectAction$CacheField (file:/C:/mvn-it-2.tmp/core-it-suite/target/apache-maven/bin/../lib/maven-model-builder-3.6.2-SNAPSHOT.jar) to field java.io.File.fs
WARNING: Please consider reporting this to the maintainers of org.apache.maven.model.interpolation.StringSearchModelInterpolator$InterpolateObjectAction$CacheField
WARNING: Use --illegal-access=warn to enable warnings of further illegal reflective access operations
WARNING: All illegal access operations will be denied in a future release
[INFO]
[INFO] -----------------< org.apache.maven.its.mng5280:test >------------------
[INFO] Building Maven Integration Test :: MNG-5280 0.1-SNAPSHOT
[INFO] --------------------------------[ jar ]---------------------------------
[INFO] Downloading from central: file:target/null/org/apache/maven/its/mng5280/fake-artifact/1.0/fake-artifact-1.0.pom
[INFO] Downloading from repo2: http://localhost:-1/repo2/org/apache/maven/its/mng5280/fake-artifact/1.0/fake-artifact-1.0.pom
[INFO] Downloading from repo1: http://localhost:-1/repo1/org/apache/maven/its/mng5280/fake-artifact/1.0/fake-artifact-1.0.pom
[INFO] ------------------------------------------------------------------------
[INFO] BUILD FAILURE
[INFO] ------------------------------------------------------------------------
[INFO] Total time: 4.812 s
[INFO] Finished at: 2019-07-30T14:33:54-07:00
[INFO] ------------------------------------------------------------------------
[ERROR] Failed to execute goal on project test: Could not resolve dependencies for project org.apache.maven.its.mng5280:test:jar:0.1-SNAPSHOT: Failed to collect dependencies at org.apache.maven.its.mng5280:fake-artifact:jar:1.0: Failed to read artifact descriptor for org.apache.maven.its.mng5280:fake-artifact:jar:1.0: Could not transfer artifact org.apache.maven.its.mng5280:fake-artifact:pom:1.0 from/to repo2 (http://localhost:-1/repo2/): Connect to localhost:80 [localhost/127.0.0.1, localhost/0:0:0:0:0:0:0:1] failed: Connection refused: connect -> [Help 1]
org.apache.maven.lifecycle.LifecycleExecutionException: Failed to execute goal on project test: Could not resolve dependencies for project org.apache.maven.its.mng5280:test:jar:0.1-SNAPSHOT: Failed to collect dependencies at org.apache.maven.its.mng5280:fake-artifact:jar:1.0
at org.apache.maven.lifecycle.internal.LifecycleDependencyResolver.getDependencies (LifecycleDependencyResolver.java:269)
at org.apache.maven.lifecycle.internal.LifecycleDependencyResolver.resolveProjectDependencies (LifecycleDependencyResolver.java:147)
at org.apache.maven.lifecycle.internal.MojoExecutor.ensureDependenciesAreResolved (MojoExecutor.java:248)
at org.apache.maven.lifecycle.internal.MojoExecutor.execute (MojoExecutor.java:202)
at org.apache.maven.lifecycle.internal.MojoExecutor.execute (MojoExecutor.java:156)
at org.apache.maven.lifecycle.internal.MojoExecutor.execute (MojoExecutor.java:148)
at org.apache.maven.lifecycle.internal.LifecycleModuleBuilder.buildProject (LifecycleModuleBuilder.java:117)
at org.apache.maven.lifecycle.internal.LifecycleModuleBuilder.buildProject (LifecycleModuleBuilder.java:81)
at org.apache.maven.lifecycle.internal.builder.singlethreaded.SingleThreadedBuilder.build (SingleThreadedBuilder.java:56)
at org.apache.maven.lifecycle.internal.LifecycleStarter.execute (LifecycleStarter.java:128)
at org.apache.maven.DefaultMaven.doExecute (DefaultMaven.java:305)
at org.apache.maven.DefaultMaven.doExecute (DefaultMaven.java:192)
at org.apache.maven.DefaultMaven.execute (DefaultMaven.java:105)
at org.apache.maven.cli.MavenCli.execute (MavenCli.java:956)
at org.apache.maven.cli.MavenCli.doMain (MavenCli.java:288)
at org.apache.maven.cli.MavenCli.main (MavenCli.java:192)
at jdk.internal.reflect.NativeMethodAccessorImpl.invoke0 (Native Method)
at jdk.internal.reflect.NativeMethodAccessorImpl.invoke (NativeMethodAccessorImpl.java:62)
at jdk.internal.reflect.DelegatingMethodAccessorImpl.invoke (DelegatingMethodAccessorImpl.java:43)
at java.lang.reflect.Method.invoke (Method.java:566)
at org.codehaus.plexus.classworlds.launcher.Launcher.launchEnhanced (Launcher.java:282)
at org.codehaus.plexus.classworlds.launcher.Launcher.launch (Launcher.java:225)
at org.codehaus.plexus.classworlds.launcher.Launcher.mainWithExitCode (Launcher.java:406)
at org.codehaus.plexus.classworlds.launcher.Launcher.main (Launcher.java:347)
Caused by: org.apache.maven.project.DependencyResolutionException: Could not resolve dependencies for project org.apache.maven.its.mng5280:test:jar:0.1-SNAPSHOT: Failed to collect dependencies at org.apache.maven.its.mng5280:fake-artifact:jar:1.0
at org.apache.maven.project.DefaultProjectDependenciesResolver.resolve (DefaultProjectDependenciesResolver.java:178)
at org.apache.maven.lifecycle.internal.LifecycleDependencyResolver.getDependencies (LifecycleDependencyResolver.java:243)
at org.apache.maven.lifecycle.internal.LifecycleDependencyResolver.resolveProjectDependencies (LifecycleDependencyResolver.java:147)
at org.apache.maven.lifecycle.internal.MojoExecutor.ensureDependenciesAreResolved (MojoExecutor.java:248)
at org.apache.maven.lifecycle.internal.MojoExecutor.execute (MojoExecutor.java:202)
at org.apache.maven.lifecycle.internal.MojoExecutor.execute (MojoExecutor.java:156)
at org.apache.maven.lifecycle.internal.MojoExecutor.execute (MojoExecutor.java:148)
at org.apache.maven.lifecycle.internal.LifecycleModuleBuilder.buildProject (LifecycleModuleBuilder.java:117)
at org.apache.maven.lifecycle.internal.LifecycleModuleBuilder.buildProject (LifecycleModuleBuilder.java:81)
at org.apache.maven.lifecycle.internal.builder.singlethreaded.SingleThreadedBuilder.build (SingleThreadedBuilder.java:56)
at org.apache.maven.lifecycle.internal.LifecycleStarter.execute (LifecycleStarter.java:128)
at org.apache.maven.DefaultMaven.doExecute (DefaultMaven.java:305)
at org.apache.maven.DefaultMaven.doExecute (DefaultMaven.java:192)
at org.apache.maven.DefaultMaven.execute (DefaultMaven.java:105)
at org.apache.maven.cli.MavenCli.execute (MavenCli.java:956)
at org.apache.maven.cli.MavenCli.doMain (MavenCli.java:288)
at org.apache.maven.cli.MavenCli.main (MavenCli.java:192)
at jdk.internal.reflect.NativeMethodAccessorImpl.invoke0 (Native Method)
at jdk.internal.reflect.NativeMethodAccessorImpl.invoke (NativeMethodAccessorImpl.java:62)
at jdk.internal.reflect.DelegatingMethodAccessorImpl.invoke (DelegatingMethodAccessorImpl.java:43)
at java.lang.reflect.Method.invoke (Method.java:566)
at org.codehaus.plexus.classworlds.launcher.Launcher.launchEnhanced (Launcher.java:282)
at org.codehaus.plexus.classworlds.launcher.Launcher.launch (Launcher.java:225)
at org.codehaus.plexus.classworlds.launcher.Launcher.mainWithExitCode (Launcher.java:406)
at org.codehaus.plexus.classworlds.launcher.Launcher.main (Launcher.java:347)
Caused by: org.eclipse.aether.collection.DependencyCollectionException: Failed to collect dependencies at org.apache.maven.its.mng5280:fake-artifact:jar:1.0
at org.eclipse.aether.internal.impl.collect.DefaultDependencyCollector.collectDependencies (DefaultDependencyCollector.java:284)
at org.eclipse.aether.internal.impl.DefaultRepositorySystem.collectDependencies (DefaultRepositorySystem.java:279)
at org.apache.maven.project.DefaultProjectDependenciesResolver.resolve (DefaultProjectDependenciesResolver.java:169)
at org.apache.maven.lifecycle.internal.LifecycleDependencyResolver.getDependencies (LifecycleDependencyResolver.java:243)
at org.apache.maven.lifecycle.internal.LifecycleDependencyResolver.resolveProjectDependencies (LifecycleDependencyResolver.java:147)
at org.apache.maven.lifecycle.internal.MojoExecutor.ensureDependenciesAreResolved (MojoExecutor.java:248)
at org.apache.maven.lifecycle.internal.MojoExecutor.execute (MojoExecutor.java:202)
at org.apache.maven.lifecycle.internal.MojoExecutor.execute (MojoExecutor.java:156)
at org.apache.maven.lifecycle.internal.MojoExecutor.execute (MojoExecutor.java:148)
at org.apache.maven.lifecycle.internal.LifecycleModuleBuilder.buildProject (LifecycleModuleBuilder.java:117)
at org.apache.maven.lifecycle.internal.LifecycleModuleBuilder.buildProject (LifecycleModuleBuilder.java:81)
at org.apache.maven.lifecycle.internal.builder.singlethreaded.SingleThreadedBuilder.build (SingleThreadedBuilder.java:56)
at org.apache.maven.lifecycle.internal.LifecycleStarter.execute (LifecycleStarter.java:128)
at org.apache.maven.DefaultMaven.doExecute (DefaultMaven.java:305)
at org.apache.maven.DefaultMaven.doExecute (DefaultMaven.java:192)
at org.apache.maven.DefaultMaven.execute (DefaultMaven.java:105)
at org.apache.maven.cli.MavenCli.execute (MavenCli.java:956)
at org.apache.maven.cli.MavenCli.doMain (MavenCli.java:288)
at org.apache.maven.cli.MavenCli.main (MavenCli.java:192)
at jdk.internal.reflect.NativeMethodAccessorImpl.invoke0 (Native Method)
at jdk.internal.reflect.NativeMethodAccessorImpl.invoke (NativeMethodAccessorImpl.java:62)
at jdk.internal.reflect.DelegatingMethodAccessorImpl.invoke (DelegatingMethodAccessorImpl.java:43)
at java.lang.reflect.Method.invoke (Method.java:566)
at org.codehaus.plexus.classworlds.launcher.Launcher.launchEnhanced (Launcher.java:282)
at org.codehaus.plexus.classworlds.launcher.Launcher.launch (Launcher.java:225)
at org.codehaus.plexus.classworlds.launcher.Launcher.mainWithExitCode (Launcher.java:406)
at org.codehaus.plexus.classworlds.launcher.Launcher.main (Launcher.java:347)
Caused by: org.eclipse.aether.resolution.ArtifactDescriptorException: Failed to read artifact descriptor for org.apache.maven.its.mng5280:fake-artifact:jar:1.0
at org.apache.maven.repository.internal.DefaultArtifactDescriptorReader.loadPom (DefaultArtifactDescriptorReader.java:255)
at org.apache.maven.repository.internal.DefaultArtifactDescriptorReader.readArtifactDescriptor (DefaultArtifactDescriptorReader.java:171)
at org.eclipse.aether.internal.impl.collect.DefaultDependencyCollector.resolveCachedArtifactDescriptor (DefaultDependencyCollector.java:530)
at org.eclipse.aether.internal.impl.collect.DefaultDependencyCollector.getArtifactDescriptorResult (DefaultDependencyCollector.java:515)
at org.eclipse.aether.internal.impl.collect.DefaultDependencyCollector.processDependency (DefaultDependencyCollector.java:403)
at org.eclipse.aether.internal.impl.collect.DefaultDependencyCollector.processDependency (DefaultDependencyCollector.java:356)
at org.eclipse.aether.internal.impl.collect.DefaultDependencyCollector.process (DefaultDependencyCollector.java:344)
at org.eclipse.aether.internal.impl.collect.DefaultDependencyCollector.collectDependencies (DefaultDependencyCollector.java:247)
at org.eclipse.aether.internal.impl.DefaultRepositorySystem.collectDependencies (DefaultRepositorySystem.java:279)
at org.apache.maven.project.DefaultProjectDependenciesResolver.resolve (DefaultProjectDependenciesResolver.java:169)
at org.apache.maven.lifecycle.internal.LifecycleDependencyResolver.getDependencies (LifecycleDependencyResolver.java:243)
at org.apache.maven.lifecycle.internal.LifecycleDependencyResolver.resolveProjectDependencies (LifecycleDependencyResolver.java:147)
at org.apache.maven.lifecycle.internal.MojoExecutor.ensureDependenciesAreResolved (MojoExecutor.java:248)
at org.apache.maven.lifecycle.internal.MojoExecutor.execute (MojoExecutor.java:202)
at org.apache.maven.lifecycle.internal.MojoExecutor.execute (MojoExecutor.java:156)
at org.apache.maven.lifecycle.internal.MojoExecutor.execute (MojoExecutor.java:148)
at org.apache.maven.lifecycle.internal.LifecycleModuleBuilder.buildProject (LifecycleModuleBuilder.java:117)
at org.apache.maven.lifecycle.internal.LifecycleModuleBuilder.buildProject (LifecycleModuleBuilder.java:81)
at org.apache.maven.lifecycle.internal.builder.singlethreaded.SingleThreadedBuilder.build (SingleThreadedBuilder.java:56)
at org.apache.maven.lifecycle.internal.LifecycleStarter.execute (LifecycleStarter.java:128)
at org.apache.maven.DefaultMaven.doExecute (DefaultMaven.java:305)
at org.apache.maven.DefaultMaven.doExecute (DefaultMaven.java:192)
at org.apache.maven.DefaultMaven.execute (DefaultMaven.java:105)
at org.apache.maven.cli.MavenCli.execute (MavenCli.java:956)
at org.apache.maven.cli.MavenCli.doMain (MavenCli.java:288)
at org.apache.maven.cli.MavenCli.main (MavenCli.java:192)
at jdk.internal.reflect.NativeMethodAccessorImpl.invoke0 (Native Method)
at jdk.internal.reflect.NativeMethodAccessorImpl.invoke (NativeMethodAccessorImpl.java:62)
at jdk.internal.reflect.DelegatingMethodAccessorImpl.invoke (DelegatingMethodAccessorImpl.java:43)
at java.lang.reflect.Method.invoke (Method.java:566)
at org.codehaus.plexus.classworlds.launcher.Launcher.launchEnhanced (Launcher.java:282)
at org.codehaus.plexus.classworlds.launcher.Launcher.launch (Launcher.java:225)
at org.codehaus.plexus.classworlds.launcher.Launcher.mainWithExitCode (Launcher.java:406)
at org.codehaus.plexus.classworlds.launcher.Launcher.main (Launcher.java:347)
Caused by: org.eclipse.aether.resolution.ArtifactResolutionException: Could not transfer artifact org.apache.maven.its.mng5280:fake-artifact:pom:1.0 from/to repo2 (http://localhost:-1/repo2/): Connect to localhost:80 [localhost/127.0.0.1, localhost/0:0:0:0:0:0:0:1] failed: Connection refused: connect
at org.eclipse.aether.internal.impl.DefaultArtifactResolver.resolve (DefaultArtifactResolver.java:423)
at org.eclipse.aether.internal.impl.DefaultArtifactResolver.resolveArtifacts (DefaultArtifactResolver.java:225)
at org.eclipse.aether.internal.impl.DefaultArtifactResolver.resolveArtifact (DefaultArtifactResolver.java:202)
at org.apache.maven.repository.internal.DefaultArtifactDescriptorReader.loadPom (DefaultArtifactDescriptorReader.java:240)
at org.apache.maven.repository.internal.DefaultArtifactDescriptorReader.readArtifactDescriptor (DefaultArtifactDescriptorReader.java:171)
at org.eclipse.aether.internal.impl.collect.DefaultDependencyCollector.resolveCachedArtifactDescriptor (DefaultDependencyCollector.java:530)
at org.eclipse.aether.internal.impl.collect.DefaultDependencyCollector.getArtifactDescriptorResult (DefaultDependencyCollector.java:515)
at org.eclipse.aether.internal.impl.collect.DefaultDependencyCollector.processDependency (DefaultDependencyCollector.java:403)
at org.eclipse.aether.internal.impl.collect.DefaultDependencyCollector.processDependency (DefaultDependencyCollector.java:356)
at org.eclipse.aether.internal.impl.collect.DefaultDependencyCollector.process (DefaultDependencyCollector.java:344)
at org.eclipse.aether.internal.impl.collect.DefaultDependencyCollector.collectDependencies (DefaultDependencyCollector.java:247)
at org.eclipse.aether.internal.impl.DefaultRepositorySystem.collectDependencies (DefaultRepositorySystem.java:279)
at org.apache.maven.project.DefaultProjectDependenciesResolver.resolve (DefaultProjectDependenciesResolver.java:169)
at org.apache.maven.lifecycle.internal.LifecycleDependencyResolver.getDependencies (LifecycleDependencyResolver.java:243)
at org.apache.maven.lifecycle.internal.LifecycleDependencyResolver.resolveProjectDependencies (LifecycleDependencyResolver.java:147)
at org.apache.maven.lifecycle.internal.MojoExecutor.ensureDependenciesAreResolved (MojoExecutor.java:248)
at org.apache.maven.lifecycle.internal.MojoExecutor.execute (MojoExecutor.java:202)
at org.apache.maven.lifecycle.internal.MojoExecutor.execute (MojoExecutor.java:156)
at org.apache.maven.lifecycle.internal.MojoExecutor.execute (MojoExecutor.java:148)
at org.apache.maven.lifecycle.internal.LifecycleModuleBuilder.buildProject (LifecycleModuleBuilder.java:117)
at org.apache.maven.lifecycle.internal.LifecycleModuleBuilder.buildProject (LifecycleModuleBuilder.java:81)
at org.apache.maven.lifecycle.internal.builder.singlethreaded.SingleThreadedBuilder.build (SingleThreadedBuilder.java:56)
at org.apache.maven.lifecycle.internal.LifecycleStarter.execute (LifecycleStarter.java:128)
at org.apache.maven.DefaultMaven.doExecute (DefaultMaven.java:305)
at org.apache.maven.DefaultMaven.doExecute (DefaultMaven.java:192)
at org.apache.maven.DefaultMaven.execute (DefaultMaven.java:105)
at org.apache.maven.cli.MavenCli.execute (MavenCli.java:956)
at org.apache.maven.cli.MavenCli.doMain (MavenCli.java:288)
at org.apache.maven.cli.MavenCli.main (MavenCli.java:192)
at jdk.internal.reflect.NativeMethodAccessorImpl.invoke0 (Native Method)
at jdk.internal.reflect.NativeMethodAccessorImpl.invoke (NativeMethodAccessorImpl.java:62)
at jdk.internal.reflect.DelegatingMethodAccessorImpl.invoke (DelegatingMethodAccessorImpl.java:43)
at java.lang.reflect.Method.invoke (Method.java:566)
at org.codehaus.plexus.classworlds.launcher.Launcher.launchEnhanced (Launcher.java:282)
at org.codehaus.plexus.classworlds.launcher.Launcher.launch (Launcher.java:225)
at org.codehaus.plexus.classworlds.launcher.Launcher.mainWithExitCode (Launcher.java:406)
at org.codehaus.plexus.classworlds.launcher.Launcher.main (Launcher.java:347)
Caused by: org.eclipse.aether.transfer.ArtifactTransferException: Could not transfer artifact org.apache.maven.its.mng5280:fake-artifact:pom:1.0 from/to repo2 (http://localhost:-1/repo2/): Connect to localhost:80 [localhost/127.0.0.1, localhost/0:0:0:0:0:0:0:1] failed: Connection refused: connect
at org.eclipse.aether.connector.basic.ArtifactTransportListener.transferFailed (ArtifactTransportListener.java:52)
at org.eclipse.aether.connector.basic.BasicRepositoryConnector$TaskRunner.run (BasicRepositoryConnector.java:368)
at org.eclipse.aether.util.concurrency.RunnableErrorForwarder$1.run (RunnableErrorForwarder.java:75)
at org.eclipse.aether.connector.basic.BasicRepositoryConnector$DirectExecutor.execute (BasicRepositoryConnector.java:642)
at org.eclipse.aether.connector.basic.BasicRepositoryConnector.get (BasicRepositoryConnector.java:262)
at org.eclipse.aether.internal.impl.DefaultArtifactResolver.performDownloads (DefaultArtifactResolver.java:499)
at org.eclipse.aether.internal.impl.DefaultArtifactResolver.resolve (DefaultArtifactResolver.java:400)
at org.eclipse.aether.internal.impl.DefaultArtifactResolver.resolveArtifacts (DefaultArtifactResolver.java:225)
at org.eclipse.aether.internal.impl.DefaultArtifactResolver.resolveArtifact (DefaultArtifactResolver.java:202)
at org.apache.maven.repository.internal.DefaultArtifactDescriptorReader.loadPom (DefaultArtifactDescriptorReader.java:240)
at org.apache.maven.repository.internal.DefaultArtifactDescriptorReader.readArtifactDescriptor (DefaultArtifactDescriptorReader.java:171)
at org.eclipse.aether.internal.impl.collect.DefaultDependencyCollector.resolveCachedArtifactDescriptor (DefaultDependencyCollector.java:530)
at org.eclipse.aether.internal.impl.collect.DefaultDependencyCollector.getArtifactDescriptorResult (DefaultDependencyCollector.java:515)
at org.eclipse.aether.internal.impl.collect.DefaultDependencyCollector.processDependency (DefaultDependencyCollector.java:403)
at org.eclipse.aether.internal.impl.collect.DefaultDependencyCollector.processDependency (DefaultDependencyCollector.java:356)
at org.eclipse.aether.internal.impl.collect.DefaultDependencyCollector.process (DefaultDependencyCollector.java:344)
at org.eclipse.aether.internal.impl.collect.DefaultDependencyCollector.collectDependencies (DefaultDependencyCollector.java:247)
at org.eclipse.aether.internal.impl.DefaultRepositorySystem.collectDependencies (DefaultRepositorySystem.java:279)
at org.apache.maven.project.DefaultProjectDependenciesResolver.resolve (DefaultProjectDependenciesResolver.java:169)
at org.apache.maven.lifecycle.internal.LifecycleDependencyResolver.getDependencies (LifecycleDependencyResolver.java:243)
at org.apache.maven.lifecycle.internal.LifecycleDependencyResolver.resolveProjectDependencies (LifecycleDependencyResolver.java:147)
at org.apache.maven.lifecycle.internal.MojoExecutor.ensureDependenciesAreResolved (MojoExecutor.java:248)
at org.apache.maven.lifecycle.internal.MojoExecutor.execute (MojoExecutor.java:202)
at org.apache.maven.lifecycle.internal.MojoExecutor.execute (MojoExecutor.java:156)
at org.apache.maven.lifecycle.internal.MojoExecutor.execute (MojoExecutor.java:148)
at org.apache.maven.lifecycle.internal.LifecycleModuleBuilder.buildProject (LifecycleModuleBuilder.java:117)
at org.apache.maven.lifecycle.internal.LifecycleModuleBuilder.buildProject (LifecycleModuleBuilder.java:81)
at org.apache.maven.lifecycle.internal.builder.singlethreaded.SingleThreadedBuilder.build (SingleThreadedBuilder.java:56)
at org.apache.maven.lifecycle.internal.LifecycleStarter.execute (LifecycleStarter.java:128)
at org.apache.maven.DefaultMaven.doExecute (DefaultMaven.java:305)
at org.apache.maven.DefaultMaven.doExecute (DefaultMaven.java:192)
at org.apache.maven.DefaultMaven.execute (DefaultMaven.java:105)
at org.apache.maven.cli.MavenCli.execute (MavenCli.java:956)
at org.apache.maven.cli.MavenCli.doMain (MavenCli.java:288)
at org.apache.maven.cli.MavenCli.main (MavenCli.java:192)
at jdk.internal.reflect.NativeMethodAccessorImpl.invoke0 (Native Method)
at jdk.internal.reflect.NativeMethodAccessorImpl.invoke (NativeMethodAccessorImpl.java:62)
at jdk.internal.reflect.DelegatingMethodAccessorImpl.invoke (DelegatingMethodAccessorImpl.java:43)
at java.lang.reflect.Method.invoke (Method.java:566)
at org.codehaus.plexus.classworlds.launcher.Launcher.launchEnhanced (Launcher.java:282)
at org.codehaus.plexus.classworlds.launcher.Launcher.launch (Launcher.java:225)
at org.codehaus.plexus.classworlds.launcher.Launcher.mainWithExitCode (Launcher.java:406)
at org.codehaus.plexus.classworlds.launcher.Launcher.main (Launcher.java:347)
Caused by: org.apache.maven.wagon.TransferFailedException: Connect to localhost:80 [localhost/127.0.0.1, localhost/0:0:0:0:0:0:0:1] failed: Connection refused: connect
at org.apache.maven.wagon.providers.http.wagon.shared.AbstractHttpClientWagon.fillInputData (AbstractHttpClientWagon.java:1206)
at org.apache.maven.wagon.providers.http.wagon.shared.AbstractHttpClientWagon.fillInputData (AbstractHttpClientWagon.java:1094)
at org.apache.maven.wagon.StreamWagon.getInputStream (StreamWagon.java:126)
at org.apache.maven.wagon.StreamWagon.getIfNewer (StreamWagon.java:88)
at org.apache.maven.wagon.StreamWagon.get (StreamWagon.java:61)
at org.eclipse.aether.transport.wagon.WagonTransporter$GetTaskRunner.run (WagonTransporter.java:567)
at org.eclipse.aether.transport.wagon.WagonTransporter.execute (WagonTransporter.java:435)
at org.eclipse.aether.transport.wagon.WagonTransporter.get (WagonTransporter.java:412)
at org.eclipse.aether.connector.basic.BasicRepositoryConnector$GetTaskRunner.runTask (BasicRepositoryConnector.java:456)
at org.eclipse.aether.connector.basic.BasicRepositoryConnector$TaskRunner.run (BasicRepositoryConnector.java:363)
at org.eclipse.aether.util.concurrency.RunnableErrorForwarder$1.run (RunnableErrorForwarder.java:75)
at org.eclipse.aether.connector.basic.BasicRepositoryConnector$DirectExecutor.execute (BasicRepositoryConnector.java:642)
at org.eclipse.aether.connector.basic.BasicRepositoryConnector.get (BasicRepositoryConnector.java:262)
at org.eclipse.aether.internal.impl.DefaultArtifactResolver.performDownloads (DefaultArtifactResolver.java:499)
at org.eclipse.aether.internal.impl.DefaultArtifactResolver.resolve (DefaultArtifactResolver.java:400)
at org.eclipse.aether.internal.impl.DefaultArtifactResolver.resolveArtifacts (DefaultArtifactResolver.java:225)
at org.eclipse.aether.internal.impl.DefaultArtifactResolver.resolveArtifact (DefaultArtifactResolver.java:202)
at org.apache.maven.repository.internal.DefaultArtifactDescriptorReader.loadPom (DefaultArtifactDescriptorReader.java:240)
at org.apache.maven.repository.internal.DefaultArtifactDescriptorReader.readArtifactDescriptor (DefaultArtifactDescriptorReader.java:171)
at org.eclipse.aether.internal.impl.collect.DefaultDependencyCollector.resolveCachedArtifactDescriptor (DefaultDependencyCollector.java:530)
at org.eclipse.aether.internal.impl.collect.DefaultDependencyCollector.getArtifactDescriptorResult (DefaultDependencyCollector.java:515)
at org.eclipse.aether.internal.impl.collect.DefaultDependencyCollector.processDependency (DefaultDependencyCollector.java:403)
at org.eclipse.aether.internal.impl.collect.DefaultDependencyCollector.processDependency (DefaultDependencyCollector.java:356)
at org.eclipse.aether.internal.impl.collect.DefaultDependencyCollector.process (DefaultDependencyCollector.java:344)
at org.eclipse.aether.internal.impl.collect.DefaultDependencyCollector.collectDependencies (DefaultDependencyCollector.java:247)
at org.eclipse.aether.internal.impl.DefaultRepositorySystem.collectDependencies (DefaultRepositorySystem.java:279)
at org.apache.maven.project.DefaultProjectDependenciesResolver.resolve (DefaultProjectDependenciesResolver.java:169)
at org.apache.maven.lifecycle.internal.LifecycleDependencyResolver.getDependencies (LifecycleDependencyResolver.java:243)
at org.apache.maven.lifecycle.internal.LifecycleDependencyResolver.resolveProjectDependencies (LifecycleDependencyResolver.java:147)
at org.apache.maven.lifecycle.internal.MojoExecutor.ensureDependenciesAreResolved (MojoExecutor.java:248)
at org.apache.maven.lifecycle.internal.MojoExecutor.execute (MojoExecutor.java:202)
at org.apache.maven.lifecycle.internal.MojoExecutor.execute (MojoExecutor.java:156)
at org.apache.maven.lifecycle.internal.MojoExecutor.execute (MojoExecutor.java:148)
at org.apache.maven.lifecycle.internal.LifecycleModuleBuilder.buildProject (LifecycleModuleBuilder.java:117)
at org.apache.maven.lifecycle.internal.LifecycleModuleBuilder.buildProject (LifecycleModuleBuilder.java:81)
at org.apache.maven.lifecycle.internal.builder.singlethreaded.SingleThreadedBuilder.build (SingleThreadedBuilder.java:56)
at org.apache.maven.lifecycle.internal.LifecycleStarter.execute (LifecycleStarter.java:128)
at org.apache.maven.DefaultMaven.doExecute (DefaultMaven.java:305)
at org.apache.maven.DefaultMaven.doExecute (DefaultMaven.java:192)
at org.apache.maven.DefaultMaven.execute (DefaultMaven.java:105)
at org.apache.maven.cli.MavenCli.execute (MavenCli.java:956)
at org.apache.maven.cli.MavenCli.doMain (MavenCli.java:288)
at org.apache.maven.cli.MavenCli.main (MavenCli.java:192)
at jdk.internal.reflect.NativeMethodAccessorImpl.invoke0 (Native Method)
at jdk.internal.reflect.NativeMethodAccessorImpl.invoke (NativeMethodAccessorImpl.java:62)
at jdk.internal.reflect.DelegatingMethodAccessorImpl.invoke (DelegatingMethodAccessorImpl.java:43)
at java.lang.reflect.Method.invoke (Method.java:566)
at org.codehaus.plexus.classworlds.launcher.Launcher.launchEnhanced (Launcher.java:282)
at org.codehaus.plexus.classworlds.launcher.Launcher.launch (Launcher.java:225)
at org.codehaus.plexus.classworlds.launcher.Launcher.mainWithExitCode (Launcher.java:406)
at org.codehaus.plexus.classworlds.launcher.Launcher.main (Launcher.java:347)
Caused by: org.apache.maven.wagon.providers.http.httpclient.conn.HttpHostConnectException: Connect to localhost:80 [localhost/127.0.0.1, localhost/0:0:0:0:0:0:0:1] failed: Connection refused: connect
at org.apache.maven.wagon.providers.http.httpclient.impl.conn.DefaultHttpClientConnectionOperator.connect (DefaultHttpClientConnectionOperator.java:156)
at org.apache.maven.wagon.providers.http.httpclient.impl.conn.PoolingHttpClientConnectionManager.connect (PoolingHttpClientConnectionManager.java:374)
at org.apache.maven.wagon.providers.http.httpclient.impl.execchain.MainClientExec.establishRoute (MainClientExec.java:393)
at org.apache.maven.wagon.providers.http.httpclient.impl.execchain.MainClientExec.execute (MainClientExec.java:236)
at org.apache.maven.wagon.providers.http.httpclient.impl.execchain.ProtocolExec.execute (ProtocolExec.java:186)
at org.apache.maven.wagon.providers.http.httpclient.impl.execchain.RetryExec.execute (RetryExec.java:89)
at org.apache.maven.wagon.providers.http.httpclient.impl.execchain.RedirectExec.execute (RedirectExec.java:110)
at org.apache.maven.wagon.providers.http.httpclient.impl.client.InternalHttpClient.doExecute (InternalHttpClient.java:185)
at org.apache.maven.wagon.providers.http.httpclient.impl.client.CloseableHttpClient.execute (CloseableHttpClient.java:83)
at org.apache.maven.wagon.providers.http.wagon.shared.AbstractHttpClientWagon.execute (AbstractHttpClientWagon.java:958)
at org.apache.maven.wagon.providers.http.wagon.shared.AbstractHttpClientWagon.fillInputData (AbstractHttpClientWagon.java:1117)
at org.apache.maven.wagon.providers.http.wagon.shared.AbstractHttpClientWagon.fillInputData (AbstractHttpClientWagon.java:1094)
at org.apache.maven.wagon.StreamWagon.getInputStream (StreamWagon.java:126)
at org.apache.maven.wagon.StreamWagon.getIfNewer (StreamWagon.java:88)
at org.apache.maven.wagon.StreamWagon.get (StreamWagon.java:61)
at org.eclipse.aether.transport.wagon.WagonTransporter$GetTaskRunner.run (WagonTransporter.java:567)
at org.eclipse.aether.transport.wagon.WagonTransporter.execute (WagonTransporter.java:435)
at org.eclipse.aether.transport.wagon.WagonTransporter.get (WagonTransporter.java:412)
at org.eclipse.aether.connector.basic.BasicRepositoryConnector$GetTaskRunner.runTask (BasicRepositoryConnector.java:456)
at org.eclipse.aether.connector.basic.BasicRepositoryConnector$TaskRunner.run (BasicRepositoryConnector.java:363)
at org.eclipse.aether.util.concurrency.RunnableErrorForwarder$1.run (RunnableErrorForwarder.java:75)
at org.eclipse.aether.connector.basic.BasicRepositoryConnector$DirectExecutor.execute (BasicRepositoryConnector.java:642)
at org.eclipse.aether.connector.basic.BasicRepositoryConnector.get (BasicRepositoryConnector.java:262)
at org.eclipse.aether.internal.impl.DefaultArtifactResolver.performDownloads (DefaultArtifactResolver.java:499)
at org.eclipse.aether.internal.impl.DefaultArtifactResolver.resolve (DefaultArtifactResolver.java:400)
at org.eclipse.aether.internal.impl.DefaultArtifactResolver.resolveArtifacts (DefaultArtifactResolver.java:225)
at org.eclipse.aether.internal.impl.DefaultArtifactResolver.resolveArtifact (DefaultArtifactResolver.java:202)
at org.apache.maven.repository.internal.DefaultArtifactDescriptorReader.loadPom (DefaultArtifactDescriptorReader.java:240)
at org.apache.maven.repository.internal.DefaultArtifactDescriptorReader.readArtifactDescriptor (DefaultArtifactDescriptorReader.java:171)
at org.eclipse.aether.internal.impl.collect.DefaultDependencyCollector.resolveCachedArtifactDescriptor (DefaultDependencyCollector.java:530)
at org.eclipse.aether.internal.impl.collect.DefaultDependencyCollector.getArtifactDescriptorResult (DefaultDependencyCollector.java:515)
at org.eclipse.aether.internal.impl.collect.DefaultDependencyCollector.processDependency (DefaultDependencyCollector.java:403)
at org.eclipse.aether.internal.impl.collect.DefaultDependencyCollector.processDependency (DefaultDependencyCollector.java:356)
at org.eclipse.aether.internal.impl.collect.DefaultDependencyCollector.process (DefaultDependencyCollector.java:344)
at org.eclipse.aether.internal.impl.collect.DefaultDependencyCollector.collectDependencies (DefaultDependencyCollector.java:247)
at org.eclipse.aether.internal.impl.DefaultRepositorySystem.collectDependencies (DefaultRepositorySystem.java:279)
at org.apache.maven.project.DefaultProjectDependenciesResolver.resolve (DefaultProjectDependenciesResolver.java:169)
at org.apache.maven.lifecycle.internal.LifecycleDependencyResolver.getDependencies (LifecycleDependencyResolver.java:243)
at org.apache.maven.lifecycle.internal.LifecycleDependencyResolver.resolveProjectDependencies (LifecycleDependencyResolver.java:147)
at org.apache.maven.lifecycle.internal.MojoExecutor.ensureDependenciesAreResolved (MojoExecutor.java:248)
at org.apache.maven.lifecycle.internal.MojoExecutor.execute (MojoExecutor.java:202)
at org.apache.maven.lifecycle.internal.MojoExecutor.execute (MojoExecutor.java:156)
at org.apache.maven.lifecycle.internal.MojoExecutor.execute (MojoExecutor.java:148)
at org.apache.maven.lifecycle.internal.LifecycleModuleBuilder.buildProject (LifecycleModuleBuilder.java:117)
at org.apache.maven.lifecycle.internal.LifecycleModuleBuilder.buildProject (LifecycleModuleBuilder.java:81)
at org.apache.maven.lifecycle.internal.builder.singlethreaded.SingleThreadedBuilder.build (SingleThreadedBuilder.java:56)
at org.apache.maven.lifecycle.internal.LifecycleStarter.execute (LifecycleStarter.java:128)
at org.apache.maven.DefaultMaven.doExecute (DefaultMaven.java:305)
at org.apache.maven.DefaultMaven.doExecute (DefaultMaven.java:192)
at org.apache.maven.DefaultMaven.execute (DefaultMaven.java:105)
at org.apache.maven.cli.MavenCli.execute (MavenCli.java:956)
at org.apache.maven.cli.MavenCli.doMain (MavenCli.java:288)
at org.apache.maven.cli.MavenCli.main (MavenCli.java:192)
at jdk.internal.reflect.NativeMethodAccessorImpl.invoke0 (Native Method)
at jdk.internal.reflect.NativeMethodAccessorImpl.invoke (NativeMethodAccessorImpl.java:62)
at jdk.internal.reflect.DelegatingMethodAccessorImpl.invoke (DelegatingMethodAccessorImpl.java:43)
at java.lang.reflect.Method.invoke (Method.java:566)
at org.codehaus.plexus.classworlds.launcher.Launcher.launchEnhanced (Launcher.java:282)
at org.codehaus.plexus.classworlds.launcher.Launcher.launch (Launcher.java:225)
at org.codehaus.plexus.classworlds.launcher.Launcher.mainWithExitCode (Launcher.java:406)
at org.codehaus.plexus.classworlds.launcher.Launcher.main (Launcher.java:347)
Caused by: java.net.ConnectException: Connection refused: connect
at java.net.PlainSocketImpl.connect0 (Native Method)
at java.net.PlainSocketImpl.socketConnect (PlainSocketImpl.java:101)
at java.net.AbstractPlainSocketImpl.doConnect (AbstractPlainSocketImpl.java:399)
at java.net.AbstractPlainSocketImpl.connectToAddress (AbstractPlainSocketImpl.java:242)
at java.net.AbstractPlainSocketImpl.connect (AbstractPlainSocketImpl.java:224)
at java.net.SocksSocketImpl.connect (SocksSocketImpl.java:403)
at java.net.Socket.connect (Socket.java:591)
at org.apache.maven.wagon.providers.http.httpclient.conn.socket.PlainConnectionSocketFactory.connectSocket (PlainConnectionSocketFactory.java:75)
at org.apache.maven.wagon.providers.http.httpclient.impl.conn.DefaultHttpClientConnectionOperator.connect (DefaultHttpClientConnectionOperator.java:142)
at org.apache.maven.wagon.providers.http.httpclient.impl.conn.PoolingHttpClientConnectionManager.connect (PoolingHttpClientConnectionManager.java:374)
at org.apache.maven.wagon.providers.http.httpclient.impl.execchain.MainClientExec.establishRoute (MainClientExec.java:393)
at org.apache.maven.wagon.providers.http.httpclient.impl.execchain.MainClientExec.execute (MainClientExec.java:236)
at org.apache.maven.wagon.providers.http.httpclient.impl.execchain.ProtocolExec.execute (ProtocolExec.java:186)
at org.apache.maven.wagon.providers.http.httpclient.impl.execchain.RetryExec.execute (RetryExec.java:89)
at org.apache.maven.wagon.providers.http.httpclient.impl.execchain.RedirectExec.execute (RedirectExec.java:110)
at org.apache.maven.wagon.providers.http.httpclient.impl.client.InternalHttpClient.doExecute (InternalHttpClient.java:185)
at org.apache.maven.wagon.providers.http.httpclient.impl.client.CloseableHttpClient.execute (CloseableHttpClient.java:83)
at org.apache.maven.wagon.providers.http.wagon.shared.AbstractHttpClientWagon.execute (AbstractHttpClientWagon.java:958)
at org.apache.maven.wagon.providers.http.wagon.shared.AbstractHttpClientWagon.fillInputData (AbstractHttpClientWagon.java:1117)
at org.apache.maven.wagon.providers.http.wagon.shared.AbstractHttpClientWagon.fillInputData (AbstractHttpClientWagon.java:1094)
at org.apache.maven.wagon.StreamWagon.getInputStream (StreamWagon.java:126)
at org.apache.maven.wagon.StreamWagon.getIfNewer (StreamWagon.java:88)
at org.apache.maven.wagon.StreamWagon.get (StreamWagon.java:61)
at org.eclipse.aether.transport.wagon.WagonTransporter$GetTaskRunner.run (WagonTransporter.java:567)
at org.eclipse.aether.transport.wagon.WagonTransporter.execute (WagonTransporter.java:435)
at org.eclipse.aether.transport.wagon.WagonTransporter.get (WagonTransporter.java:412)
at org.eclipse.aether.connector.basic.BasicRepositoryConnector$GetTaskRunner.runTask (BasicRepositoryConnector.java:456)
at org.eclipse.aether.connector.basic.BasicRepositoryConnector$TaskRunner.run (BasicRepositoryConnector.java:363)
at org.eclipse.aether.util.concurrency.RunnableErrorForwarder$1.run (RunnableErrorForwarder.java:75)
at org.eclipse.aether.connector.basic.BasicRepositoryConnector$DirectExecutor.execute (BasicRepositoryConnector.java:642)
at org.eclipse.aether.connector.basic.BasicRepositoryConnector.get (BasicRepositoryConnector.java:262)
at org.eclipse.aether.internal.impl.DefaultArtifactResolver.performDownloads (DefaultArtifactResolver.java:499)
at org.eclipse.aether.internal.impl.DefaultArtifactResolver.resolve (DefaultArtifactResolver.java:400)
at org.eclipse.aether.internal.impl.DefaultArtifactResolver.resolveArtifacts (DefaultArtifactResolver.java:225)
at org.eclipse.aether.internal.impl.DefaultArtifactResolver.resolveArtifact (DefaultArtifactResolver.java:202)
at org.apache.maven.repository.internal.DefaultArtifactDescriptorReader.loadPom (DefaultArtifactDescriptorReader.java:240)
at org.apache.maven.repository.internal.DefaultArtifactDescriptorReader.readArtifactDescriptor (DefaultArtifactDescriptorReader.java:171)
at org.eclipse.aether.internal.impl.collect.DefaultDependencyCollector.resolveCachedArtifactDescriptor (DefaultDependencyCollector.java:530)
at org.eclipse.aether.internal.impl.collect.DefaultDependencyCollector.getArtifactDescriptorResult (DefaultDependencyCollector.java:515)
at org.eclipse.aether.internal.impl.collect.DefaultDependencyCollector.processDependency (DefaultDependencyCollector.java:403)
at org.eclipse.aether.internal.impl.collect.DefaultDependencyCollector.processDependency (DefaultDependencyCollector.java:356)
at org.eclipse.aether.internal.impl.collect.DefaultDependencyCollector.process (DefaultDependencyCollector.java:344)
at org.eclipse.aether.internal.impl.collect.DefaultDependencyCollector.collectDependencies (DefaultDependencyCollector.java:247)
at org.eclipse.aether.internal.impl.DefaultRepositorySystem.collectDependencies (DefaultRepositorySystem.java:279)
at org.apache.maven.project.DefaultProjectDependenciesResolver.resolve (DefaultProjectDependenciesResolver.java:169)
at org.apache.maven.lifecycle.internal.LifecycleDependencyResolver.getDependencies (LifecycleDependencyResolver.java:243)
at org.apache.maven.lifecycle.internal.LifecycleDependencyResolver.resolveProjectDependencies (LifecycleDependencyResolver.java:147)
at org.apache.maven.lifecycle.internal.MojoExecutor.ensureDependenciesAreResolved (MojoExecutor.java:248)
at org.apache.maven.lifecycle.internal.MojoExecutor.execute (MojoExecutor.java:202)
at org.apache.maven.lifecycle.internal.MojoExecutor.execute (MojoExecutor.java:156)
at org.apache.maven.lifecycle.internal.MojoExecutor.execute (MojoExecutor.java:148)
at org.apache.maven.lifecycle.internal.LifecycleModuleBuilder.buildProject (LifecycleModuleBuilder.java:117)
at org.apache.maven.lifecycle.internal.LifecycleModuleBuilder.buildProject (LifecycleModuleBuilder.java:81)
at org.apache.maven.lifecycle.internal.builder.singlethreaded.SingleThreadedBuilder.build (SingleThreadedBuilder.java:56)
at org.apache.maven.lifecycle.internal.LifecycleStarter.execute (LifecycleStarter.java:128)
at org.apache.maven.DefaultMaven.doExecute (DefaultMaven.java:305)
at org.apache.maven.DefaultMaven.doExecute (DefaultMaven.java:192)
at org.apache.maven.DefaultMaven.execute (DefaultMaven.java:105)
at org.apache.maven.cli.MavenCli.execute (MavenCli.java:956)
at org.apache.maven.cli.MavenCli.doMain (MavenCli.java:288)
at org.apache.maven.cli.MavenCli.main (MavenCli.java:192)
at jdk.internal.reflect.NativeMethodAccessorImpl.invoke0 (Native Method)
at jdk.internal.reflect.NativeMethodAccessorImpl.invoke (NativeMethodAccessorImpl.java:62)
at jdk.internal.reflect.DelegatingMethodAccessorImpl.invoke (DelegatingMethodAccessorImpl.java:43)
at java.lang.reflect.Method.invoke (Method.java:566)
at org.codehaus.plexus.classworlds.launcher.Launcher.launchEnhanced (Launcher.java:282)
at org.codehaus.plexus.classworlds.launcher.Launcher.launch (Launcher.java:225)
at org.codehaus.plexus.classworlds.launcher.Launcher.mainWithExitCode (Launcher.java:406)
at org.codehaus.plexus.classworlds.launcher.Launcher.main (Launcher.java:347)
[ERROR]
[ERROR] Re-run Maven using the -X switch to enable full debug logging.
[ERROR]
[ERROR] For more information about the errors and possible solutions, please read the following articles:
[ERROR] [Help 1] http://cwiki.apache.org/confluence/display/MAVEN/DependencyResolutionException
Stack Trace:
org.apache.maven.it.VerificationException:
Exit code was non-zero: 1; command line and log =
C:\mvn-it-2.tmp\core-it-suite\target\apache-maven\bin\mvn --global-settings C:\mvn-it-2.tmp\core-it-suite\target\test-classes\settings.xml --settings settings.xml -e --batch-mode -Dmaven.repo.local=c:\mvn-it-2.tmp\it-local-repo org.apache.maven.its.plugins:maven-it-plugin-dependency-resolution:2.1-SNAPSHOT:compile
Picked up JAVA_TOOL_OPTIONS: -Dmaven.ext.class.path="c:\mvn-it-2.tmp@tmp\withMavenbafc2b1a\pipeline-maven-spy.jar" -Dorg.jenkinsci.plugins.pipeline.maven.reportsFolder="c:\mvn-it-2.tmp@tmp\withMavenbafc2b1a"
[INFO] [jenkins-event-spy] Jenkins Maven Event Spy is disabled
[INFO] Error stacktraces are turned on.
[INFO] Scanning for projects...
WARNING: An illegal reflective access operation has occurred
WARNING: Illegal reflective access by org.apache.maven.model.interpolation.StringSearchModelInterpolator$InterpolateObjectAction$CacheField (file:/C:/mvn-it-2.tmp/core-it-suite/target/apache-maven/bin/../lib/maven-model-builder-3.6.2-SNAPSHOT.jar) to field java.io.File.fs
WARNING: Please consider reporting this to the maintainers of org.apache.maven.model.interpolation.StringSearchModelInterpolator$InterpolateObjectAction$CacheField
WARNING: Use --illegal-access=warn to enable warnings of further illegal reflective access operations
WARNING: All illegal access operations will be denied in a future release
[INFO]
[INFO] -----------------< org.apache.maven.its.mng5280:test >------------------
[INFO] Building Maven Integration Test :: MNG-5280 0.1-SNAPSHOT
[INFO] --------------------------------[ jar ]---------------------------------
[INFO] Downloading from central: file:target/null/org/apache/maven/its/mng5280/fake-artifact/1.0/fake-artifact-1.0.pom
[INFO] Downloading from repo2: http://localhost:-1/repo2/org/apache/maven/its/mng5280/fake-artifact/1.0/fake-artifact-1.0.pom
[INFO] Downloading from repo1: http://localhost:-1/repo1/org/apache/maven/its/mng5280/fake-artifact/1.0/fake-artifact-1.0.pom
[INFO] ------------------------------------------------------------------------
[INFO] BUILD FAILURE
[INFO] ------------------------------------------------------------------------
[INFO] Total time: 4.812 s
[INFO] Finished at: 2019-07-30T14:33:54-07:00
[INFO] ------------------------------------------------------------------------
[ERROR] Failed to execute goal on project test: Could not resolve dependencies for project org.apache.maven.its.mng5280:test:jar:0.1-SNAPSHOT: Failed to collect dependencies at org.apache.maven.its.mng5280:fake-artifact:jar:1.0: Failed to read artifact descriptor for org.apache.maven.its.mng5280:fake-artifact:jar:1.0: Could not transfer artifact org.apache.maven.its.mng5280:fake-artifact:pom:1.0 from/to repo2 (http://localhost:-1/repo2/): Connect to localhost:80 [localhost/127.0.0.1, localhost/0:0:0:0:0:0:0:1] failed: Connection refused: connect -> [Help 1]
org.apache.maven.lifecycle.LifecycleExecutionException: Failed to execute goal on project test: Could not resolve dependencies for project org.apache.maven.its.mng5280:test:jar:0.1-SNAPSHOT: Failed to collect dependencies at org.apache.maven.its.mng5280:fake-artifact:jar:1.0
at org.apache.maven.lifecycle.internal.LifecycleDependencyResolver.getDependencies (LifecycleDependencyResolver.java:269)
at org.apache.maven.lifecycle.internal.LifecycleDependencyResolver.resolveProjectDependencies (LifecycleDependencyResolver.java:147)
at org.apache.maven.lifecycle.internal.MojoExecutor.ensureDependenciesAreResolved (MojoExecutor.java:248)
at org.apache.maven.lifecycle.internal.MojoExecutor.execute (MojoExecutor.java:202)
at org.apache.maven.lifecycle.internal.MojoExecutor.execute (MojoExecutor.java:156)
at org.apache.maven.lifecycle.internal.MojoExecutor.execute (MojoExecutor.java:148)
at org.apache.maven.lifecycle.internal.LifecycleModuleBuilder.buildProject (LifecycleModuleBuilder.java:117)
at org.apache.maven.lifecycle.internal.LifecycleModuleBuilder.buildProject (LifecycleModuleBuilder.java:81)
at org.apache.maven.lifecycle.internal.builder.singlethreaded.SingleThreadedBuilder.build (SingleThreadedBuilder.java:56)
at org.apache.maven.lifecycle.internal.LifecycleStarter.execute (LifecycleStarter.java:128)
at org.apache.maven.DefaultMaven.doExecute (DefaultMaven.java:305)
at org.apache.maven.DefaultMaven.doExecute (DefaultMaven.java:192)
at org.apache.maven.DefaultMaven.execute (DefaultMaven.java:105)
at org.apache.maven.cli.MavenCli.execute (MavenCli.java:956)
at org.apache.maven.cli.MavenCli.doMain (MavenCli.java:288)
at org.apache.maven.cli.MavenCli.main (MavenCli.java:192)
at jdk.internal.reflect.NativeMethodAccessorImpl.invoke0 (Native Method)
at jdk.internal.reflect.NativeMethodAccessorImpl.invoke (NativeMethodAccessorImpl.java:62)
at jdk.internal.reflect.DelegatingMethodAccessorImpl.invoke (DelegatingMethodAccessorImpl.java:43)
at java.lang.reflect.Method.invoke (Method.java:566)
at org.codehaus.plexus.classworlds.launcher.Launcher.launchEnhanced (Launcher.java:282)
at org.codehaus.plexus.classworlds.launcher.Launcher.launch (Launcher.java:225)
at org.codehaus.plexus.classworlds.launcher.Launcher.mainWithExitCode (Launcher.java:406)
at org.codehaus.plexus.classworlds.launcher.Launcher.main (Launcher.java:347)
Caused by: org.apache.maven.project.DependencyResolutionException: Could not resolve dependencies for project org.apache.maven.its.mng5280:test:jar:0.1-SNAPSHOT: Failed to collect dependencies at org.apache.maven.its.mng5280:fake-artifact:jar:1.0
at org.apache.maven.project.DefaultProjectDependenciesResolver.resolve (DefaultProjectDependenciesResolver.java:178)
at org.apache.maven.lifecycle.internal.LifecycleDependencyResolver.getDependencies (LifecycleDependencyResolver.java:243)
at org.apache.maven.lifecycle.internal.LifecycleDependencyResolver.resolveProjectDependencies (LifecycleDependencyResolver.java:147)
at org.apache.maven.lifecycle.internal.MojoExecutor.ensureDependenciesAreResolved (MojoExecutor.java:248)
at org.apache.maven.lifecycle.internal.MojoExecutor.execute (MojoExecutor.java:202)
at org.apache.maven.lifecycle.internal.MojoExecutor.execute (MojoExecutor.java:156)
at org.apache.maven.lifecycle.internal.MojoExecutor.execute (MojoExecutor.java:148)
at org.apache.maven.lifecycle.internal.LifecycleModuleBuilder.buildProject (LifecycleModuleBuilder.java:117)
at org.apache.maven.lifecycle.internal.LifecycleModuleBuilder.buildProject (LifecycleModuleBuilder.java:81)
at org.apache.maven.lifecycle.internal.builder.singlethreaded.SingleThreadedBuilder.build (SingleThreadedBuilder.java:56)
at org.apache.maven.lifecycle.internal.LifecycleStarter.execute (LifecycleStarter.java:128)
at org.apache.maven.DefaultMaven.doExecute (DefaultMaven.java:305)
at org.apache.maven.DefaultMaven.doExecute (DefaultMaven.java:192)
at org.apache.maven.DefaultMaven.execute (DefaultMaven.java:105)
at org.apache.maven.cli.MavenCli.execute (MavenCli.java:956)
at org.apache.maven.cli.MavenCli.doMain (MavenCli.java:288)
at org.apache.maven.cli.MavenCli.main (MavenCli.java:192)
at jdk.internal.reflect.NativeMethodAccessorImpl.invoke0 (Native Method)
at jdk.internal.reflect.NativeMethodAccessorImpl.invoke (NativeMethodAccessorImpl.java:62)
at jdk.internal.reflect.DelegatingMethodAccessorImpl.invoke (DelegatingMethodAccessorImpl.java:43)
at java.lang.reflect.Method.invoke (Method.java:566)
at org.codehaus.plexus.classworlds.launcher.Launcher.launchEnhanced (Launcher.java:282)
at org.codehaus.plexus.classworlds.launcher.Launcher.launch (Launcher.java:225)
at org.codehaus.plexus.classworlds.launcher.Launcher.mainWithExitCode (Launcher.java:406)
at org.codehaus.plexus.classworlds.launcher.Launcher.main (Launcher.java:347)
Caused by: org.eclipse.aether.collection.DependencyCollectionException: Failed to collect dependencies at org.apache.maven.its.mng5280:fake-artifact:jar:1.0
at org.eclipse.aether.internal.impl.collect.DefaultDependencyCollector.collectDependencies (DefaultDependencyCollector.java:284)
at org.eclipse.aether.internal.impl.DefaultRepositorySystem.collectDependencies (DefaultRepositorySystem.java:279)
at org.apache.maven.project.DefaultProjectDependenciesResolver.resolve (DefaultProjectDependenciesResolver.java:169)
at org.apache.maven.lifecycle.internal.LifecycleDependencyResolver.getDependencies (LifecycleDependencyResolver.java:243)
at org.apache.maven.lifecycle.internal.LifecycleDependencyResolver.resolveProjectDependencies (LifecycleDependencyResolver.java:147)
at org.apache.maven.lifecycle.internal.MojoExecutor.ensureDependenciesAreResolved (MojoExecutor.java:248)
at org.apache.maven.lifecycle.internal.MojoExecutor.execute (MojoExecutor.java:202)
at org.apache.maven.lifecycle.internal.MojoExecutor.execute (MojoExecutor.java:156)
at org.apache.maven.lifecycle.internal.MojoExecutor.execute (MojoExecutor.java:148)
at org.apache.maven.lifecycle.internal.LifecycleModuleBuilder.buildProject (LifecycleModuleBuilder.java:117)
at org.apache.maven.lifecycle.internal.LifecycleModuleBuilder.buildProject (LifecycleModuleBuilder.java:81)
at org.apache.maven.lifecycle.internal.builder.singlethreaded.SingleThreadedBuilder.build (SingleThreadedBuilder.java:56)
at org.apache.maven.lifecycle.internal.LifecycleStarter.execute (LifecycleStarter.java:128)
at org.apache.maven.DefaultMaven.doExecute (DefaultMaven.java:305)
at org.apache.maven.DefaultMaven.doExecute (DefaultMaven.java:192)
at org.apache.maven.DefaultMaven.execute (DefaultMaven.java:105)
at org.apache.maven.cli.MavenCli.execute (MavenCli.java:956)
at org.apache.maven.cli.MavenCli.doMain (MavenCli.java:288)
at org.apache.maven.cli.MavenCli.main (MavenCli.java:192)
at jdk.internal.reflect.NativeMethodAccessorImpl.invoke0 (Native Method)
at jdk.internal.reflect.NativeMethodAccessorImpl.invoke (NativeMethodAccessorImpl.java:62)
at jdk.internal.reflect.DelegatingMethodAccessorImpl.invoke (DelegatingMethodAccessorImpl.java:43)
at java.lang.reflect.Method.invoke (Method.java:566)
at org.codehaus.plexus.classworlds.launcher.Launcher.launchEnhanced (Launcher.java:282)
at org.codehaus.plexus.classworlds.launcher.Launcher.launch (Launcher.java:225)
at org.codehaus.plexus.classworlds.launcher.Launcher.mainWithExitCode (Launcher.java:406)
at org.codehaus.plexus.classworlds.launcher.Launcher.main (Launcher.java:347)
Caused by: org.eclipse.aether.resolution.ArtifactDescriptorException: Failed to read artifact descriptor for org.apache.maven.its.mng5280:fake-artifact:jar:1.0
at org.apache.maven.repository.internal.DefaultArtifactDescriptorReader.loadPom (DefaultArtifactDescriptorReader.java:255)
at org.apache.maven.repository.internal.DefaultArtifactDescriptorReader.readArtifactDescriptor (DefaultArtifactDescriptorReader.java:171)
at org.eclipse.aether.internal.impl.collect.DefaultDependencyCollector.resolveCachedArtifactDescriptor (DefaultDependencyCollector.java:530)
at org.eclipse.aether.internal.impl.collect.DefaultDependencyCollector.getArtifactDescriptorResult (DefaultDependencyCollector.java:515)
at org.eclipse.aether.internal.impl.collect.DefaultDependencyCollector.processDependency (DefaultDependencyCollector.java:403)
at org.eclipse.aether.internal.impl.collect.DefaultDependencyCollector.processDependency (DefaultDependencyCollector.java:356)
at org.eclipse.aether.internal.impl.collect.DefaultDependencyCollector.process (DefaultDependencyCollector.java:344)
at org.eclipse.aether.internal.impl.collect.DefaultDependencyCollector.collectDependencies (DefaultDependencyCollector.java:247)
at org.eclipse.aether.internal.impl.DefaultRepositorySystem.collectDependencies (DefaultRepositorySystem.java:279)
at org.apache.maven.project.DefaultProjectDependenciesResolver.resolve (DefaultProjectDependenciesResolver.java:169)
at org.apache.maven.lifecycle.internal.LifecycleDependencyResolver.getDependencies (LifecycleDependencyResolver.java:243)
at org.apache.maven.lifecycle.internal.LifecycleDependencyResolver.resolveProjectDependencies (LifecycleDependencyResolver.java:147)
at org.apache.maven.lifecycle.internal.MojoExecutor.ensureDependenciesAreResolved (MojoExecutor.java:248)
at org.apache.maven.lifecycle.internal.MojoExecutor.execute (MojoExecutor.java:202)
at org.apache.maven.lifecycle.internal.MojoExecutor.execute (MojoExecutor.java:156)
at org.apache.maven.lifecycle.internal.MojoExecutor.execute (MojoExecutor.java:148)
at org.apache.maven.lifecycle.internal.LifecycleModuleBuilder.buildProject (LifecycleModuleBuilder.java:117)
at org.apache.maven.lifecycle.internal.LifecycleModuleBuilder.buildProject (LifecycleModuleBuilder.java:81)
at org.apache.maven.lifecycle.internal.builder.singlethreaded.SingleThreadedBuilder.build (SingleThreadedBuilder.java:56)
at org.apache.maven.lifecycle.internal.LifecycleStarter.execute (LifecycleStarter.java:128)
at org.apache.maven.DefaultMaven.doExecute (DefaultMaven.java:305)
at org.apache.maven.DefaultMaven.doExecute (DefaultMaven.java:192)
at org.apache.maven.DefaultMaven.execute (DefaultMaven.java:105)
at org.apache.maven.cli.MavenCli.execute (MavenCli.java:956)
at org.apache.maven.cli.MavenCli.doMain (MavenCli.java:288)
at org.apache.maven.cli.MavenCli.main (MavenCli.java:192)
at jdk.internal.reflect.NativeMethodAccessorImpl.invoke0 (Native Method)
at jdk.internal.reflect.NativeMethodAccessorImpl.invoke (NativeMethodAccessorImpl.java:62)
at jdk.internal.reflect.DelegatingMethodAccessorImpl.invoke (DelegatingMethodAccessorImpl.java:43)
at java.lang.reflect.Method.invoke (Method.java:566)
at org.codehaus.plexus.classworlds.launcher.Launcher.launchEnhanced (Launcher.java:282)
at org.codehaus.plexus.classworlds.launcher.Launcher.launch (Launcher.java:225)
at org.codehaus.plexus.classworlds.launcher.Launcher.mainWithExitCode (Launcher.java:406)
at org.codehaus.plexus.classworlds.launcher.Launcher.main (Launcher.java:347)
Caused by: org.eclipse.aether.resolution.ArtifactResolutionException: Could not transfer artifact org.apache.maven.its.mng5280:fake-artifact:pom:1.0 from/to repo2 (http://localhost:-1/repo2/): Connect to localhost:80 [localhost/127.0.0.1, localhost/0:0:0:0:0:0:0:1] failed: Connection refused: connect
at org.eclipse.aether.internal.impl.DefaultArtifactResolver.resolve (DefaultArtifactResolver.java:423)
at org.eclipse.aether.internal.impl.DefaultArtifactResolver.resolveArtifacts (DefaultArtifactResolver.java:225)
at org.eclipse.aether.internal.impl.DefaultArtifactResolver.resolveArtifact (DefaultArtifactResolver.java:202)
at org.apache.maven.repository.internal.DefaultArtifactDescriptorReader.loadPom (DefaultArtifactDescriptorReader.java:240)
at org.apache.maven.repository.internal.DefaultArtifactDescriptorReader.readArtifactDescriptor (DefaultArtifactDescriptorReader.java:171)
at org.eclipse.aether.internal.impl.collect.DefaultDependencyCollector.resolveCachedArtifactDescriptor (DefaultDependencyCollector.java:530)
at org.eclipse.aether.internal.impl.collect.DefaultDependencyCollector.getArtifactDescriptorResult (DefaultDependencyCollector.java:515)
at org.eclipse.aether.internal.impl.collect.DefaultDependencyCollector.processDependency (DefaultDependencyCollector.java:403)
at org.eclipse.aether.internal.impl.collect.DefaultDependencyCollector.processDependency (DefaultDependencyCollector.java:356)
at org.eclipse.aether.internal.impl.collect.DefaultDependencyCollector.process (DefaultDependencyCollector.java:344)
at org.eclipse.aether.internal.impl.collect.DefaultDependencyCollector.collectDependencies (DefaultDependencyCollector.java:247)
at org.eclipse.aether.internal.impl.DefaultRepositorySystem.collectDependencies (DefaultRepositorySystem.java:279)
at org.apache.maven.project.DefaultProjectDependenciesResolver.resolve (DefaultProjectDependenciesResolver.java:169)
at org.apache.maven.lifecycle.internal.LifecycleDependencyResolver.getDependencies (LifecycleDependencyResolver.java:243)
at org.apache.maven.lifecycle.internal.LifecycleDependencyResolver.resolveProjectDependencies (LifecycleDependencyResolver.java:147)
at org.apache.maven.lifecycle.internal.MojoExecutor.ensureDependenciesAreResolved (MojoExecutor.java:248)
at org.apache.maven.lifecycle.internal.MojoExecutor.execute (MojoExecutor.java:202)
at org.apache.maven.lifecycle.internal.MojoExecutor.execute (MojoExecutor.java:156)
at org.apache.maven.lifecycle.internal.MojoExecutor.execute (MojoExecutor.java:148)
at org.apache.maven.lifecycle.internal.LifecycleModuleBuilder.buildProject (LifecycleModuleBuilder.java:117)
at org.apache.maven.lifecycle.internal.LifecycleModuleBuilder.buildProject (LifecycleModuleBuilder.java:81)
at org.apache.maven.lifecycle.internal.builder.singlethreaded.SingleThreadedBuilder.build (SingleThreadedBuilder.java:56)
at org.apache.maven.lifecycle.internal.LifecycleStarter.execute (LifecycleStarter.java:128)
at org.apache.maven.DefaultMaven.doExecute (DefaultMaven.java:305)
at org.apache.maven.DefaultMaven.doExecute (DefaultMaven.java:192)
at org.apache.maven.DefaultMaven.execute (DefaultMaven.java:105)
at org.apache.maven.cli.MavenCli.execute (MavenCli.java:956)
at org.apache.maven.cli.MavenCli.doMain (MavenCli.java:288)
at org.apache.maven.cli.MavenCli.main (MavenCli.java:192)
at jdk.internal.reflect.NativeMethodAccessorImpl.invoke0 (Native Method)
at jdk.internal.reflect.NativeMethodAccessorImpl.invoke (NativeMethodAccessorImpl.java:62)
at jdk.internal.reflect.DelegatingMethodAccessorImpl.invoke (DelegatingMethodAccessorImpl.java:43)
at java.lang.reflect.Method.invoke (Method.java:566)
at org.codehaus.plexus.classworlds.launcher.Launcher.launchEnhanced (Launcher.java:282)
at org.codehaus.plexus.classworlds.launcher.Launcher.launch (Launcher.java:225)
at org.codehaus.plexus.classworlds.launcher.Launcher.mainWithExitCode (Launcher.java:406)
at org.codehaus.plexus.classworlds.launcher.Launcher.main (Launcher.java:347)
Caused by: org.eclipse.aether.transfer.ArtifactTransferException: Could not transfer artifact org.apache.maven.its.mng5280:fake-artifact:pom:1.0 from/to repo2 (http://localhost:-1/repo2/): Connect to localhost:80 [localhost/127.0.0.1, localhost/0:0:0:0:0:0:0:1] failed: Connection refused: connect
at org.eclipse.aether.connector.basic.ArtifactTransportListener.transferFailed (ArtifactTransportListener.java:52)
at org.eclipse.aether.connector.basic.BasicRepositoryConnector$TaskRunner.run (BasicRepositoryConnector.java:368)
at org.eclipse.aether.util.concurrency.RunnableErrorForwarder$1.run (RunnableErrorForwarder.java:75)
at org.eclipse.aether.connector.basic.BasicRepositoryConnector$DirectExecutor.execute (BasicRepositoryConnector.java:642)
at org.eclipse.aether.connector.basic.BasicRepositoryConnector.get (BasicRepositoryConnector.java:262)
at org.eclipse.aether.internal.impl.DefaultArtifactResolver.performDownloads (DefaultArtifactResolver.java:499)
at org.eclipse.aether.internal.impl.DefaultArtifactResolver.resolve (DefaultArtifactResolver.java:400)
at org.eclipse.aether.internal.impl.DefaultArtifactResolver.resolveArtifacts (DefaultArtifactResolver.java:225)
at org.eclipse.aether.internal.impl.DefaultArtifactResolver.resolveArtifact (DefaultArtifactResolver.java:202)
at org.apache.maven.repository.internal.DefaultArtifactDescriptorReader.loadPom (DefaultArtifactDescriptorReader.java:240)
at org.apache.maven.repository.internal.DefaultArtifactDescriptorReader.readArtifactDescriptor (DefaultArtifactDescriptorReader.java:171)
at org.eclipse.aether.internal.impl.collect.DefaultDependencyCollector.resolveCachedArtifactDescriptor (DefaultDependencyCollector.java:530)
at org.eclipse.aether.internal.impl.collect.DefaultDependencyCollector.getArtifactDescriptorResult (DefaultDependencyCollector.java:515)
at org.eclipse.aether.internal.impl.collect.DefaultDependencyCollector.processDependency (DefaultDependencyCollector.java:403)
at org.eclipse.aether.internal.impl.collect.DefaultDependencyCollector.processDependency (DefaultDependencyCollector.java:356)
at org.eclipse.aether.internal.impl.collect.DefaultDependencyCollector.process (DefaultDependencyCollector.java:344)
at org.eclipse.aether.internal.impl.collect.DefaultDependencyCollector.collectDependencies (DefaultDependencyCollector.java:247)
at org.eclipse.aether.internal.impl.DefaultRepositorySystem.collectDependencies (DefaultRepositorySystem.java:279)
at org.apache.maven.project.DefaultProjectDependenciesResolver.resolve (DefaultProjectDependenciesResolver.java:169)
at org.apache.maven.lifecycle.internal.LifecycleDependencyResolver.getDependencies (LifecycleDependencyResolver.java:243)
at org.apache.maven.lifecycle.internal.LifecycleDependencyResolver.resolveProjectDependencies (LifecycleDependencyResolver.java:147)
at org.apache.maven.lifecycle.internal.MojoExecutor.ensureDependenciesAreResolved (MojoExecutor.java:248)
at org.apache.maven.lifecycle.internal.MojoExecutor.execute (MojoExecutor.java:202)
at org.apache.maven.lifecycle.internal.MojoExecutor.execute (MojoExecutor.java:156)
at org.apache.maven.lifecycle.internal.MojoExecutor.execute (MojoExecutor.java:148)
at org.apache.maven.lifecycle.internal.LifecycleModuleBuilder.buildProject (LifecycleModuleBuilder.java:117)
at org.apache.maven.lifecycle.internal.LifecycleModuleBuilder.buildProject (LifecycleModuleBuilder.java:81)
at org.apache.maven.lifecycle.internal.builder.singlethreaded.SingleThreadedBuilder.build (SingleThreadedBuilder.java:56)
at org.apache.maven.lifecycle.internal.LifecycleStarter.execute (LifecycleStarter.java:128)
at org.apache.maven.DefaultMaven.doExecute (DefaultMaven.java:305)
at org.apache.maven.DefaultMaven.doExecute (DefaultMaven.java:192)
at org.apache.maven.DefaultMaven.execute (DefaultMaven.java:105)
at org.apache.maven.cli.MavenCli.execute (MavenCli.java:956)
at org.apache.maven.cli.MavenCli.doMain (MavenCli.java:288)
at org.apache.maven.cli.MavenCli.main (MavenCli.java:192)
at jdk.internal.reflect.NativeMethodAccessorImpl.invoke0 (Native Method)
at jdk.internal.reflect.NativeMethodAccessorImpl.invoke (NativeMethodAccessorImpl.java:62)
at jdk.internal.reflect.DelegatingMethodAccessorImpl.invoke (DelegatingMethodAccessorImpl.java:43)
at java.lang.reflect.Method.invoke (Method.java:566)
at org.codehaus.plexus.classworlds.launcher.Launcher.launchEnhanced (Launcher.java:282)
at org.codehaus.plexus.classworlds.launcher.Launcher.launch (Launcher.java:225)
at org.codehaus.plexus.classworlds.launcher.Launcher.mainWithExitCode (Launcher.java:406)
at org.codehaus.plexus.classworlds.launcher.Launcher.main (Launcher.java:347)
Caused by: org.apache.maven.wagon.TransferFailedException: Connect to localhost:80 [localhost/127.0.0.1, localhost/0:0:0:0:0:0:0:1] failed: Connection refused: connect
at org.apache.maven.wagon.providers.http.wagon.shared.AbstractHttpClientWagon.fillInputData (AbstractHttpClientWagon.java:1206)
at org.apache.maven.wagon.providers.http.wagon.shared.AbstractHttpClientWagon.fillInputData (AbstractHttpClientWagon.java:1094)
at org.apache.maven.wagon.StreamWagon.getInputStream (StreamWagon.java:126)
at org.apache.maven.wagon.StreamWagon.getIfNewer (StreamWagon.java:88)
at org.apache.maven.wagon.StreamWagon.get (StreamWagon.java:61)
at org.eclipse.aether.transport.wagon.WagonTransporter$GetTaskRunner.run (WagonTransporter.java:567)
at org.eclipse.aether.transport.wagon.WagonTransporter.execute (WagonTransporter.java:435)
at org.eclipse.aether.transport.wagon.WagonTransporter.get (WagonTransporter.java:412)
at org.eclipse.aether.connector.basic.BasicRepositoryConnector$GetTaskRunner.runTask (BasicRepositoryConnector.java:456)
at org.eclipse.aether.connector.basic.BasicRepositoryConnector$TaskRunner.run (BasicRepositoryConnector.java:363)
at org.eclipse.aether.util.concurrency.RunnableErrorForwarder$1.run (RunnableErrorForwarder.java:75)
at org.eclipse.aether.connector.basic.BasicRepositoryConnector$DirectExecutor.execute (BasicRepositoryConnector.java:642)
at org.eclipse.aether.connector.basic.BasicRepositoryConnector.get (BasicRepositoryConnector.java:262)
at org.eclipse.aether.internal.impl.DefaultArtifactResolver.performDownloads (DefaultArtifactResolver.java:499)
at org.eclipse.aether.internal.impl.DefaultArtifactResolver.resolve (DefaultArtifactResolver.java:400)
at org.eclipse.aether.internal.impl.DefaultArtifactResolver.resolveArtifacts (DefaultArtifactResolver.java:225)
at org.eclipse.aether.internal.impl.DefaultArtifactResolver.resolveArtifact (DefaultArtifactResolver.java:202)
at org.apache.maven.repository.internal.DefaultArtifactDescriptorReader.loadPom (DefaultArtifactDescriptorReader.java:240)
at org.apache.maven.repository.internal.DefaultArtifactDescriptorReader.readArtifactDescriptor (DefaultArtifactDescriptorReader.java:171)
at org.eclipse.aether.internal.impl.collect.DefaultDependencyCollector.resolveCachedArtifactDescriptor (DefaultDependencyCollector.java:530)
at org.eclipse.aether.internal.impl.collect.DefaultDependencyCollector.getArtifactDescriptorResult (DefaultDependencyCollector.java:515)
at org.eclipse.aether.internal.impl.collect.DefaultDependencyCollector.processDependency (DefaultDependencyCollector.java:403)
at org.eclipse.aether.internal.impl.collect.DefaultDependencyCollector.processDependency (DefaultDependencyCollector.java:356)
at org.eclipse.aether.internal.impl.collect.DefaultDependencyCollector.process (DefaultDependencyCollector.java:344)
at org.eclipse.aether.internal.impl.collect.DefaultDependencyCollector.collectDependencies (DefaultDependencyCollector.java:247)
at org.eclipse.aether.internal.impl.DefaultRepositorySystem.collectDependencies (DefaultRepositorySystem.java:279)
at org.apache.maven.project.DefaultProjectDependenciesResolver.resolve (DefaultProjectDependenciesResolver.java:169)
at org.apache.maven.lifecycle.internal.LifecycleDependencyResolver.getDependencies (LifecycleDependencyResolver.java:243)
at org.apache.maven.lifecycle.internal.LifecycleDependencyResolver.resolveProjectDependencies (LifecycleDependencyResolver.java:147)
at org.apache.maven.lifecycle.internal.MojoExecutor.ensureDependenciesAreResolved (MojoExecutor.java:248)
at org.apache.maven.lifecycle.internal.MojoExecutor.execute (MojoExecutor.java:202)
at org.apache.maven.lifecycle.internal.MojoExecutor.execute (MojoExecutor.java:156)
at org.apache.maven.lifecycle.internal.MojoExecutor.execute (MojoExecutor.java:148)
at org.apache.maven.lifecycle.internal.LifecycleModuleBuilder.buildProject (LifecycleModuleBuilder.java:117)
at org.apache.maven.lifecycle.internal.LifecycleModuleBuilder.buildProject (LifecycleModuleBuilder.java:81)
at org.apache.maven.lifecycle.internal.builder.singlethreaded.SingleThreadedBuilder.build (SingleThreadedBuilder.java:56)
at org.apache.maven.lifecycle.internal.LifecycleStarter.execute (LifecycleStarter.java:128)
at org.apache.maven.DefaultMaven.doExecute (DefaultMaven.java:305)
at org.apache.maven.DefaultMaven.doExecute (DefaultMaven.java:192)
at org.apache.maven.DefaultMaven.execute (DefaultMaven.java:105)
at org.apache.maven.cli.MavenCli.execute (MavenCli.java:956)
at org.apache.maven.cli.MavenCli.doMain (MavenCli.java:288)
at org.apache.maven.cli.MavenCli.main (MavenCli.java:192)
at jdk.internal.reflect.NativeMethodAccessorImpl.invoke0 (Native Method)
at jdk.internal.reflect.NativeMethodAccessorImpl.invoke (NativeMethodAccessorImpl.java:62)
at jdk.internal.reflect.DelegatingMethodAccessorImpl.invoke (DelegatingMethodAccessorImpl.java:43)
at java.lang.reflect.Method.invoke (Method.java:566)
at org.codehaus.plexus.classworlds.launcher.Launcher.launchEnhanced (Launcher.java:282)
at org.codehaus.plexus.classworlds.launcher.Launcher.launch (Launcher.java:225)
at org.codehaus.plexus.classworlds.launcher.Launcher.mainWithExitCode (Launcher.java:406)
at org.codehaus.plexus.classworlds.launcher.Launcher.main (Launcher.java:347)
Caused by: org.apache.maven.wagon.providers.http.httpclient.conn.HttpHostConnectException: Connect to localhost:80 [localhost/127.0.0.1, localhost/0:0:0:0:0:0:0:1] failed: Connection refused: connect
at org.apache.maven.wagon.providers.http.httpclient.impl.conn.DefaultHttpClientConnectionOperator.connect (DefaultHttpClientConnectionOperator.java:156)
at org.apache.maven.wagon.providers.http.httpclient.impl.conn.PoolingHttpClientConnectionManager.connect (PoolingHttpClientConnectionManager.java:374)
at org.apache.maven.wagon.providers.http.httpclient.impl.execchain.MainClientExec.establishRoute (MainClientExec.java:393)
at org.apache.maven.wagon.providers.http.httpclient.impl.execchain.MainClientExec.execute (MainClientExec.java:236)
at org.apache.maven.wagon.providers.http.httpclient.impl.execchain.ProtocolExec.execute (ProtocolExec.java:186)
at org.apache.maven.wagon.providers.http.httpclient.impl.execchain.RetryExec.execute (RetryExec.java:89)
at org.apache.maven.wagon.providers.http.httpclient.impl.execchain.RedirectExec.execute (RedirectExec.java:110)
at org.apache.maven.wagon.providers.http.httpclient.impl.client.InternalHttpClient.doExecute (InternalHttpClient.java:185)
at org.apache.maven.wagon.providers.http.httpclient.impl.client.CloseableHttpClient.execute (CloseableHttpClient.java:83)
at org.apache.maven.wagon.providers.http.wagon.shared.AbstractHttpClientWagon.execute (AbstractHttpClientWagon.java:958)
at org.apache.maven.wagon.providers.http.wagon.shared.AbstractHttpClientWagon.fillInputData (AbstractHttpClientWagon.java:1117)
at org.apache.maven.wagon.providers.http.wagon.shared.AbstractHttpClientWagon.fillInputData (AbstractHttpClientWagon.java:1094)
at org.apache.maven.wagon.StreamWagon.getInputStream (StreamWagon.java:126)
at org.apache.maven.wagon.StreamWagon.getIfNewer (StreamWagon.java:88)
at org.apache.maven.wagon.StreamWagon.get (StreamWagon.java:61)
at org.eclipse.aether.transport.wagon.WagonTransporter$GetTaskRunner.run (WagonTransporter.java:567)
at org.eclipse.aether.transport.wagon.WagonTransporter.execute (WagonTransporter.java:435)
at org.eclipse.aether.transport.wagon.WagonTransporter.get (WagonTransporter.java:412)
at org.eclipse.aether.connector.basic.BasicRepositoryConnector$GetTaskRunner.runTask (BasicRepositoryConnector.java:456)
at org.eclipse.aether.connector.basic.BasicRepositoryConnector$TaskRunner.run (BasicRepositoryConnector.java:363)
at org.eclipse.aether.util.concurrency.RunnableErrorForwarder$1.run (RunnableErrorForwarder.java:75)
at org.eclipse.aether.connector.basic.BasicRepositoryConnector$DirectExecutor.execute (BasicRepositoryConnector.java:642)
at org.eclipse.aether.connector.basic.BasicRepositoryConnector.get (BasicRepositoryConnector.java:262)
at org.eclipse.aether.internal.impl.DefaultArtifactResolver.performDownloads (DefaultArtifactResolver.java:499)
at org.eclipse.aether.internal.impl.DefaultArtifactResolver.resolve (DefaultArtifactResolver.java:400)
at org.eclipse.aether.internal.impl.DefaultArtifactResolver.resolveArtifacts (DefaultArtifactResolver.java:225)
at org.eclipse.aether.internal.impl.DefaultArtifactResolver.resolveArtifact (DefaultArtifactResolver.java:202)
at org.apache.maven.repository.internal.DefaultArtifactDescriptorReader.loadPom (DefaultArtifactDescriptorReader.java:240)
at org.apache.maven.repository.internal.DefaultArtifactDescriptorReader.readArtifactDescriptor (DefaultArtifactDescriptorReader.java:171)
at org.eclipse.aether.internal.impl.collect.DefaultDependencyCollector.resolveCachedArtifactDescriptor (DefaultDependencyCollector.java:530)
at org.eclipse.aether.internal.impl.collect.DefaultDependencyCollector.getArtifactDescriptorResult (DefaultDependencyCollector.java:515)
at org.eclipse.aether.internal.impl.collect.DefaultDependencyCollector.processDependency (DefaultDependencyCollector.java:403)
at org.eclipse.aether.internal.impl.collect.DefaultDependencyCollector.processDependency (DefaultDependencyCollector.java:356)
at org.eclipse.aether.internal.impl.collect.DefaultDependencyCollector.process (DefaultDependencyCollector.java:344)
at org.eclipse.aether.internal.impl.collect.DefaultDependencyCollector.collectDependencies (DefaultDependencyCollector.java:247)
at org.eclipse.aether.internal.impl.DefaultRepositorySystem.collectDependencies (DefaultRepositorySystem.java:279)
at org.apache.maven.project.DefaultProjectDependenciesResolver.resolve (DefaultProjectDependenciesResolver.java:169)
at org.apache.maven.lifecycle.internal.LifecycleDependencyResolver.getDependencies (LifecycleDependencyResolver.java:243)
at org.apache.maven.lifecycle.internal.LifecycleDependencyResolver.resolveProjectDependencies (LifecycleDependencyResolver.java:147)
at org.apache.maven.lifecycle.internal.MojoExecutor.ensureDependenciesAreResolved (MojoExecutor.java:248)
at org.apache.maven.lifecycle.internal.MojoExecutor.execute (MojoExecutor.java:202)
at org.apache.maven.lifecycle.internal.MojoExecutor.execute (MojoExecutor.java:156)
at org.apache.maven.lifecycle.internal.MojoExecutor.execute (MojoExecutor.java:148)
at org.apache.maven.lifecycle.internal.LifecycleModuleBuilder.buildProject (LifecycleModuleBuilder.java:117)
at org.apache.maven.lifecycle.internal.LifecycleModuleBuilder.buildProject (LifecycleModuleBuilder.java:81)
at org.apache.maven.lifecycle.internal.builder.singlethreaded.SingleThreadedBuilder.build (SingleThreadedBuilder.java:56)
at org.apache.maven.lifecycle.internal.LifecycleStarter.execute (LifecycleStarter.java:128)
at org.apache.maven.DefaultMaven.doExecute (DefaultMaven.java:305)
at org.apache.maven.DefaultMaven.doExecute (DefaultMaven.java:192)
at org.apache.maven.DefaultMaven.execute (DefaultMaven.java:105)
at org.apache.maven.cli.MavenCli.execute (MavenCli.java:956)
at org.apache.maven.cli.MavenCli.doMain (MavenCli.java:288)
at org.apache.maven.cli.MavenCli.main (MavenCli.java:192)
at jdk.internal.reflect.NativeMethodAccessorImpl.invoke0 (Native Method)
at jdk.internal.reflect.NativeMethodAccessorImpl.invoke (NativeMethodAccessorImpl.java:62)
at jdk.internal.reflect.DelegatingMethodAccessorImpl.invoke (DelegatingMethodAccessorImpl.java:43)
at java.lang.reflect.Method.invoke (Method.java:566)
at org.codehaus.plexus.classworlds.launcher.Launcher.launchEnhanced (Launcher.java:282)
at org.codehaus.plexus.classworlds.launcher.Launcher.launch (Launcher.java:225)
at org.codehaus.plexus.classworlds.launcher.Launcher.mainWithExitCode (Launcher.java:406)
at org.codehaus.plexus.classworlds.launcher.Launcher.main (Launcher.java:347)
Caused by: java.net.ConnectException: Connection refused: connect
at java.net.PlainSocketImpl.connect0 (Native Method)
at java.net.PlainSocketImpl.socketConnect (PlainSocketImpl.java:101)
at java.net.AbstractPlainSocketImpl.doConnect (AbstractPlainSocketImpl.java:399)
at java.net.AbstractPlainSocketImpl.connectToAddress (AbstractPlainSocketImpl.java:242)
at java.net.AbstractPlainSocketImpl.connect (AbstractPlainSocketImpl.java:224)
at java.net.SocksSocketImpl.connect (SocksSocketImpl.java:403)
at java.net.Socket.connect (Socket.java:591)
at org.apache.maven.wagon.providers.http.httpclient.conn.socket.PlainConnectionSocketFactory.connectSocket (PlainConnectionSocketFactory.java:75)
at org.apache.maven.wagon.providers.http.httpclient.impl.conn.DefaultHttpClientConnectionOperator.connect (DefaultHttpClientConnectionOperator.java:142)
at org.apache.maven.wagon.providers.http.httpclient.impl.conn.PoolingHttpClientConnectionManager.connect (PoolingHttpClientConnectionManager.java:374)
at org.apache.maven.wagon.providers.http.httpclient.impl.execchain.MainClientExec.establishRoute (MainClientExec.java:393)
at org.apache.maven.wagon.providers.http.httpclient.impl.execchain.MainClientExec.execute (MainClientExec.java:236)
at org.apache.maven.wagon.providers.http.httpclient.impl.execchain.ProtocolExec.execute (ProtocolExec.java:186)
at org.apache.maven.wagon.providers.http.httpclient.impl.execchain.RetryExec.execute (RetryExec.java:89)
at org.apache.maven.wagon.providers.http.httpclient.impl.execchain.RedirectExec.execute (RedirectExec.java:110)
at org.apache.maven.wagon.providers.http.httpclient.impl.client.InternalHttpClient.doExecute (InternalHttpClient.java:185)
at org.apache.maven.wagon.providers.http.httpclient.impl.client.CloseableHttpClient.execute (CloseableHttpClient.java:83)
at org.apache.maven.wagon.providers.http.wagon.shared.AbstractHttpClientWagon.execute (AbstractHttpClientWagon.java:958)
at org.apache.maven.wagon.providers.http.wagon.shared.AbstractHttpClientWagon.fillInputData (AbstractHttpClientWagon.java:1117)
at org.apache.maven.wagon.providers.http.wagon.shared.AbstractHttpClientWagon.fillInputData (AbstractHttpClientWagon.java:1094)
at org.apache.maven.wagon.StreamWagon.getInputStream (StreamWagon.java:126)
at org.apache.maven.wagon.StreamWagon.getIfNewer (StreamWagon.java:88)
at org.apache.maven.wagon.StreamWagon.get (StreamWagon.java:61)
at org.eclipse.aether.transport.wagon.WagonTransporter$GetTaskRunner.run (WagonTransporter.java:567)
at org.eclipse.aether.transport.wagon.WagonTransporter.execute (WagonTransporter.java:435)
at org.eclipse.aether.transport.wagon.WagonTransporter.get (WagonTransporter.java:412)
at org.eclipse.aether.connector.basic.BasicRepositoryConnector$GetTaskRunner.runTask (BasicRepositoryConnector.java:456)
at org.eclipse.aether.connector.basic.BasicRepositoryConnector$TaskRunner.run (BasicRepositoryConnector.java:363)
at org.eclipse.aether.util.concurrency.RunnableErrorForwarder$1.run (RunnableErrorForwarder.java:75)
at org.eclipse.aether.connector.basic.BasicRepositoryConnector$DirectExecutor.execute (BasicRepositoryConnector.java:642)
at org.eclipse.aether.connector.basic.BasicRepositoryConnector.get (BasicRepositoryConnector.java:262)
at org.eclipse.aether.internal.impl.DefaultArtifactResolver.performDownloads (DefaultArtifactResolver.java:499)
at org.eclipse.aether.internal.impl.DefaultArtifactResolver.resolve (DefaultArtifactResolver.java:400)
at org.eclipse.aether.internal.impl.DefaultArtifactResolver.resolveArtifacts (DefaultArtifactResolver.java:225)
at org.eclipse.aether.internal.impl.DefaultArtifactResolver.resolveArtifact (DefaultArtifactResolver.java:202)
at org.apache.maven.repository.internal.DefaultArtifactDescriptorReader.loadPom (DefaultArtifactDescriptorReader.java:240)
at org.apache.maven.repository.internal.DefaultArtifactDescriptorReader.readArtifactDescriptor (DefaultArtifactDescriptorReader.java:171)
at org.eclipse.aether.internal.impl.collect.DefaultDependencyCollector.resolveCachedArtifactDescriptor (DefaultDependencyCollector.java:530)
at org.eclipse.aether.internal.impl.collect.DefaultDependencyCollector.getArtifactDescriptorResult (DefaultDependencyCollector.java:515)
at org.eclipse.aether.internal.impl.collect.DefaultDependencyCollector.processDependency (DefaultDependencyCollector.java:403)
at org.eclipse.aether.internal.impl.collect.DefaultDependencyCollector.processDependency (DefaultDependencyCollector.java:356)
at org.eclipse.aether.internal.impl.collect.DefaultDependencyCollector.process (DefaultDependencyCollector.java:344)
at org.eclipse.aether.internal.impl.collect.DefaultDependencyCollector.collectDependencies (DefaultDependencyCollector.java:247)
at org.eclipse.aether.internal.impl.DefaultRepositorySystem.collectDependencies (DefaultRepositorySystem.java:279)
at org.apache.maven.project.DefaultProjectDependenciesResolver.resolve (DefaultProjectDependenciesResolver.java:169)
at org.apache.maven.lifecycle.internal.LifecycleDependencyResolver.getDependencies (LifecycleDependencyResolver.java:243)
at org.apache.maven.lifecycle.internal.LifecycleDependencyResolver.resolveProjectDependencies (LifecycleDependencyResolver.java:147)
at org.apache.maven.lifecycle.internal.MojoExecutor.ensureDependenciesAreResolved (MojoExecutor.java:248)
at org.apache.maven.lifecycle.internal.MojoExecutor.execute (MojoExecutor.java:202)
at org.apache.maven.lifecycle.internal.MojoExecutor.execute (MojoExecutor.java:156)
at org.apache.maven.lifecycle.internal.MojoExecutor.execute (MojoExecutor.java:148)
at org.apache.maven.lifecycle.internal.LifecycleModuleBuilder.buildProject (LifecycleModuleBuilder.java:117)
at org.apache.maven.lifecycle.internal.LifecycleModuleBuilder.buildProject (LifecycleModuleBuilder.java:81)
at org.apache.maven.lifecycle.internal.builder.singlethreaded.SingleThreadedBuilder.build (SingleThreadedBuilder.java:56)
at org.apache.maven.lifecycle.internal.LifecycleStarter.execute (LifecycleStarter.java:128)
at org.apache.maven.DefaultMaven.doExecute (DefaultMaven.java:305)
at org.apache.maven.DefaultMaven.doExecute (DefaultMaven.java:192)
at org.apache.maven.DefaultMaven.execute (DefaultMaven.java:105)
at org.apache.maven.cli.MavenCli.execute (MavenCli.java:956)
at org.apache.maven.cli.MavenCli.doMain (MavenCli.java:288)
at org.apache.maven.cli.MavenCli.main (MavenCli.java:192)
at jdk.internal.reflect.NativeMethodAccessorImpl.invoke0 (Native Method)
at jdk.internal.reflect.NativeMethodAccessorImpl.invoke (NativeMethodAccessorImpl.java:62)
at jdk.internal.reflect.DelegatingMethodAccessorImpl.invoke (DelegatingMethodAccessorImpl.java:43)
at java.lang.reflect.Method.invoke (Method.java:566)
at org.codehaus.plexus.classworlds.launcher.Launcher.launchEnhanced (Launcher.java:282)
at org.codehaus.plexus.classworlds.launcher.Launcher.launch (Launcher.java:225)
at org.codehaus.plexus.classworlds.launcher.Launcher.mainWithExitCode (Launcher.java:406)
at org.codehaus.plexus.classworlds.launcher.Launcher.main (Launcher.java:347)
[ERROR]
[ERROR] Re-run Maven using the -X switch to enable full debug logging.
[ERROR]
[ERROR] For more information about the errors and possible solutions, please read the following articles:
[ERROR] [Help 1] http://cwiki.apache.org/confluence/display/MAVEN/DependencyResolutionException
at org.apache.maven.it.MavenITmng5280SettingsProfilesRepositoriesOrderTest.testRepositoriesOrder(MavenITmng5280SettingsProfilesRepositoriesOrderTest.java:102)
FAILED: org.apache.maven.it.MavenITmng4387QuietLoggingTest.windows-jdk11 / Run ITs Windows Java 11 / testit
Error Message:
expected:<[]> but was:<[Picked up JAVA_TOOL_OPTIONS: -Dmaven.ext.class.path="c:\mvn-it-2.tmp@tmp\withMavenbafc2b1a\pipeline-maven-spy.jar" -Dorg.jenkinsci.plugins.pipeline.maven.reportsFolder="c:\mvn-it-2.tmp@tmp\withMavenbafc2b1a" , WARNING: An illegal reflective access operation has occurred, WARNING: Illegal reflective access by org.apache.maven.model.interpolation.StringSearchModelInterpolator$InterpolateObjectAction$CacheField (file:/C:/mvn-it-2.tmp/core-it-suite/target/apache-maven/bin/../lib/maven-model-builder-3.6.2-SNAPSHOT.jar) to field java.io.File.fs, WARNING: Please consider reporting this to the maintainers of org.apache.maven.model.interpolation.StringSearchModelInterpolator$InterpolateObjectAction$CacheField, WARNING: Use --illegal-access=warn to enable warnings of further illegal reflective access operations, WARNING: All illegal access operations will be denied in a future release]>
Stack Trace:
junit.framework.AssertionFailedError: expected:<[]> but was:<[Picked up JAVA_TOOL_OPTIONS: -Dmaven.ext.class.path="c:\mvn-it-2.tmp@tmp\withMavenbafc2b1a\pipeline-maven-spy.jar" -Dorg.jenkinsci.plugins.pipeline.maven.reportsFolder="c:\mvn-it-2.tmp@tmp\withMavenbafc2b1a" , WARNING: An illegal reflective access operation has occurred, WARNING: Illegal reflective access by org.apache.maven.model.interpolation.StringSearchModelInterpolator$InterpolateObjectAction$CacheField (file:/C:/mvn-it-2.tmp/core-it-suite/target/apache-maven/bin/../lib/maven-model-builder-3.6.2-SNAPSHOT.jar) to field java.io.File.fs, WARNING: Please consider reporting this to the maintainers of org.apache.maven.model.interpolation.StringSearchModelInterpolator$InterpolateObjectAction$CacheField, WARNING: Use --illegal-access=warn to enable warnings of further illegal reflective access operations, WARNING: All illegal access operations will be denied in a future release]>
at org.apache.maven.it.MavenITmng4387QuietLoggingTest.testit(MavenITmng4387QuietLoggingTest.java:71)
FAILED: org.apache.maven.it.MavenITmng3183LoggingToFileTest.windows-jdk11 / Run ITs Windows Java 11 / testit
Error Message:
expected:<[]> but was:<[Picked up JAVA_TOOL_OPTIONS: -Dmaven.ext.class.path="c:\mvn-it-2.tmp@tmp\withMavenbafc2b1a\pipeline-maven-spy.jar" -Dorg.jenkinsci.plugins.pipeline.maven.reportsFolder="c:\mvn-it-2.tmp@tmp\withMavenbafc2b1a" , WARNING: An illegal reflective access operation has occurred, WARNING: Illegal reflective access by org.apache.maven.model.interpolation.StringSearchModelInterpolator$InterpolateObjectAction$CacheField (file:/C:/mvn-it-2.tmp/core-it-suite/target/apache-maven/bin/../lib/maven-model-builder-3.6.2-SNAPSHOT.jar) to field java.io.File.fs, WARNING: Please consider reporting this to the maintainers of org.apache.maven.model.interpolation.StringSearchModelInterpolator$InterpolateObjectAction$CacheField, WARNING: Use --illegal-access=warn to enable warnings of further illegal reflective access operations, WARNING: All illegal access operations will be denied in a future release]>
Stack Trace:
junit.framework.AssertionFailedError: expected:<[]> but was:<[Picked up JAVA_TOOL_OPTIONS: -Dmaven.ext.class.path="c:\mvn-it-2.tmp@tmp\withMavenbafc2b1a\pipeline-maven-spy.jar" -Dorg.jenkinsci.plugins.pipeline.maven.reportsFolder="c:\mvn-it-2.tmp@tmp\withMavenbafc2b1a" , WARNING: An illegal reflective access operation has occurred, WARNING: Illegal reflective access by org.apache.maven.model.interpolation.StringSearchModelInterpolator$InterpolateObjectAction$CacheField (file:/C:/mvn-it-2.tmp/core-it-suite/target/apache-maven/bin/../lib/maven-model-builder-3.6.2-SNAPSHOT.jar) to field java.io.File.fs, WARNING: Please consider reporting this to the maintainers of org.apache.maven.model.interpolation.StringSearchModelInterpolator$InterpolateObjectAction$CacheField, WARNING: Use --illegal-access=warn to enable warnings of further illegal reflective access operations, WARNING: All illegal access operations will be denied in a future release]>
at org.apache.maven.it.MavenITmng3183LoggingToFileTest.testit(MavenITmng3183LoggingToFileTest.java:74)
FAILED: org.apache.maven.it.MavenITmng4387QuietLoggingTest.windows-jdk7 / Run ITs Windows Java 7 / testit
Error Message:
expected:<[]> but was:<[Picked up JAVA_TOOL_OPTIONS: -Dmaven.ext.class.path="c:\mvn-it-1.tmp@tmp\withMaven734aa457\pipeline-maven-spy.jar" -Dorg.jenkinsci.plugins.pipeline.maven.reportsFolder="c:\mvn-it-1.tmp@tmp\withMaven734aa457" ]>
Stack Trace:
junit.framework.AssertionFailedError: expected:<[]> but was:<[Picked up JAVA_TOOL_OPTIONS: -Dmaven.ext.class.path="c:\mvn-it-1.tmp@tmp\withMaven734aa457\pipeline-maven-spy.jar" -Dorg.jenkinsci.plugins.pipeline.maven.reportsFolder="c:\mvn-it-1.tmp@tmp\withMaven734aa457" ]>
at org.apache.maven.it.MavenITmng4387QuietLoggingTest.testit(MavenITmng4387QuietLoggingTest.java:71)
FAILED: org.apache.maven.it.MavenITmng3183LoggingToFileTest.windows-jdk7 / Run ITs Windows Java 7 / testit
Error Message:
expected:<[]> but was:<[Picked up JAVA_TOOL_OPTIONS: -Dmaven.ext.class.path="c:\mvn-it-1.tmp@tmp\withMaven734aa457\pipeline-maven-spy.jar" -Dorg.jenkinsci.plugins.pipeline.maven.reportsFolder="c:\mvn-it-1.tmp@tmp\withMaven734aa457" ]>
Stack Trace:
junit.framework.AssertionFailedError: expected:<[]> but was:<[Picked up JAVA_TOOL_OPTIONS: -Dmaven.ext.class.path="c:\mvn-it-1.tmp@tmp\withMaven734aa457\pipeline-maven-spy.jar" -Dorg.jenkinsci.plugins.pipeline.maven.reportsFolder="c:\mvn-it-1.tmp@tmp\withMaven734aa457" ]>
at org.apache.maven.it.MavenITmng3183LoggingToFileTest.testit(MavenITmng3183LoggingToFileTest.java:74)
FAILED: org.apache.maven.it.MavenITmng6720FailFastTest.windows-jdk8 / Run ITs Windows Java 8 / testItShouldWaitForConcurrentModulesToFinish
Error Message:
null
Stack Trace:
junit.framework.AssertionFailedError
at org.apache.maven.it.MavenITmng6720FailFastTest.testItShouldWaitForConcurrentModulesToFinish(MavenITmng6720FailFastTest.java:67)
FAILED: org.apache.maven.it.MavenITmng6720FailFastTest.windows-jdk12 / Run ITs Windows Java 12 / testItShouldWaitForConcurrentModulesToFinish
Error Message:
null
Stack Trace:
junit.framework.AssertionFailedError
at org.apache.maven.it.MavenITmng6720FailFastTest.testItShouldWaitForConcurrentModulesToFinish(MavenITmng6720FailFastTest.java:67)
FAILED: org.apache.maven.it.MavenITmng5576CdFriendlyVersions.windows-jdk12 / Run ITs Windows Java 12 / testContinuousDeliveryFriendlyVersionsAreWarningFree
Error Message:
WARNING: An illegal reflective access operation has occurred
Stack Trace:
junit.framework.AssertionFailedError: WARNING: An illegal reflective access operation has occurred
at org.apache.maven.it.MavenITmng5576CdFriendlyVersions.testContinuousDeliveryFriendlyVersionsAreWarningFree(MavenITmng5576CdFriendlyVersions.java:65)
FAILED: org.apache.maven.it.MavenITmng6720FailFastTest.windows-jdk11 / Run ITs Windows Java 11 / testItShouldWaitForConcurrentModulesToFinish
Error Message:
null
Stack Trace:
junit.framework.AssertionFailedError
at org.apache.maven.it.MavenITmng6720FailFastTest.testItShouldWaitForConcurrentModulesToFinish(MavenITmng6720FailFastTest.java:67)
FAILED: org.apache.maven.it.MavenITmng5576CdFriendlyVersions.windows-jdk11 / Run ITs Windows Java 11 / testContinuousDeliveryFriendlyVersionsAreWarningFree
Error Message:
WARNING: An illegal reflective access operation has occurred
Stack Trace:
junit.framework.AssertionFailedError: WARNING: An illegal reflective access operation has occurred
at org.apache.maven.it.MavenITmng5576CdFriendlyVersions.testContinuousDeliveryFriendlyVersionsAreWarningFree(MavenITmng5576CdFriendlyVersions.java:65)
FAILED: org.apache.maven.it.MavenITmng6720FailFastTest.windows-jdk7 / Run ITs Windows Java 7 / testItShouldWaitForConcurrentModulesToFinish
Error Message:
null
Stack Trace:
junit.framework.AssertionFailedError
at org.apache.maven.it.MavenITmng6720FailFastTest.testItShouldWaitForConcurrentModulesToFinish(MavenITmng6720FailFastTest.java:67)
Build log:
[...truncated 67258 lines...]
mng0956ComponentInjectionViaProjectLevelPluginDep(itMNG0956)OK (3.2 s)
mng0947OptionalDependency(it)...............................OK (3.5 s)
mng0870ReactorAwarePluginDiscovery(itMNG0870)...............OK (3.1 s)
mng0866EvaluateDefaultValue(itMNG866).......................OK (3.3 s)
mng0848SystemPropOverridesDefaultValue(itMNG848)............OK (3.0 s)
mng0836PluginParentResolution(itMNG836).....................OK (3.3 s)
mng0823MojoContextPassing(itMNG0823)........................OK (2.9 s)
mng0820ConflictResolution(itMNG0820)........................OK (3.4 s)
mng0818WarDepsNotTransitive(itMNG0818)......................OK (3.2 s)
mng0814ExplicitProfileActivation(itMNG814)..................OK (2.9 s)
mng0786ProfileAwareReactor(itMNG0786).......................OK (2.8 s)
mng0781PluginConfigVsExecConfig(itMNG0781)..................OK (3.1 s)
mng0773SettingsProfileReactorPollution(itMNG773)............OK (2.8 s)
mng0768OfflineMode(itMNG768)................................OK (9.5 s)
mng0761MissingSnapshotDistRepo(itMNG761)....................OK (3.3 s)
mng0731LegacyRepoLayout(itMNG731)...........................SKIPPED - Maven version 3.6.2-SNAPSHOT not in range [2.0,3.0-alpha-3)
mng0680ParentBasedir(itMNG680)..............................OK (3.0 s)
mng0674PluginParameterAlias(itLifecycle)....................OK (3.2 s)
mng0674PluginParameterAlias(itCli)..........................OK (2.9 s)
mng0666IgnoreLegacyPom(itMNG666)............................OK (3.4 s)
mng0557UserSettingsCliOption(itMNG557)......................OK (3.3 s)
mng0553SettingsAuthzEncryption(itEncryption)................OK (5.5 s)
mng0553SettingsAuthzEncryption(itBasic).....................OK (4.2 s)
mng0553SettingsAuthzEncryption(itRelocation)................OK (4.0 s)
mng0522InheritedPluginMgmtConfig(itMNG522)..................OK (2.9 s)
mng0507ArtifactRelocation(itMNG507).........................OK (3.8 s)
mng0505VersionRange(itMNG505)...............................OK (3.5 s)
mng0496IgnoreUnknownPluginParameters(itMNG496)..............OK (2.9 s)
mng0479OverrideCentralRepo(itResolution)....................OK (11.9 s)
mng0479OverrideCentralRepo(itModel).........................OK (6.2 s)
mng0471CustomLifecycle(itMNG471)............................OK (3.0 s)
mng0469ReportConfig(itBuildConfigDominantDuringBuild).......OK (3.3 s)
mng0469ReportConfig(itReportConfigOverridesBuildDefaults)...SKIPPED - Maven version 3.6.2-SNAPSHOT not in range [2.0.0,3.0-alpha-1)
mng0469ReportConfig(itBuildConfigIrrelevantForReports)......OK (3.2 s)
mng0461TolerateMissingDependencyPom(it).....................OK (3.1 s)
mng0449PluginVersionResolution(itCliInvocation).............OK (3.2 s)
mng0449PluginVersionResolution(itLifecycleInvocation).......OK (3.3 s)
mng0377PluginLookupFromPrefix(itMNG377).....................OK (3.6 s)
mng0294MergeGlobalAndUserSettings(itMNG294).................OK (2.6 s)
mng0282NonReactorExecWhenProjectIndependent(itMNG282).......OK (3.1 s)
mng0249ResolveDepsFromReactor(itMNG0249)....................OK (3.5 s)
mng0187CollectedProjects(it)................................OK (3.0 s)
mng0095ReactorFailureBehavior(itFailAtEnd)..................OK (3.2 s)
mng0095ReactorFailureBehavior(itFailNever)..................OK (3.4 s)
mng0095ReactorFailureBehavior(itFailFast)...................OK (3.1 s)
0145ReactorWithIncludesExcludes(itCustomExcludes)...........SKIPPED - Maven version 3.6.2-SNAPSHOT not in range [2.0,3.0-alpha-1)
0145ReactorWithIncludesExcludes(itDefaultIncludesExcludes)..SKIPPED - Maven version 3.6.2-SNAPSHOT not in range [2.0,3.0-alpha-1)
0145ReactorWithIncludesExcludes(itCustomIncludes)...........SKIPPED - Maven version 3.6.2-SNAPSHOT not in range [2.0,3.0-alpha-1)
0144LifecycleExecutionOrder(it0144).........................OK (4.1 s)
0143TransitiveDependencyScopes(itCompileScope)..............OK (3.6 s)
0143TransitiveDependencyScopes(itRuntimeScope)..............OK (3.4 s)
0143TransitiveDependencyScopes(itTestScope).................OK (3.6 s)
0143TransitiveDependencyScopes(itProvidedScope).............OK (3.5 s)
0142DirectDependencyScopes(it0142)..........................OK (3.7 s)
0140InterpolationWithPomPrefix(it0140)......................OK (3.0 s)
0139InterpolationWithProjectPrefix(it0139)..................OK (3.0 s)
0138PluginLifecycle(it0138).................................OK (3.8 s)
0137EarLifecycle(it0137)....................................OK (3.5 s)
0136RarLifecycle(it0136)....................................OK (3.8 s)
0135EjbLifecycle(it0135)....................................OK (3.7 s)
0134WarLifecycle(it0134)....................................OK (3.5 s)
0133JarLifecycle(it0133)....................................OK (3.4 s)
0132PomLifecycle(it0132)....................................OK (3.1 s)
0131SiteLifecycle(it0131)...................................OK (3.3 s)
0130CleanLifecycle(it0130)..................................OK (3.1 s)
0113ServerAuthzAvailableToWagonMgrInPlugin(it0113)..........OK (3.2 s)
0090EnvVarInterpolation(it0090).............................OK (3.3 s)
0087PluginRealmWithProjectLevelDeps(it0087).................OK (3.3 s)
0086PluginRealm(it0086).....................................OK (3.3 s)
0085TransitiveSystemScope(it0085)...........................OK (3.5 s)
0072InterpolationWithDottedProperty(it0072).................OK (3.0 s)
0071PluginConfigWithDottedProperty(it0071)..................OK (3.2 s)
0064MojoConfigViaSetters(it0064)............................OK (3.0 s)
0063SystemScopeDependency(it0063)...........................OK (3.3 s)
0056MultipleGoalExecutions(it0056)..........................OK (3.0 s)
0052ReleaseProfile(it0052)..................................OK (3.4 s)
0051ReleaseProfile(it0051)..................................OK (3.5 s)
0041ArtifactTypeFromPluginExtension(it0041).................OK (3.8 s)
0040PackagingFromPluginExtension(it0040)....................OK (3.0 s)
0039ReleasePomInReactor(it0039).............................SKIPPED - Maven version 3.6.2-SNAPSHOT not in range [2.0,3.0-alpha-1)
0038AlternatePomFileDifferentDir(it0038)....................OK (3.2 s)
0037AlternatePomFileSameDir(it0037).........................OK (2.8 s)
0036ReleasePom(it0036)......................................SKIPPED - Maven version 3.6.2-SNAPSHOT not in range (2.0,3.0-alpha-1)
0032MavenPrerequisite(it0032)...............................OK (2.6 s)
0030DepPomDepMngtInheritance(it0030)........................OK (5.6 s)
0025MultipleExecutionLevelConfigs(it0025)...................OK (3.1 s)
0024MultipleGoalExecutions(it0024)..........................OK (2.8 s)
0023SettingsProfile(it0023).................................OK (2.8 s)
0021PomProfile(it0021)......................................OK (3.0 s)
0019PluginVersionMngtBySuperPom(it0019).....................OK (3.5 s)
0018DependencyManagement(it0018)............................OK (3.4 s)
0012PomInterpolation(it0012)................................OK (3.3 s)
0011DefaultVersionByDependencyManagement(it0011)............OK (3.4 s)
0010DependencyClosureResolution(it0010).....................OK (3.2 s)
0009GoalConfiguration(it0009)...............................OK (3.0 s)
0008SimplePlugin(it0008)....................................OK (3.1 s)
mng6210CoreExtensionsCustomScopes(CoreExtensionCustomScopes)OK (3.7 s)
mng6352PrintVersion(itShouldPrintVersionAtTopAndAtBottom)...SKIPPED - Maven version 3.6.2-SNAPSHOT not in range [3.5.3-SNAPSHOT,3.5.4-SNAPSHOT]
mng6352PrintVersion(itShouldPrintVersionInAllLines).........SKIPPED - Maven version 3.6.2-SNAPSHOT not in range [3.5.3-SNAPSHOT,3.5.4-SNAPSHOT]
mng6391PrintVersion(itShouldPrintVersionAtTopAndAtBottom)...OK (3.0 s)
mng6391PrintVersion(itShouldPrintVersionInAllLines).........OK (2.9 s)
mng6558ToolchainsBuildingEvent(it)..........................OK (2.9 s)
[ERROR] Tests run: 818, Failures: 3, Errors: 0, Skipped: 0, Time elapsed: 3,141.885 s <<< FAILURE! - in org.apache.maven.it.IntegrationTestSuite
[ERROR] testItShouldWaitForConcurrentModulesToFinish(org.apache.maven.it.MavenITmng6720FailFastTest) Time elapsed: 4.217 s <<< FAILURE!
junit.framework.AssertionFailedError
at org.apache.maven.it.MavenITmng6720FailFastTest.testItShouldWaitForConcurrentModulesToFinish(MavenITmng6720FailFastTest.java:67)
[ERROR] testit(org.apache.maven.it.MavenITmng4387QuietLoggingTest) Time elapsed: 2.753 s <<< FAILURE!
junit.framework.AssertionFailedError: expected:<[]> but was:<[Picked up JAVA_TOOL_OPTIONS: -Dmaven.ext.class.path="/home/jenkins/jenkins-slave/workspace/maven-box_maven_MNG-6726/test@tmp/withMaven0d9c835a/pipeline-maven-spy.jar" -Dorg.jenkinsci.plugins.pipeline.maven.reportsFolder="/home/jenkins/jenkins-slave/workspace/maven-box_maven_MNG-6726/test@tmp/withMaven0d9c835a" ]>
at org.apache.maven.it.MavenITmng4387QuietLoggingTest.testit(MavenITmng4387QuietLoggingTest.java:71)
[ERROR] testit(org.apache.maven.it.MavenITmng3183LoggingToFileTest) Time elapsed: 2.663 s <<< FAILURE!
junit.framework.AssertionFailedError: expected:<[]> but was:<[Picked up JAVA_TOOL_OPTIONS: -Dmaven.ext.class.path="/home/jenkins/jenkins-slave/workspace/maven-box_maven_MNG-6726/test@tmp/withMaven0d9c835a/pipeline-maven-spy.jar" -Dorg.jenkinsci.plugins.pipeline.maven.reportsFolder="/home/jenkins/jenkins-slave/workspace/maven-box_maven_MNG-6726/test@tmp/withMaven0d9c835a" ]>
at org.apache.maven.it.MavenITmng3183LoggingToFileTest.testit(MavenITmng3183LoggingToFileTest.java:74)
[INFO]
[INFO] Results:
[INFO]
[ERROR] Failures:
[ERROR] MavenITmng3183LoggingToFileTest>AbstractMavenIntegrationTestCase.runTest:227->testit:74 expected:<[]> but was:<[Picked up JAVA_TOOL_OPTIONS: -Dmaven.ext.class.path="/home/jenkins/jenkins-slave/workspace/maven-box_maven_MNG-6726/test@tmp/withMaven0d9c835a/pipeline-maven-spy.jar" -Dorg.jenkinsci.plugins.pipeline.maven.reportsFolder="/home/jenkins/jenkins-slave/workspace/maven-box_maven_MNG-6726/test@tmp/withMaven0d9c835a" ]>
[ERROR] MavenITmng4387QuietLoggingTest>AbstractMavenIntegrationTestCase.runTest:227->testit:71 expected:<[]> but was:<[Picked up JAVA_TOOL_OPTIONS: -Dmaven.ext.class.path="/home/jenkins/jenkins-slave/workspace/maven-box_maven_MNG-6726/test@tmp/withMaven0d9c835a/pipeline-maven-spy.jar" -Dorg.jenkinsci.plugins.pipeline.maven.reportsFolder="/home/jenkins/jenkins-slave/workspace/maven-box_maven_MNG-6726/test@tmp/withMaven0d9c835a" ]>
[ERROR] MavenITmng6720FailFastTest>AbstractMavenIntegrationTestCase.runTest:227->testItShouldWaitForConcurrentModulesToFinish:67
[INFO]
[ERROR] Tests run: 818, Failures: 3, Errors: 0, Skipped: 0
[INFO]
[ERROR] There are test failures.
Please refer to /home/jenkins/jenkins-slave/workspace/maven-box_maven_MNG-6726/test/core-it-suite/target/surefire-reports for the individual test results.
Please refer to dump files (if any exist) [date]-jvmRun[N].dump, [date].dumpstream and [date]-jvmRun[N].dumpstream.
[INFO]
[INFO] --- maven-jar-plugin:3.0.2:jar (default-jar) @ core-it-suite ---
[INFO] Building jar: /home/jenkins/jenkins-slave/workspace/maven-box_maven_MNG-6726/test/core-it-suite/target/core-it-suite-2.1-SNAPSHOT.jar
[INFO]
[INFO] --- maven-site-plugin:3.7:attach-descriptor (attach-descriptor) @ core-it-suite ---
[INFO] Skipping because packaging 'jar' is not pom.
[INFO]
[INFO] --- maven-jar-plugin:3.0.2:test-jar (default) @ core-it-suite ---
[INFO] Building jar: /home/jenkins/jenkins-slave/workspace/maven-box_maven_MNG-6726/test/core-it-suite/target/core-it-suite-2.1-SNAPSHOT-tests.jar
[INFO]
[INFO] --- maven-checkstyle-plugin:3.0.0:check (checkstyle-check) @ core-it-suite ---
[INFO]
[INFO] --- maven-install-plugin:2.5.2:install (default-install) @ core-it-suite ---
[INFO] Installing /home/jenkins/jenkins-slave/workspace/maven-box_maven_MNG-6726/test/core-it-suite/target/core-it-suite-2.1-SNAPSHOT.jar to /home/jenkins/jenkins-slave/workspace/maven-box_maven_MNG-6726/test/it-local-repo/org/apache/maven/its/core-it-suite/2.1-SNAPSHOT/core-it-suite-2.1-SNAPSHOT.jar
[INFO] Installing /home/jenkins/jenkins-slave/workspace/maven-box_maven_MNG-6726/test/core-it-suite/pom.xml to /home/jenkins/jenkins-slave/workspace/maven-box_maven_MNG-6726/test/it-local-repo/org/apache/maven/its/core-it-suite/2.1-SNAPSHOT/core-it-suite-2.1-SNAPSHOT.pom
[INFO] Installing /home/jenkins/jenkins-slave/workspace/maven-box_maven_MNG-6726/test/core-it-suite/target/core-it-suite-2.1-SNAPSHOT-tests.jar to /home/jenkins/jenkins-slave/workspace/maven-box_maven_MNG-6726/test/it-local-repo/org/apache/maven/its/core-it-suite/2.1-SNAPSHOT/core-it-suite-2.1-SNAPSHOT-tests.jar
[INFO] ------------------------------------------------------------------------
[INFO] Reactor Summary:
[INFO]
[INFO] Maven Core ITs 2.1-SNAPSHOT ........................ SUCCESS [ 19.286 s]
[INFO] Maven IT Support 2.1-SNAPSHOT ...................... SUCCESS [ 0.882 s]
[INFO] Maven IT :: Plugins 2.1-SNAPSHOT ................... SUCCESS [ 0.751 s]
[INFO] Maven IT Plugin :: Active Collection 2.1-SNAPSHOT .. SUCCESS [ 5.628 s]
[INFO] Maven IT Plugin :: Ant-Based 2.1-SNAPSHOT .......... SUCCESS [ 2.889 s]
[INFO] Maven IT Plugin :: Artifact 2.1-SNAPSHOT ........... SUCCESS [ 4.293 s]
[INFO] Maven IT Plugin :: Class Loader :: Dependency A 2.1-SNAPSHOT SUCCESS [ 1.953 s]
[INFO] Maven IT Plugin :: Class Loader :: Dependency B 2.1-SNAPSHOT SUCCESS [ 0.803 s]
[INFO] Maven IT Plugin :: Class Loader :: Dependency C 2.1-SNAPSHOT SUCCESS [ 0.583 s]
[INFO] Maven IT Plugin :: Class Loader 2.1-SNAPSHOT ....... SUCCESS [ 2.358 s]
[INFO] Maven IT Plugin :: Class Loader :: Aggregator 2.1-SNAPSHOT SUCCESS [ 0.614 s]
[INFO] Maven IT Plugin :: Configuration 2.1-SNAPSHOT ...... SUCCESS [ 1.486 s]
[INFO] Maven IT Plugin :: Context Passing 2.1-SNAPSHOT .... SUCCESS [ 0.665 s]
[INFO] Maven ITs :: Core Plugin Stubs 2.1-SNAPSHOT ........ SUCCESS [ 0.633 s]
[INFO] Maven IT Clean Plugin Stub 0.1-stub-SNAPSHOT ....... SUCCESS [ 0.950 s]
[INFO] Maven IT Compiler Plugin Stub 0.1-stub-SNAPSHOT .... SUCCESS [ 0.930 s]
[INFO] Maven IT Deploy Plugin Stub 0.1-stub-SNAPSHOT ...... SUCCESS [ 0.936 s]
[INFO] Maven IT EAR Plugin Stub 0.1-stub-SNAPSHOT ......... SUCCESS [ 0.908 s]
[INFO] Maven IT EJB Plugin Stub 0.1-stub-SNAPSHOT ......... SUCCESS [ 0.819 s]
[INFO] Maven IT Install Plugin Stub 0.1-stub-SNAPSHOT ..... SUCCESS [ 0.856 s]
[INFO] Maven IT JAR Plugin Stub 0.1-stub-SNAPSHOT ......... SUCCESS [ 0.789 s]
[INFO] Maven IT Javadoc Plugin Stub 0.1-stub-SNAPSHOT ..... SUCCESS [ 0.773 s]
[INFO] Maven IT Plugin Plugin Stub 0.1-stub-SNAPSHOT ...... SUCCESS [ 0.879 s]
[INFO] Maven IT RAR Plugin Stub 0.1-stub-SNAPSHOT ......... SUCCESS [ 0.749 s]
[INFO] Maven IT Resources Plugin Stub 0.1-stub-SNAPSHOT ... SUCCESS [ 0.795 s]
[INFO] Maven IT Site Plugin Stub 0.1-stub-SNAPSHOT ........ SUCCESS [ 0.751 s]
[INFO] Maven IT Source Plugin Stub 0.1-stub-SNAPSHOT ...... SUCCESS [ 0.870 s]
[INFO] Maven IT Surefire Plugin Stub 0.1-stub-SNAPSHOT .... SUCCESS [ 0.731 s]
[INFO] Maven IT WAR Plugin Stub 0.1-stub-SNAPSHOT ......... SUCCESS [ 0.705 s]
[INFO] Maven IT Plugin :: Dependency Collection 2.1-SNAPSHOT SUCCESS [ 3.362 s]
[INFO] Maven IT Plugin :: Dependency Resolution 2.1-SNAPSHOT SUCCESS [ 3.307 s]
[INFO] Maven IT Plugin :: Expression 2.1-SNAPSHOT ......... SUCCESS [ 1.595 s]
[INFO] Maven IT Plugin :: Error Mojos 2.1-SNAPSHOT ........ SUCCESS [ 1.449 s]
[INFO] Maven IT Component 2.1-SNAPSHOT .................... SUCCESS [ 0.631 s]
[INFO] Maven IT Plugin :: Extension Consumer 2.1-SNAPSHOT . SUCCESS [ 0.738 s]
[INFO] Maven IT Plugin :: Extension Provider 2.1-SNAPSHOT . SUCCESS [ 0.544 s]
[INFO] Maven IT Plugin :: Fork 2.1-SNAPSHOT ............... SUCCESS [ 0.742 s]
[INFO] Maven IT Plugin :: Invalid Descriptor 2.1-SNAPSHOT . SUCCESS [ 0.559 s]
[INFO] Maven IT Plugin :: Log File 2.1-SNAPSHOT ........... SUCCESS [ 0.567 s]
[INFO] Maven IT Helper Library 2.1-SNAPSHOT ............... SUCCESS [ 1.944 s]
[INFO] Maven IT Plugin :: Model Interpolation 2.1-SNAPSHOT SUCCESS [ 1.163 s]
[INFO] Maven IT Plugin :: No Default Component 2.1-SNAPSHOT SUCCESS [ 0.716 s]
[INFO] Maven IT Plugin :: No Project 2.1-SNAPSHOT ......... SUCCESS [ 0.538 s]
[INFO] Maven IT Plugin :: Online 2.1-SNAPSHOT ............. SUCCESS [ 0.592 s]
[INFO] Maven IT Plugin :: Optional Mojos 2.1-SNAPSHOT ..... SUCCESS [ 0.609 s]
[INFO] Maven IT Plugin :: Packaging 2.1-SNAPSHOT .......... SUCCESS [ 0.620 s]
[INFO] Maven IT Plugin :: Parameter Implementation 2.1-SNAPSHOT SUCCESS [ 0.595 s]
[INFO] Maven IT Plugin :: Plugin Dependency 2.1-SNAPSHOT .. SUCCESS [ 0.695 s]
[INFO] Maven IT Plugin :: Project 2.1-SNAPSHOT ............ SUCCESS [ 0.773 s]
[INFO] Maven IT Plugin :: Project Interpolation 2.1-SNAPSHOT SUCCESS [ 0.894 s]
[INFO] Maven IT Plugin :: Setter 2.1-SNAPSHOT ............. SUCCESS [ 0.595 s]
[INFO] Maven IT Plugin :: Singleton Component 2.1-SNAPSHOT SUCCESS [ 2.350 s]
[INFO] Maven IT Plugin :: Site 2.1-SNAPSHOT ............... SUCCESS [ 1.906 s]
[INFO] Maven IT Plugin :: Toolchain 2.1-SNAPSHOT .......... SUCCESS [ 2.524 s]
[INFO] Maven IT Plugin :: Touch 2.1-SNAPSHOT .............. SUCCESS [ 0.748 s]
[INFO] Maven IT Plugin :: Uses Properties Plugin 2.1-SNAPSHOT SUCCESS [ 0.597 s]
[INFO] Maven IT Plugin :: Uses Wagon Plugin 2.1-SNAPSHOT .. SUCCESS [ 1.352 s]
[INFO] Maven IT Plugin :: This plugin should contain the mojos needed by all tests. 2.1-SNAPSHOT SUCCESS [ 0.587 s]
[INFO] Maven IT Plugin :: Plexus Utils 1.1 2.1-SNAPSHOT ... SUCCESS [ 0.601 s]
[INFO] Maven IT Plugin :: Plexus Utils New 2.1-SNAPSHOT ... SUCCESS [ 0.547 s]
[INFO] Maven IT Plugin :: Plexus Component API 2.1-SNAPSHOT SUCCESS [ 0.889 s]
[INFO] Maven IT Plugin :: Log4J Client 2.1-SNAPSHOT ....... SUCCESS [ 0.625 s]
[INFO] Maven IT Plugin :: Extension 1 2.1-SNAPSHOT ........ SUCCESS [ 0.508 s]
[INFO] Maven IT Plugin :: Extension 2 2.1-SNAPSHOT ........ SUCCESS [ 0.523 s]
[INFO] Maven IT Plugin :: Plexus Lifecycle 2.1-SNAPSHOT ... SUCCESS [ 1.198 s]
[INFO] Maven IT Plugin :: Settings 2.1-SNAPSHOT ........... SUCCESS [ 0.824 s]
[INFO] Maven IT Plugin :: mng-5805 extension 2.1-SNAPSHOT . SUCCESS [ 0.525 s]
[INFO] Maven IT Plugin :: mng-5805 extension mk2 2.1-SNAPSHOT SUCCESS [ 0.463 s]
[INFO] Maven IT Plugin :: mng-5805 plugin 2.1-SNAPSHOT .... SUCCESS [ 0.722 s]
[INFO] Maven IT Plugin :: mng-5805 plugin-dep 2.1-SNAPSHOT SUCCESS [ 0.575 s]
[INFO] Maven IT Plugin :: mng-5958 extension 2.1-SNAPSHOT . SUCCESS [ 2.195 s]
[INFO] Maven IT Toolchain 2.1-SNAPSHOT .................... SUCCESS [ 0.979 s]
[INFO] Maven IT Wagon 2.1-SNAPSHOT ........................ SUCCESS [ 0.725 s]
[INFO] Maven IT Support Artifacts 2.1-SNAPSHOT ............ SUCCESS [ 1.494 s]
[INFO] Maven IT Extension 2.1-SNAPSHOT .................... SUCCESS [ 0.482 s]
[INFO] Maven ITs 2.1-SNAPSHOT ............................. SUCCESS [52:39 min]
[INFO] ------------------------------------------------------------------------
[INFO] BUILD SUCCESS
[INFO] ------------------------------------------------------------------------
[INFO] Total time: 54:24 min
[INFO] Finished at: 2019-07-31T00:34:18Z
[INFO] ------------------------------------------------------------------------
[Pipeline] }
[Pipeline] // withMaven
[Pipeline] deleteDir
[Pipeline] }
[Pipeline] // dir
[Pipeline] }
[Pipeline] // stage
[Pipeline] }
[Pipeline] // node
[Pipeline] }
[Pipeline] // parallel
[Pipeline] echo
[FAILURE-003] AbortException hudson.AbortException: script returned exit code 1
[Pipeline] stage
[Pipeline] { (Notifications)
[Pipeline] echo
Build result: FAILURE
[Pipeline] jiraIssueSelector
[Pipeline] emailext
Build failed in Jenkins: Maven TLP » maven » MNG-6726 #5
Posted by Apache Jenkins Server <je...@builds.apache.org>.
See https://builds.apache.org/job/maven-box/job/maven/job/MNG-6726/5/
No changes.
All tests passed
Build log:
[...truncated 48264 lines...]
[INFO] Maven ITs :: Core Plugin Stubs 2.1-SNAPSHOT ........ SUCCESS [ 0.357 s]
[INFO] Maven IT Clean Plugin Stub 0.1-stub-SNAPSHOT ....... SUCCESS [ 0.787 s]
[INFO] Maven IT Compiler Plugin Stub 0.1-stub-SNAPSHOT .... SUCCESS [ 0.961 s]
[INFO] Maven IT Deploy Plugin Stub 0.1-stub-SNAPSHOT ...... SUCCESS [ 0.906 s]
[INFO] Maven IT EAR Plugin Stub 0.1-stub-SNAPSHOT ......... SUCCESS [ 0.947 s]
[INFO] Maven IT EJB Plugin Stub 0.1-stub-SNAPSHOT ......... SUCCESS [ 0.963 s]
[INFO] Maven IT Install Plugin Stub 0.1-stub-SNAPSHOT ..... SUCCESS [ 0.689 s]
[INFO] Maven IT JAR Plugin Stub 0.1-stub-SNAPSHOT ......... SUCCESS [ 0.823 s]
[INFO] Maven IT Javadoc Plugin Stub 0.1-stub-SNAPSHOT ..... SUCCESS [ 0.915 s]
[INFO] Maven IT Plugin Plugin Stub 0.1-stub-SNAPSHOT ...... SUCCESS [ 0.982 s]
[INFO] Maven IT RAR Plugin Stub 0.1-stub-SNAPSHOT ......... SUCCESS [ 0.819 s]
[INFO] Maven IT Resources Plugin Stub 0.1-stub-SNAPSHOT ... SUCCESS [ 1.016 s]
[INFO] Maven IT Site Plugin Stub 0.1-stub-SNAPSHOT ........ SUCCESS [ 0.895 s]
[INFO] Maven IT Source Plugin Stub 0.1-stub-SNAPSHOT ...... SUCCESS [ 0.829 s]
[INFO] Maven IT Surefire Plugin Stub 0.1-stub-SNAPSHOT .... SUCCESS [ 0.884 s]
[INFO] Maven IT WAR Plugin Stub 0.1-stub-SNAPSHOT ......... SUCCESS [ 0.992 s]
[INFO] Maven IT Plugin :: Dependency Collection 2.1-SNAPSHOT SUCCESS [ 0.973 s]
[INFO] Maven IT Plugin :: Dependency Resolution 2.1-SNAPSHOT SUCCESS [ 6.982 s]
[INFO] Maven IT Plugin :: Expression 2.1-SNAPSHOT ......... SUCCESS [ 2.632 s]
[INFO] Maven IT Plugin :: Error Mojos 2.1-SNAPSHOT ........ SUCCESS [ 3.149 s]
[INFO] Maven IT Component 2.1-SNAPSHOT .................... SUCCESS [ 0.676 s]
[INFO] Maven IT Plugin :: Extension Consumer 2.1-SNAPSHOT . SUCCESS [ 0.742 s]
[INFO] Maven IT Plugin :: Extension Provider 2.1-SNAPSHOT . SUCCESS [ 0.723 s]
[INFO] Maven IT Plugin :: Fork 2.1-SNAPSHOT ............... SUCCESS [ 1.043 s]
[INFO] Maven IT Plugin :: Invalid Descriptor 2.1-SNAPSHOT . SUCCESS [ 1.351 s]
[INFO] Maven IT Plugin :: Log File 2.1-SNAPSHOT ........... SUCCESS [ 0.804 s]
[INFO] Maven IT Helper Library 2.1-SNAPSHOT ............... SUCCESS [ 3.500 s]
[INFO] Maven IT Plugin :: Model Interpolation 2.1-SNAPSHOT SUCCESS [ 1.251 s]
[INFO] Maven IT Plugin :: No Default Component 2.1-SNAPSHOT SUCCESS [ 0.885 s]
[INFO] Maven IT Plugin :: No Project 2.1-SNAPSHOT ......... SUCCESS [ 0.732 s]
[INFO] Maven IT Plugin :: Online 2.1-SNAPSHOT ............. SUCCESS [ 0.647 s]
[INFO] Maven IT Plugin :: Optional Mojos 2.1-SNAPSHOT ..... SUCCESS [ 0.868 s]
[INFO] Maven IT Plugin :: Packaging 2.1-SNAPSHOT .......... SUCCESS [ 0.751 s]
[INFO] Maven IT Plugin :: Parameter Implementation 2.1-SNAPSHOT SUCCESS [ 0.789 s]
[INFO] Maven IT Plugin :: Plugin Dependency 2.1-SNAPSHOT .. SUCCESS [ 0.603 s]
[INFO] Maven IT Plugin :: Project 2.1-SNAPSHOT ............ SUCCESS [ 0.952 s]
[INFO] Maven IT Plugin :: Project Interpolation 2.1-SNAPSHOT SUCCESS [ 0.982 s]
[INFO] Maven IT Plugin :: Setter 2.1-SNAPSHOT ............. SUCCESS [ 0.621 s]
[INFO] Maven IT Plugin :: Singleton Component 2.1-SNAPSHOT SUCCESS [ 0.845 s]
[INFO] Maven IT Plugin :: Site 2.1-SNAPSHOT ............... SUCCESS [ 2.071 s]
[INFO] Maven IT Plugin :: Toolchain 2.1-SNAPSHOT .......... SUCCESS [ 6.182 s]
[INFO] Maven IT Plugin :: Touch 2.1-SNAPSHOT .............. SUCCESS [ 1.202 s]
[INFO] Maven IT Plugin :: Uses Properties Plugin 2.1-SNAPSHOT SUCCESS [ 0.670 s]
[INFO] Maven IT Plugin :: Uses Wagon Plugin 2.1-SNAPSHOT .. SUCCESS [ 2.640 s]
[INFO] Maven IT Plugin :: This plugin should contain the mojos needed by all tests. 2.1-SNAPSHOT SUCCESS [ 0.445 s]
[INFO] Maven IT Plugin :: Plexus Utils 1.1 2.1-SNAPSHOT ... SUCCESS [ 0.967 s]
[INFO] Maven IT Plugin :: Plexus Utils New 2.1-SNAPSHOT ... SUCCESS [ 0.727 s]
[INFO] Maven IT Plugin :: Plexus Component API 2.1-SNAPSHOT SUCCESS [ 2.078 s]
[INFO] Maven IT Plugin :: Log4J Client 2.1-SNAPSHOT ....... SUCCESS [ 0.862 s]
[INFO] Maven IT Plugin :: Extension 1 2.1-SNAPSHOT ........ SUCCESS [ 0.644 s]
[INFO] Maven IT Plugin :: Extension 2 2.1-SNAPSHOT ........ SUCCESS [ 1.231 s]
[INFO] Maven IT Plugin :: Plexus Lifecycle 2.1-SNAPSHOT ... SUCCESS [ 3.037 s]
[INFO] Maven IT Plugin :: Settings 2.1-SNAPSHOT ........... SUCCESS [ 0.911 s]
[INFO] Maven IT Plugin :: mng-5805 extension 2.1-SNAPSHOT . SUCCESS [ 0.485 s]
[INFO] Maven IT Plugin :: mng-5805 extension mk2 2.1-SNAPSHOT SUCCESS [ 0.536 s]
[INFO] Maven IT Plugin :: mng-5805 plugin 2.1-SNAPSHOT .... SUCCESS [ 0.784 s]
[INFO] Maven IT Plugin :: mng-5805 plugin-dep 2.1-SNAPSHOT SUCCESS [ 0.578 s]
[INFO] Maven IT Plugin :: mng-5958 extension 2.1-SNAPSHOT . SUCCESS [ 4.890 s]
[INFO] Maven IT Toolchain 2.1-SNAPSHOT .................... SUCCESS [ 1.022 s]
[INFO] Maven IT Wagon 2.1-SNAPSHOT ........................ SUCCESS [ 0.850 s]
[INFO] Maven IT Support Artifacts 2.1-SNAPSHOT ............ SUCCESS [ 3.272 s]
[INFO] Maven IT Extension 2.1-SNAPSHOT .................... SUCCESS [ 0.577 s]
[INFO] Maven ITs 2.1-SNAPSHOT ............................. SUCCESS [51:24 min]
[INFO] ------------------------------------------------------------------------
[INFO] BUILD SUCCESS
[INFO] ------------------------------------------------------------------------
[INFO] Total time: 54:12 min
[INFO] Finished at: 2019-07-31T05:37:00-07:00
[INFO] ------------------------------------------------------------------------
[Pipeline] }
[Pipeline] // withMaven
[Pipeline] deleteDir
0030DepPomDepMngtInheritance(it0030)........................OK (5.3 s)
0025MultipleExecutionLevelConfigs(it0025)...................OK (3.3 s)
0024MultipleGoalExecutions(it0024)..........................OK (2.6 s)
0023SettingsProfile(it0023).................................OK (2.7 s)
0021PomProfile(it0021)......................................OK (3.0 s)
[Pipeline] }
[Pipeline] // dir
[Pipeline] }
[Pipeline] // stage
[Pipeline] }
[Pipeline] // node
[Pipeline] }
0019PluginVersionMngtBySuperPom(it0019).....................OK (3.1 s)
0018DependencyManagement(it0018)............................OK (3.3 s)
0012PomInterpolation(it0012)................................OK (2.7 s)
0011DefaultVersionByDependencyManagement(it0011)............OK (2.9 s)
0010DependencyClosureResolution(it0010).....................OK (3.2 s)
0009GoalConfiguration(it0009)...............................OK (2.6 s)
0008SimplePlugin(it0008)....................................OK (2.6 s)
mng6210CoreExtensionsCustomScopes(CoreExtensionCustomScopes)OK (3.0 s)
mng6352PrintVersion(itShouldPrintVersionAtTopAndAtBottom)...SKIPPED - Maven version 3.6.2-SNAPSHOT not in range [3.5.3-SNAPSHOT,3.5.4-SNAPSHOT]
mng6352PrintVersion(itShouldPrintVersionInAllLines).........SKIPPED - Maven version 3.6.2-SNAPSHOT not in range [3.5.3-SNAPSHOT,3.5.4-SNAPSHOT]
mng6391PrintVersion(itShouldPrintVersionAtTopAndAtBottom)...OK (2.6 s)
mng6391PrintVersion(itShouldPrintVersionInAllLines).........OK (2.5 s)
mng6558ToolchainsBuildingEvent(it)..........................OK (2.6 s)
[ERROR] Tests run: 818, Failures: 4, Errors: 0, Skipped: 0, Time elapsed: 3,055.801 s <<< FAILURE! - in org.apache.maven.it.IntegrationTestSuite
[ERROR] testItShouldWaitForConcurrentModulesToFinish(org.apache.maven.it.MavenITmng6720FailFastTest) Time elapsed: 4.255 s <<< FAILURE!
junit.framework.AssertionFailedError
at org.apache.maven.it.MavenITmng6720FailFastTest.testItShouldWaitForConcurrentModulesToFinish(MavenITmng6720FailFastTest.java:67)
[ERROR] testContinuousDeliveryFriendlyVersionsAreWarningFree(org.apache.maven.it.MavenITmng5576CdFriendlyVersions) Time elapsed: 2.955 s <<< FAILURE!
junit.framework.AssertionFailedError: WARNING: An illegal reflective access operation has occurred
at org.apache.maven.it.MavenITmng5576CdFriendlyVersions.testContinuousDeliveryFriendlyVersionsAreWarningFree(MavenITmng5576CdFriendlyVersions.java:65)
[ERROR] testit(org.apache.maven.it.MavenITmng4387QuietLoggingTest) Time elapsed: 2.644 s <<< FAILURE!
junit.framework.AssertionFailedError: expected:<[]> but was:<[Picked up JAVA_TOOL_OPTIONS: -Dmaven.ext.class.path="c:\mvn-it-0.tmp@tmp\withMaven3603fb7e\pipeline-maven-spy.jar" -Dorg.jenkinsci.plugins.pipeline.maven.reportsFolder="c:\mvn-it-0.tmp@tmp\withMaven3603fb7e" , WARNING: An illegal reflective access operation has occurred, WARNING: Illegal reflective access by org.apache.maven.model.interpolation.StringSearchModelInterpolator$InterpolateObjectAction$CacheField (file:/C:/mvn-it-0.tmp/core-it-suite/target/apache-maven/bin/../lib/maven-model-builder-3.6.2-SNAPSHOT.jar) to field java.io.File.fs, WARNING: Please consider reporting this to the maintainers of org.apache.maven.model.interpolation.StringSearchModelInterpolator$InterpolateObjectAction$CacheField, WARNING: Use --illegal-access=warn to enable warnings of further illegal reflective access operations, WARNING: All illegal access operations will be denied in a future release]>
at org.apache.maven.it.MavenITmng4387QuietLoggingTest.testit(MavenITmng4387QuietLoggingTest.java:71)
[ERROR] testit(org.apache.maven.it.MavenITmng3183LoggingToFileTest) Time elapsed: 2.717 s <<< FAILURE!
junit.framework.AssertionFailedError: expected:<[]> but was:<[Picked up JAVA_TOOL_OPTIONS: -Dmaven.ext.class.path="c:\mvn-it-0.tmp@tmp\withMaven3603fb7e\pipeline-maven-spy.jar" -Dorg.jenkinsci.plugins.pipeline.maven.reportsFolder="c:\mvn-it-0.tmp@tmp\withMaven3603fb7e" , WARNING: An illegal reflective access operation has occurred, WARNING: Illegal reflective access by org.apache.maven.model.interpolation.StringSearchModelInterpolator$InterpolateObjectAction$CacheField (file:/C:/mvn-it-0.tmp/core-it-suite/target/apache-maven/bin/../lib/maven-model-builder-3.6.2-SNAPSHOT.jar) to field java.io.File.fs, WARNING: Please consider reporting this to the maintainers of org.apache.maven.model.interpolation.StringSearchModelInterpolator$InterpolateObjectAction$CacheField, WARNING: Use --illegal-access=warn to enable warnings of further illegal reflective access operations, WARNING: All illegal access operations will be denied in a future release]>
at org.apache.maven.it.MavenITmng3183LoggingToFileTest.testit(MavenITmng3183LoggingToFileTest.java:74)
[INFO]
[INFO] Results:
[INFO]
[ERROR] Failures:
[ERROR] MavenITmng3183LoggingToFileTest>AbstractMavenIntegrationTestCase.runTest:227->testit:74 expected:<[]> but was:<[Picked up JAVA_TOOL_OPTIONS: -Dmaven.ext.class.path="c:\mvn-it-0.tmp@tmp\withMaven3603fb7e\pipeline-maven-spy.jar" -Dorg.jenkinsci.plugins.pipeline.maven.reportsFolder="c:\mvn-it-0.tmp@tmp\withMaven3603fb7e" , WARNING: An illegal reflective access operation has occurred, WARNING: Illegal reflective access by org.apache.maven.model.interpolation.StringSearchModelInterpolator$InterpolateObjectAction$CacheField (file:/C:/mvn-it-0.tmp/core-it-suite/target/apache-maven/bin/../lib/maven-model-builder-3.6.2-SNAPSHOT.jar) to field java.io.File.fs, WARNING: Please consider reporting this to the maintainers of org.apache.maven.model.interpolation.StringSearchModelInterpolator$InterpolateObjectAction$CacheField, WARNING: Use --illegal-access=warn to enable warnings of further illegal reflective access operations, WARNING: All illegal access operations will be denied in a future release]>
[ERROR] MavenITmng4387QuietLoggingTest>AbstractMavenIntegrationTestCase.runTest:227->testit:71 expected:<[]> but was:<[Picked up JAVA_TOOL_OPTIONS: -Dmaven.ext.class.path="c:\mvn-it-0.tmp@tmp\withMaven3603fb7e\pipeline-maven-spy.jar" -Dorg.jenkinsci.plugins.pipeline.maven.reportsFolder="c:\mvn-it-0.tmp@tmp\withMaven3603fb7e" , WARNING: An illegal reflective access operation has occurred, WARNING: Illegal reflective access by org.apache.maven.model.interpolation.StringSearchModelInterpolator$InterpolateObjectAction$CacheField (file:/C:/mvn-it-0.tmp/core-it-suite/target/apache-maven/bin/../lib/maven-model-builder-3.6.2-SNAPSHOT.jar) to field java.io.File.fs, WARNING: Please consider reporting this to the maintainers of org.apache.maven.model.interpolation.StringSearchModelInterpolator$InterpolateObjectAction$CacheField, WARNING: Use --illegal-access=warn to enable warnings of further illegal reflective access operations, WARNING: All illegal access operations will be denied in a future release]>
[ERROR] MavenITmng5576CdFriendlyVersions>AbstractMavenIntegrationTestCase.runTest:227->testContinuousDeliveryFriendlyVersionsAreWarningFree:65 WARNING: An illegal reflective access operation has occurred
[ERROR] MavenITmng6720FailFastTest>AbstractMavenIntegrationTestCase.runTest:227->testItShouldWaitForConcurrentModulesToFinish:67
[INFO]
[ERROR] Tests run: 818, Failures: 4, Errors: 0, Skipped: 0
[INFO]
[ERROR] There are test failures.
Please refer to C:\mvn-it-0.tmp\core-it-suite\target\surefire-reports for the individual test results.
Please refer to dump files (if any exist) [date]-jvmRun[N].dump, [date].dumpstream and [date]-jvmRun[N].dumpstream.
[INFO]
[INFO] --- maven-jar-plugin:3.0.2:jar (default-jar) @ core-it-suite ---
[INFO] Building jar: C:\mvn-it-0.tmp\core-it-suite\target\core-it-suite-2.1-SNAPSHOT.jar
[INFO]
[INFO] --- maven-site-plugin:3.7:attach-descriptor (attach-descriptor) @ core-it-suite ---
[INFO] Skipping because packaging 'jar' is not pom.
[INFO]
[INFO] --- maven-jar-plugin:3.0.2:test-jar (default) @ core-it-suite ---
[INFO] Building jar: C:\mvn-it-0.tmp\core-it-suite\target\core-it-suite-2.1-SNAPSHOT-tests.jar
[INFO]
[INFO] --- maven-checkstyle-plugin:3.0.0:check (checkstyle-check) @ core-it-suite ---
[INFO]
[INFO] --- maven-install-plugin:2.5.2:install (default-install) @ core-it-suite ---
[INFO] Installing C:\mvn-it-0.tmp\core-it-suite\target\core-it-suite-2.1-SNAPSHOT.jar to c:\mvn-it-0.tmp\it-local-repo\org\apache\maven\its\core-it-suite\2.1-SNAPSHOT\core-it-suite-2.1-SNAPSHOT.jar
[INFO] Installing C:\mvn-it-0.tmp\core-it-suite\pom.xml to c:\mvn-it-0.tmp\it-local-repo\org\apache\maven\its\core-it-suite\2.1-SNAPSHOT\core-it-suite-2.1-SNAPSHOT.pom
[INFO] Installing C:\mvn-it-0.tmp\core-it-suite\target\core-it-suite-2.1-SNAPSHOT-tests.jar to c:\mvn-it-0.tmp\it-local-repo\org\apache\maven\its\core-it-suite\2.1-SNAPSHOT\core-it-suite-2.1-SNAPSHOT-tests.jar
[INFO] ------------------------------------------------------------------------
[INFO] Reactor Summary:
[INFO]
[INFO] Maven Core ITs 2.1-SNAPSHOT ........................ SUCCESS [ 49.174 s]
[INFO] Maven IT Support 2.1-SNAPSHOT ...................... SUCCESS [ 0.925 s]
[INFO] Maven IT :: Plugins 2.1-SNAPSHOT ................... SUCCESS [ 0.483 s]
[INFO] Maven IT Plugin :: Active Collection 2.1-SNAPSHOT .. SUCCESS [ 12.366 s]
[INFO] Maven IT Plugin :: Ant-Based 2.1-SNAPSHOT .......... SUCCESS [ 7.331 s]
[INFO] Maven IT Plugin :: Artifact 2.1-SNAPSHOT ........... SUCCESS [ 2.450 s]
[INFO] Maven IT Plugin :: Class Loader :: Dependency A 2.1-SNAPSHOT SUCCESS [ 0.846 s]
[INFO] Maven IT Plugin :: Class Loader :: Dependency B 2.1-SNAPSHOT SUCCESS [ 0.801 s]
[INFO] Maven IT Plugin :: Class Loader :: Dependency C 2.1-SNAPSHOT SUCCESS [ 0.811 s]
[INFO] Maven IT Plugin :: Class Loader 2.1-SNAPSHOT ....... SUCCESS [ 4.268 s]
[INFO] Maven IT Plugin :: Class Loader :: Aggregator 2.1-SNAPSHOT SUCCESS [ 0.436 s]
[INFO] Maven IT Plugin :: Configuration 2.1-SNAPSHOT ...... SUCCESS [ 1.863 s]
[INFO] Maven IT Plugin :: Context Passing 2.1-SNAPSHOT .... SUCCESS [ 0.643 s]
[INFO] Maven ITs :: Core Plugin Stubs 2.1-SNAPSHOT ........ SUCCESS [ 0.343 s]
[INFO] Maven IT Clean Plugin Stub 0.1-stub-SNAPSHOT ....... SUCCESS [ 0.704 s]
[INFO] Maven IT Compiler Plugin Stub 0.1-stub-SNAPSHOT .... SUCCESS [ 1.020 s]
[INFO] Maven IT Deploy Plugin Stub 0.1-stub-SNAPSHOT ...... SUCCESS [ 0.905 s]
[INFO] Maven IT EAR Plugin Stub 0.1-stub-SNAPSHOT ......... SUCCESS [ 0.950 s]
[INFO] Maven IT EJB Plugin Stub 0.1-stub-SNAPSHOT ......... SUCCESS [ 0.953 s]
[INFO] Maven IT Install Plugin Stub 0.1-stub-SNAPSHOT ..... SUCCESS [ 0.731 s]
[INFO] Maven IT JAR Plugin Stub 0.1-stub-SNAPSHOT ......... SUCCESS [ 0.790 s]
[INFO] Maven IT Javadoc Plugin Stub 0.1-stub-SNAPSHOT ..... SUCCESS [ 0.914 s]
[INFO] Maven IT Plugin Plugin Stub 0.1-stub-SNAPSHOT ...... SUCCESS [ 0.980 s]
[INFO] Maven IT RAR Plugin Stub 0.1-stub-SNAPSHOT ......... SUCCESS [ 0.820 s]
[INFO] Maven IT Resources Plugin Stub 0.1-stub-SNAPSHOT ... SUCCESS [ 0.999 s]
[INFO] Maven IT Site Plugin Stub 0.1-stub-SNAPSHOT ........ SUCCESS [ 0.913 s]
[INFO] Maven IT Source Plugin Stub 0.1-stub-SNAPSHOT ...... SUCCESS [ 0.813 s]
[INFO] Maven IT Surefire Plugin Stub 0.1-stub-SNAPSHOT .... SUCCESS [ 0.931 s]
[INFO] Maven IT WAR Plugin Stub 0.1-stub-SNAPSHOT ......... SUCCESS [ 0.958 s]
[INFO] Maven IT Plugin :: Dependency Collection 2.1-SNAPSHOT SUCCESS [ 0.974 s]
[INFO] Maven IT Plugin :: Dependency Resolution 2.1-SNAPSHOT SUCCESS [ 6.976 s]
[INFO] Maven IT Plugin :: Expression 2.1-SNAPSHOT ......... SUCCESS [ 2.633 s]
[INFO] Maven IT Plugin :: Error Mojos 2.1-SNAPSHOT ........ SUCCESS [ 3.157 s]
[INFO] Maven IT Component 2.1-SNAPSHOT .................... SUCCESS [ 0.674 s]
[INFO] Maven IT Plugin :: Extension Consumer 2.1-SNAPSHOT . SUCCESS [ 0.782 s]
[INFO] Maven IT Plugin :: Extension Provider 2.1-SNAPSHOT . SUCCESS [ 0.681 s]
[INFO] Maven IT Plugin :: Fork 2.1-SNAPSHOT ............... SUCCESS [ 1.046 s]
[INFO] Maven IT Plugin :: Invalid Descriptor 2.1-SNAPSHOT . SUCCESS [ 1.349 s]
[INFO] Maven IT Plugin :: Log File 2.1-SNAPSHOT ........... SUCCESS [ 0.807 s]
[INFO] Maven IT Helper Library 2.1-SNAPSHOT ............... SUCCESS [ 3.647 s]
[INFO] Maven IT Plugin :: Model Interpolation 2.1-SNAPSHOT SUCCESS [ 1.101 s]
[INFO] Maven IT Plugin :: No Default Component 2.1-SNAPSHOT SUCCESS [ 0.888 s]
[INFO] Maven IT Plugin :: No Project 2.1-SNAPSHOT ......... SUCCESS [ 0.720 s]
[INFO] Maven IT Plugin :: Online 2.1-SNAPSHOT ............. SUCCESS [ 0.658 s]
[INFO] Maven IT Plugin :: Optional Mojos 2.1-SNAPSHOT ..... SUCCESS [ 0.869 s]
[INFO] Maven IT Plugin :: Packaging 2.1-SNAPSHOT .......... SUCCESS [ 0.749 s]
[INFO] Maven IT Plugin :: Parameter Implementation 2.1-SNAPSHOT SUCCESS [ 0.762 s]
[INFO] Maven IT Plugin :: Plugin Dependency 2.1-SNAPSHOT .. SUCCESS [ 0.625 s]
[INFO] Maven IT Plugin :: Project 2.1-SNAPSHOT ............ SUCCESS [ 0.965 s]
[INFO] Maven IT Plugin :: Project Interpolation 2.1-SNAPSHOT SUCCESS [ 0.962 s]
[INFO] Maven IT Plugin :: Setter 2.1-SNAPSHOT ............. SUCCESS [ 0.631 s]
[INFO] Maven IT Plugin :: Singleton Component 2.1-SNAPSHOT SUCCESS [ 0.855 s]
[INFO] Maven IT Plugin :: Site 2.1-SNAPSHOT ............... SUCCESS [ 2.044 s]
[INFO] Maven IT Plugin :: Toolchain 2.1-SNAPSHOT .......... SUCCESS [ 6.105 s]
[INFO] Maven IT Plugin :: Touch 2.1-SNAPSHOT .............. SUCCESS [ 1.295 s]
[INFO] Maven IT Plugin :: Uses Properties Plugin 2.1-SNAPSHOT SUCCESS [ 0.662 s]
[INFO] Maven IT Plugin :: Uses Wagon Plugin 2.1-SNAPSHOT .. SUCCESS [ 2.652 s]
[INFO] Maven IT Plugin :: This plugin should contain the mojos needed by all tests. 2.1-SNAPSHOT SUCCESS [ 0.451 s]
[INFO] Maven IT Plugin :: Plexus Utils 1.1 2.1-SNAPSHOT ... SUCCESS [ 0.959 s]
[INFO] Maven IT Plugin :: Plexus Utils New 2.1-SNAPSHOT ... SUCCESS [ 0.726 s]
[INFO] Maven IT Plugin :: Plexus Component API 2.1-SNAPSHOT SUCCESS [ 2.079 s]
[INFO] Maven IT Plugin :: Log4J Client 2.1-SNAPSHOT ....... SUCCESS [ 0.862 s]
[INFO] Maven IT Plugin :: Extension 1 2.1-SNAPSHOT ........ SUCCESS [ 0.644 s]
[INFO] Maven IT Plugin :: Extension 2 2.1-SNAPSHOT ........ SUCCESS [ 1.231 s]
[INFO] Maven IT Plugin :: Plexus Lifecycle 2.1-SNAPSHOT ... SUCCESS [ 3.037 s]
[INFO] Maven IT Plugin :: Settings 2.1-SNAPSHOT ........... SUCCESS [ 0.896 s]
[INFO] Maven IT Plugin :: mng-5805 extension 2.1-SNAPSHOT . SUCCESS [ 0.499 s]
[INFO] Maven IT Plugin :: mng-5805 extension mk2 2.1-SNAPSHOT SUCCESS [ 0.515 s]
[INFO] Maven IT Plugin :: mng-5805 plugin 2.1-SNAPSHOT .... SUCCESS [ 0.808 s]
[INFO] Maven IT Plugin :: mng-5805 plugin-dep 2.1-SNAPSHOT SUCCESS [ 0.563 s]
[INFO] Maven IT Plugin :: mng-5958 extension 2.1-SNAPSHOT . SUCCESS [ 4.871 s]
[INFO] Maven IT Toolchain 2.1-SNAPSHOT .................... SUCCESS [ 0.999 s]
[INFO] Maven IT Wagon 2.1-SNAPSHOT ........................ SUCCESS [ 0.884 s]
[INFO] Maven IT Support Artifacts 2.1-SNAPSHOT ............ SUCCESS [ 3.337 s]
[INFO] Maven IT Extension 2.1-SNAPSHOT .................... SUCCESS [ 0.537 s]
[INFO] Maven ITs 2.1-SNAPSHOT ............................. SUCCESS [52:18 min]
[INFO] ------------------------------------------------------------------------
[INFO] BUILD SUCCESS
[INFO] ------------------------------------------------------------------------
[INFO] Total time: 55:06 min
[INFO] Finished at: 2019-07-31T05:37:54-07:00
[INFO] ------------------------------------------------------------------------
[Pipeline] }
[Pipeline] // withMaven
[Pipeline] deleteDir
[Pipeline] }
[Pipeline] // dir
[Pipeline] }
[Pipeline] // stage
[Pipeline] }
[Pipeline] // node
[Pipeline] }
[Pipeline] // parallel
[Pipeline] echo
[FAILURE-003] AbortException hudson.AbortException: script returned exit code 1
[Pipeline] stage
[Pipeline] { (Notifications)
[Pipeline] echo
Build result: FAILURE
[Pipeline] jiraIssueSelector
[Pipeline] emailext
Build failed in Jenkins: Maven TLP » maven » MNG-6726 #4
Posted by Apache Jenkins Server <je...@builds.apache.org>.
See https://builds.apache.org/job/maven-box/job/maven/job/MNG-6726/4/
Changes:
* forcily disabled mock-spy on Windows by adding
All tests passed
Build log:
[...truncated 48273 lines...]
[INFO] Maven IT Plugin :: Class Loader :: Aggregator 2.1-SNAPSHOT SUCCESS [ 0.510 s]
[INFO] Maven IT Plugin :: Configuration 2.1-SNAPSHOT ...... SUCCESS [ 1.683 s]
[INFO] Maven IT Plugin :: Context Passing 2.1-SNAPSHOT .... SUCCESS [ 0.792 s]
[INFO] Maven ITs :: Core Plugin Stubs 2.1-SNAPSHOT ........ SUCCESS [ 0.608 s]
[INFO] Maven IT Clean Plugin Stub 0.1-stub-SNAPSHOT ....... SUCCESS [ 0.988 s]
[INFO] Maven IT Compiler Plugin Stub 0.1-stub-SNAPSHOT .... SUCCESS [ 1.391 s]
[INFO] Maven IT Deploy Plugin Stub 0.1-stub-SNAPSHOT ...... SUCCESS [ 0.879 s]
[INFO] Maven IT EAR Plugin Stub 0.1-stub-SNAPSHOT ......... SUCCESS [ 2.443 s]
[INFO] Maven IT EJB Plugin Stub 0.1-stub-SNAPSHOT ......... SUCCESS [ 0.980 s]
[INFO] Maven IT Install Plugin Stub 0.1-stub-SNAPSHOT ..... SUCCESS [ 1.068 s]
[INFO] Maven IT JAR Plugin Stub 0.1-stub-SNAPSHOT ......... SUCCESS [ 0.897 s]
[INFO] Maven IT Javadoc Plugin Stub 0.1-stub-SNAPSHOT ..... SUCCESS [ 1.111 s]
[INFO] Maven IT Plugin Plugin Stub 0.1-stub-SNAPSHOT ...... SUCCESS [ 0.997 s]
[INFO] Maven IT RAR Plugin Stub 0.1-stub-SNAPSHOT ......... SUCCESS [ 1.032 s]
[INFO] Maven IT Resources Plugin Stub 0.1-stub-SNAPSHOT ... SUCCESS [ 1.258 s]
[INFO] Maven IT Site Plugin Stub 0.1-stub-SNAPSHOT ........ SUCCESS [ 0.991 s]
[INFO] Maven IT Source Plugin Stub 0.1-stub-SNAPSHOT ...... SUCCESS [ 1.020 s]
[INFO] Maven IT Surefire Plugin Stub 0.1-stub-SNAPSHOT .... SUCCESS [ 0.841 s]
[INFO] Maven IT WAR Plugin Stub 0.1-stub-SNAPSHOT ......... SUCCESS [ 0.726 s]
[INFO] Maven IT Plugin :: Dependency Collection 2.1-SNAPSHOT SUCCESS [ 0.977 s]
[INFO] Maven IT Plugin :: Dependency Resolution 2.1-SNAPSHOT SUCCESS [ 7.216 s]
[INFO] Maven IT Plugin :: Expression 2.1-SNAPSHOT ......... SUCCESS [ 2.807 s]
[INFO] Maven IT Plugin :: Error Mojos 2.1-SNAPSHOT ........ SUCCESS [ 4.529 s]
[INFO] Maven IT Component 2.1-SNAPSHOT .................... SUCCESS [ 0.850 s]
[INFO] Maven IT Plugin :: Extension Consumer 2.1-SNAPSHOT . SUCCESS [ 0.906 s]
[INFO] Maven IT Plugin :: Extension Provider 2.1-SNAPSHOT . SUCCESS [ 0.866 s]
[INFO] Maven IT Plugin :: Fork 2.1-SNAPSHOT ............... SUCCESS [ 1.388 s]
[INFO] Maven IT Plugin :: Invalid Descriptor 2.1-SNAPSHOT . SUCCESS [ 1.151 s]
[INFO] Maven IT Plugin :: Log File 2.1-SNAPSHOT ........... SUCCESS [ 0.799 s]
[INFO] Maven IT Helper Library 2.1-SNAPSHOT ............... SUCCESS [ 2.894 s]
[INFO] Maven IT Plugin :: Model Interpolation 2.1-SNAPSHOT SUCCESS [ 1.550 s]
[INFO] Maven IT Plugin :: No Default Component 2.1-SNAPSHOT SUCCESS [ 0.783 s]
[INFO] Maven IT Plugin :: No Project 2.1-SNAPSHOT ......... SUCCESS [ 0.914 s]
[INFO] Maven IT Plugin :: Online 2.1-SNAPSHOT ............. SUCCESS [ 0.756 s]
[INFO] Maven IT Plugin :: Optional Mojos 2.1-SNAPSHOT ..... SUCCESS [ 0.585 s]
[INFO] Maven IT Plugin :: Packaging 2.1-SNAPSHOT .......... SUCCESS [ 0.910 s]
[INFO] Maven IT Plugin :: Parameter Implementation 2.1-SNAPSHOT SUCCESS [ 0.748 s]
[INFO] Maven IT Plugin :: Plugin Dependency 2.1-SNAPSHOT .. SUCCESS [ 0.849 s]
[INFO] Maven IT Plugin :: Project 2.1-SNAPSHOT ............ SUCCESS [ 0.946 s]
[INFO] Maven IT Plugin :: Project Interpolation 2.1-SNAPSHOT SUCCESS [ 1.081 s]
[INFO] Maven IT Plugin :: Setter 2.1-SNAPSHOT ............. SUCCESS [ 0.981 s]
[INFO] Maven IT Plugin :: Singleton Component 2.1-SNAPSHOT SUCCESS [ 1.055 s]
[INFO] Maven IT Plugin :: Site 2.1-SNAPSHOT ............... SUCCESS [ 3.512 s]
[INFO] Maven IT Plugin :: Toolchain 2.1-SNAPSHOT .......... SUCCESS [ 6.214 s]
[INFO] Maven IT Plugin :: Touch 2.1-SNAPSHOT .............. SUCCESS [ 1.232 s]
[INFO] Maven IT Plugin :: Uses Properties Plugin 2.1-SNAPSHOT SUCCESS [ 0.594 s]
[INFO] Maven IT Plugin :: Uses Wagon Plugin 2.1-SNAPSHOT .. SUCCESS [ 2.577 s]
[INFO] Maven IT Plugin :: This plugin should contain the mojos needed by all tests. 2.1-SNAPSHOT SUCCESS [ 0.752 s]
[INFO] Maven IT Plugin :: Plexus Utils 1.1 2.1-SNAPSHOT ... SUCCESS [ 1.413 s]
[INFO] Maven IT Plugin :: Plexus Utils New 2.1-SNAPSHOT ... SUCCESS [ 1.226 s]
[INFO] Maven IT Plugin :: Plexus Component API 2.1-SNAPSHOT SUCCESS [ 2.217 s]
[INFO] Maven IT Plugin :: Log4J Client 2.1-SNAPSHOT ....... SUCCESS [ 0.950 s]
[INFO] Maven IT Plugin :: Extension 1 2.1-SNAPSHOT ........ SUCCESS [ 0.763 s]
[INFO] Maven IT Plugin :: Extension 2 2.1-SNAPSHOT ........ SUCCESS [ 0.819 s]
[INFO] Maven IT Plugin :: Plexus Lifecycle 2.1-SNAPSHOT ... SUCCESS [ 5.517 s]
[INFO] Maven IT Plugin :: Settings 2.1-SNAPSHOT ........... SUCCESS [ 1.498 s]
[INFO] Maven IT Plugin :: mng-5805 extension 2.1-SNAPSHOT . SUCCESS [ 0.508 s]
[INFO] Maven IT Plugin :: mng-5805 extension mk2 2.1-SNAPSHOT SUCCESS [ 0.498 s]
[INFO] Maven IT Plugin :: mng-5805 plugin 2.1-SNAPSHOT .... SUCCESS [ 0.717 s]
[INFO] Maven IT Plugin :: mng-5805 plugin-dep 2.1-SNAPSHOT SUCCESS [ 0.674 s]
[INFO] Maven IT Plugin :: mng-5958 extension 2.1-SNAPSHOT . SUCCESS [ 5.102 s]
[INFO] Maven IT Toolchain 2.1-SNAPSHOT .................... SUCCESS [ 1.522 s]
[INFO] Maven IT Wagon 2.1-SNAPSHOT ........................ SUCCESS [ 1.182 s]
[INFO] Maven IT Support Artifacts 2.1-SNAPSHOT ............ SUCCESS [ 6.449 s]
[INFO] Maven IT Extension 2.1-SNAPSHOT .................... SUCCESS [ 0.574 s]
[INFO] Maven ITs 2.1-SNAPSHOT ............................. SUCCESS [46:58 min]
[INFO] ------------------------------------------------------------------------
[INFO] BUILD SUCCESS
[INFO] ------------------------------------------------------------------------
[INFO] Total time: 50:06 min
[INFO] Finished at: 2019-07-31T04:10:43-07:00
[INFO] ------------------------------------------------------------------------
Picked up JAVA_TOOL_OPTIONS: -Dmaven.ext.class.path="c:\mvn-it-2.tmp@tmp\withMaven4808b732\pipeline-maven-spy.jar" -Dorg.jenkinsci.plugins.pipeline.maven.reportsFolder="c:\mvn-it-2.tmp@tmp\withMaven4808b732"
[Pipeline] }
[Pipeline] // withMaven
[Pipeline] deleteDir
0021PomProfile(it0021)......................................OK (4.5 s)
0019PluginVersionMngtBySuperPom(it0019).....................OK (4.6 s)
0018DependencyManagement(it0018)............................OK (2.9 s)
0012PomInterpolation(it0012)................................OK (2.7 s)
[Pipeline] }
[Pipeline] // dir
[Pipeline] }
[Pipeline] // stage
[Pipeline] }
[Pipeline] // node
[Pipeline] }
0011DefaultVersionByDependencyManagement(it0011)............OK (3.0 s)
0010DependencyClosureResolution(it0010).....................OK (3.2 s)
0009GoalConfiguration(it0009)...............................OK (2.6 s)
0008SimplePlugin(it0008)....................................OK (2.9 s)
mng6210CoreExtensionsCustomScopes(CoreExtensionCustomScopes)OK (3.0 s)
mng6352PrintVersion(itShouldPrintVersionAtTopAndAtBottom)...SKIPPED - Maven version 3.6.2-SNAPSHOT not in range [3.5.3-SNAPSHOT,3.5.4-SNAPSHOT]
mng6352PrintVersion(itShouldPrintVersionInAllLines).........SKIPPED - Maven version 3.6.2-SNAPSHOT not in range [3.5.3-SNAPSHOT,3.5.4-SNAPSHOT]
mng6391PrintVersion(itShouldPrintVersionAtTopAndAtBottom)...OK (2.9 s)
mng6391PrintVersion(itShouldPrintVersionInAllLines).........OK (2.6 s)
mng6558ToolchainsBuildingEvent(it)..........................OK (2.3 s)
[ERROR] Tests run: 818, Failures: 4, Errors: 0, Skipped: 0, Time elapsed: 2,809.253 s <<< FAILURE! - in org.apache.maven.it.IntegrationTestSuite
[ERROR] testItShouldWaitForConcurrentModulesToFinish(org.apache.maven.it.MavenITmng6720FailFastTest) Time elapsed: 3.623 s <<< FAILURE!
junit.framework.AssertionFailedError
at org.apache.maven.it.MavenITmng6720FailFastTest.testItShouldWaitForConcurrentModulesToFinish(MavenITmng6720FailFastTest.java:67)
[ERROR] testContinuousDeliveryFriendlyVersionsAreWarningFree(org.apache.maven.it.MavenITmng5576CdFriendlyVersions) Time elapsed: 2.58 s <<< FAILURE!
junit.framework.AssertionFailedError: WARNING: An illegal reflective access operation has occurred
at org.apache.maven.it.MavenITmng5576CdFriendlyVersions.testContinuousDeliveryFriendlyVersionsAreWarningFree(MavenITmng5576CdFriendlyVersions.java:65)
[ERROR] testit(org.apache.maven.it.MavenITmng4387QuietLoggingTest) Time elapsed: 2.249 s <<< FAILURE!
junit.framework.AssertionFailedError: expected:<[]> but was:<[Picked up JAVA_TOOL_OPTIONS: -Dmaven.ext.class.path="c:\mvn-it-1.tmp@tmp\withMaven74639364\pipeline-maven-spy.jar" -Dorg.jenkinsci.plugins.pipeline.maven.reportsFolder="c:\mvn-it-1.tmp@tmp\withMaven74639364" , WARNING: An illegal reflective access operation has occurred, WARNING: Illegal reflective access by org.apache.maven.model.interpolation.StringSearchModelInterpolator$InterpolateObjectAction$CacheField (file:/C:/mvn-it-1.tmp/core-it-suite/target/apache-maven/bin/../lib/maven-model-builder-3.6.2-SNAPSHOT.jar) to field java.io.File.fs, WARNING: Please consider reporting this to the maintainers of org.apache.maven.model.interpolation.StringSearchModelInterpolator$InterpolateObjectAction$CacheField, WARNING: Use --illegal-access=warn to enable warnings of further illegal reflective access operations, WARNING: All illegal access operations will be denied in a future release]>
at org.apache.maven.it.MavenITmng4387QuietLoggingTest.testit(MavenITmng4387QuietLoggingTest.java:71)
[ERROR] testit(org.apache.maven.it.MavenITmng3183LoggingToFileTest) Time elapsed: 2.213 s <<< FAILURE!
junit.framework.AssertionFailedError: expected:<[]> but was:<[Picked up JAVA_TOOL_OPTIONS: -Dmaven.ext.class.path="c:\mvn-it-1.tmp@tmp\withMaven74639364\pipeline-maven-spy.jar" -Dorg.jenkinsci.plugins.pipeline.maven.reportsFolder="c:\mvn-it-1.tmp@tmp\withMaven74639364" , WARNING: An illegal reflective access operation has occurred, WARNING: Illegal reflective access by org.apache.maven.model.interpolation.StringSearchModelInterpolator$InterpolateObjectAction$CacheField (file:/C:/mvn-it-1.tmp/core-it-suite/target/apache-maven/bin/../lib/maven-model-builder-3.6.2-SNAPSHOT.jar) to field java.io.File.fs, WARNING: Please consider reporting this to the maintainers of org.apache.maven.model.interpolation.StringSearchModelInterpolator$InterpolateObjectAction$CacheField, WARNING: Use --illegal-access=warn to enable warnings of further illegal reflective access operations, WARNING: All illegal access operations will be denied in a future release]>
at org.apache.maven.it.MavenITmng3183LoggingToFileTest.testit(MavenITmng3183LoggingToFileTest.java:74)
[INFO]
[INFO] Results:
[INFO]
[ERROR] Failures:
[ERROR] MavenITmng3183LoggingToFileTest>AbstractMavenIntegrationTestCase.runTest:227->testit:74 expected:<[]> but was:<[Picked up JAVA_TOOL_OPTIONS: -Dmaven.ext.class.path="c:\mvn-it-1.tmp@tmp\withMaven74639364\pipeline-maven-spy.jar" -Dorg.jenkinsci.plugins.pipeline.maven.reportsFolder="c:\mvn-it-1.tmp@tmp\withMaven74639364" , WARNING: An illegal reflective access operation has occurred, WARNING: Illegal reflective access by org.apache.maven.model.interpolation.StringSearchModelInterpolator$InterpolateObjectAction$CacheField (file:/C:/mvn-it-1.tmp/core-it-suite/target/apache-maven/bin/../lib/maven-model-builder-3.6.2-SNAPSHOT.jar) to field java.io.File.fs, WARNING: Please consider reporting this to the maintainers of org.apache.maven.model.interpolation.StringSearchModelInterpolator$InterpolateObjectAction$CacheField, WARNING: Use --illegal-access=warn to enable warnings of further illegal reflective access operations, WARNING: All illegal access operations will be denied in a future release]>
[ERROR] MavenITmng4387QuietLoggingTest>AbstractMavenIntegrationTestCase.runTest:227->testit:71 expected:<[]> but was:<[Picked up JAVA_TOOL_OPTIONS: -Dmaven.ext.class.path="c:\mvn-it-1.tmp@tmp\withMaven74639364\pipeline-maven-spy.jar" -Dorg.jenkinsci.plugins.pipeline.maven.reportsFolder="c:\mvn-it-1.tmp@tmp\withMaven74639364" , WARNING: An illegal reflective access operation has occurred, WARNING: Illegal reflective access by org.apache.maven.model.interpolation.StringSearchModelInterpolator$InterpolateObjectAction$CacheField (file:/C:/mvn-it-1.tmp/core-it-suite/target/apache-maven/bin/../lib/maven-model-builder-3.6.2-SNAPSHOT.jar) to field java.io.File.fs, WARNING: Please consider reporting this to the maintainers of org.apache.maven.model.interpolation.StringSearchModelInterpolator$InterpolateObjectAction$CacheField, WARNING: Use --illegal-access=warn to enable warnings of further illegal reflective access operations, WARNING: All illegal access operations will be denied in a future release]>
[ERROR] MavenITmng5576CdFriendlyVersions>AbstractMavenIntegrationTestCase.runTest:227->testContinuousDeliveryFriendlyVersionsAreWarningFree:65 WARNING: An illegal reflective access operation has occurred
[ERROR] MavenITmng6720FailFastTest>AbstractMavenIntegrationTestCase.runTest:227->testItShouldWaitForConcurrentModulesToFinish:67
[INFO]
[ERROR] Tests run: 818, Failures: 4, Errors: 0, Skipped: 0
[INFO]
[ERROR] There are test failures.
Please refer to C:\mvn-it-1.tmp\core-it-suite\target\surefire-reports for the individual test results.
Please refer to dump files (if any exist) [date]-jvmRun[N].dump, [date].dumpstream and [date]-jvmRun[N].dumpstream.
[INFO]
[INFO] --- maven-jar-plugin:3.0.2:jar (default-jar) @ core-it-suite ---
[INFO] Building jar: C:\mvn-it-1.tmp\core-it-suite\target\core-it-suite-2.1-SNAPSHOT.jar
[INFO]
[INFO] --- maven-site-plugin:3.7:attach-descriptor (attach-descriptor) @ core-it-suite ---
[INFO] Skipping because packaging 'jar' is not pom.
[INFO]
[INFO] --- maven-jar-plugin:3.0.2:test-jar (default) @ core-it-suite ---
[INFO] Building jar: C:\mvn-it-1.tmp\core-it-suite\target\core-it-suite-2.1-SNAPSHOT-tests.jar
[INFO]
[INFO] --- maven-checkstyle-plugin:3.0.0:check (checkstyle-check) @ core-it-suite ---
[INFO]
[INFO] --- maven-install-plugin:2.5.2:install (default-install) @ core-it-suite ---
[INFO] Installing C:\mvn-it-1.tmp\core-it-suite\target\core-it-suite-2.1-SNAPSHOT.jar to c:\mvn-it-1.tmp\it-local-repo\org\apache\maven\its\core-it-suite\2.1-SNAPSHOT\core-it-suite-2.1-SNAPSHOT.jar
[INFO] Installing C:\mvn-it-1.tmp\core-it-suite\pom.xml to c:\mvn-it-1.tmp\it-local-repo\org\apache\maven\its\core-it-suite\2.1-SNAPSHOT\core-it-suite-2.1-SNAPSHOT.pom
[INFO] Installing C:\mvn-it-1.tmp\core-it-suite\target\core-it-suite-2.1-SNAPSHOT-tests.jar to c:\mvn-it-1.tmp\it-local-repo\org\apache\maven\its\core-it-suite\2.1-SNAPSHOT\core-it-suite-2.1-SNAPSHOT-tests.jar
[INFO] ------------------------------------------------------------------------
[INFO] Reactor Summary:
[INFO]
[INFO] Maven Core ITs 2.1-SNAPSHOT ........................ SUCCESS [ 47.011 s]
[INFO] Maven IT Support 2.1-SNAPSHOT ...................... SUCCESS [ 0.893 s]
[INFO] Maven IT :: Plugins 2.1-SNAPSHOT ................... SUCCESS [ 0.612 s]
[INFO] Maven IT Plugin :: Active Collection 2.1-SNAPSHOT .. SUCCESS [ 12.001 s]
[INFO] Maven IT Plugin :: Ant-Based 2.1-SNAPSHOT .......... SUCCESS [ 6.683 s]
[INFO] Maven IT Plugin :: Artifact 2.1-SNAPSHOT ........... SUCCESS [ 2.386 s]
[INFO] Maven IT Plugin :: Class Loader :: Dependency A 2.1-SNAPSHOT SUCCESS [ 0.817 s]
[INFO] Maven IT Plugin :: Class Loader :: Dependency B 2.1-SNAPSHOT SUCCESS [ 0.800 s]
[INFO] Maven IT Plugin :: Class Loader :: Dependency C 2.1-SNAPSHOT SUCCESS [ 0.566 s]
[INFO] Maven IT Plugin :: Class Loader 2.1-SNAPSHOT ....... SUCCESS [ 3.797 s]
[INFO] Maven IT Plugin :: Class Loader :: Aggregator 2.1-SNAPSHOT SUCCESS [ 0.413 s]
[INFO] Maven IT Plugin :: Configuration 2.1-SNAPSHOT ...... SUCCESS [ 1.749 s]
[INFO] Maven IT Plugin :: Context Passing 2.1-SNAPSHOT .... SUCCESS [ 0.832 s]
[INFO] Maven ITs :: Core Plugin Stubs 2.1-SNAPSHOT ........ SUCCESS [ 0.391 s]
[INFO] Maven IT Clean Plugin Stub 0.1-stub-SNAPSHOT ....... SUCCESS [ 0.955 s]
[INFO] Maven IT Compiler Plugin Stub 0.1-stub-SNAPSHOT .... SUCCESS [ 0.972 s]
[INFO] Maven IT Deploy Plugin Stub 0.1-stub-SNAPSHOT ...... SUCCESS [ 0.949 s]
[INFO] Maven IT EAR Plugin Stub 0.1-stub-SNAPSHOT ......... SUCCESS [ 1.021 s]
[INFO] Maven IT EJB Plugin Stub 0.1-stub-SNAPSHOT ......... SUCCESS [ 0.870 s]
[INFO] Maven IT Install Plugin Stub 0.1-stub-SNAPSHOT ..... SUCCESS [ 0.940 s]
[INFO] Maven IT JAR Plugin Stub 0.1-stub-SNAPSHOT ......... SUCCESS [ 0.896 s]
[INFO] Maven IT Javadoc Plugin Stub 0.1-stub-SNAPSHOT ..... SUCCESS [ 0.930 s]
[INFO] Maven IT Plugin Plugin Stub 0.1-stub-SNAPSHOT ...... SUCCESS [ 0.923 s]
[INFO] Maven IT RAR Plugin Stub 0.1-stub-SNAPSHOT ......... SUCCESS [ 0.922 s]
[INFO] Maven IT Resources Plugin Stub 0.1-stub-SNAPSHOT ... SUCCESS [ 1.021 s]
[INFO] Maven IT Site Plugin Stub 0.1-stub-SNAPSHOT ........ SUCCESS [ 1.056 s]
[INFO] Maven IT Source Plugin Stub 0.1-stub-SNAPSHOT ...... SUCCESS [ 1.798 s]
[INFO] Maven IT Surefire Plugin Stub 0.1-stub-SNAPSHOT .... SUCCESS [ 0.876 s]
[INFO] Maven IT WAR Plugin Stub 0.1-stub-SNAPSHOT ......... SUCCESS [ 0.927 s]
[INFO] Maven IT Plugin :: Dependency Collection 2.1-SNAPSHOT SUCCESS [ 1.096 s]
[INFO] Maven IT Plugin :: Dependency Resolution 2.1-SNAPSHOT SUCCESS [ 6.990 s]
[INFO] Maven IT Plugin :: Expression 2.1-SNAPSHOT ......... SUCCESS [ 2.599 s]
[INFO] Maven IT Plugin :: Error Mojos 2.1-SNAPSHOT ........ SUCCESS [ 3.157 s]
[INFO] Maven IT Component 2.1-SNAPSHOT .................... SUCCESS [ 0.633 s]
[INFO] Maven IT Plugin :: Extension Consumer 2.1-SNAPSHOT . SUCCESS [ 0.768 s]
[INFO] Maven IT Plugin :: Extension Provider 2.1-SNAPSHOT . SUCCESS [ 0.711 s]
[INFO] Maven IT Plugin :: Fork 2.1-SNAPSHOT ............... SUCCESS [ 1.104 s]
[INFO] Maven IT Plugin :: Invalid Descriptor 2.1-SNAPSHOT . SUCCESS [ 0.637 s]
[INFO] Maven IT Plugin :: Log File 2.1-SNAPSHOT ........... SUCCESS [ 0.838 s]
[INFO] Maven IT Helper Library 2.1-SNAPSHOT ............... SUCCESS [ 3.349 s]
[INFO] Maven IT Plugin :: Model Interpolation 2.1-SNAPSHOT SUCCESS [ 1.249 s]
[INFO] Maven IT Plugin :: No Default Component 2.1-SNAPSHOT SUCCESS [ 0.845 s]
[INFO] Maven IT Plugin :: No Project 2.1-SNAPSHOT ......... SUCCESS [ 0.645 s]
[INFO] Maven IT Plugin :: Online 2.1-SNAPSHOT ............. SUCCESS [ 0.645 s]
[INFO] Maven IT Plugin :: Optional Mojos 2.1-SNAPSHOT ..... SUCCESS [ 0.735 s]
[INFO] Maven IT Plugin :: Packaging 2.1-SNAPSHOT .......... SUCCESS [ 0.760 s]
[INFO] Maven IT Plugin :: Parameter Implementation 2.1-SNAPSHOT SUCCESS [ 0.737 s]
[INFO] Maven IT Plugin :: Plugin Dependency 2.1-SNAPSHOT .. SUCCESS [ 0.687 s]
[INFO] Maven IT Plugin :: Project 2.1-SNAPSHOT ............ SUCCESS [ 1.036 s]
[INFO] Maven IT Plugin :: Project Interpolation 2.1-SNAPSHOT SUCCESS [ 1.051 s]
[INFO] Maven IT Plugin :: Setter 2.1-SNAPSHOT ............. SUCCESS [ 0.654 s]
[INFO] Maven IT Plugin :: Singleton Component 2.1-SNAPSHOT SUCCESS [ 0.804 s]
[INFO] Maven IT Plugin :: Site 2.1-SNAPSHOT ............... SUCCESS [ 2.299 s]
[INFO] Maven IT Plugin :: Toolchain 2.1-SNAPSHOT .......... SUCCESS [ 5.741 s]
[INFO] Maven IT Plugin :: Touch 2.1-SNAPSHOT .............. SUCCESS [ 1.404 s]
[INFO] Maven IT Plugin :: Uses Properties Plugin 2.1-SNAPSHOT SUCCESS [ 0.616 s]
[INFO] Maven IT Plugin :: Uses Wagon Plugin 2.1-SNAPSHOT .. SUCCESS [ 2.510 s]
[INFO] Maven IT Plugin :: This plugin should contain the mojos needed by all tests. 2.1-SNAPSHOT SUCCESS [ 0.609 s]
[INFO] Maven IT Plugin :: Plexus Utils 1.1 2.1-SNAPSHOT ... SUCCESS [ 1.075 s]
[INFO] Maven IT Plugin :: Plexus Utils New 2.1-SNAPSHOT ... SUCCESS [ 0.833 s]
[INFO] Maven IT Plugin :: Plexus Component API 2.1-SNAPSHOT SUCCESS [ 1.863 s]
[INFO] Maven IT Plugin :: Log4J Client 2.1-SNAPSHOT ....... SUCCESS [ 0.873 s]
[INFO] Maven IT Plugin :: Extension 1 2.1-SNAPSHOT ........ SUCCESS [ 0.695 s]
[INFO] Maven IT Plugin :: Extension 2 2.1-SNAPSHOT ........ SUCCESS [ 0.658 s]
[INFO] Maven IT Plugin :: Plexus Lifecycle 2.1-SNAPSHOT ... SUCCESS [ 3.148 s]
[INFO] Maven IT Plugin :: Settings 2.1-SNAPSHOT ........... SUCCESS [ 1.173 s]
[INFO] Maven IT Plugin :: mng-5805 extension 2.1-SNAPSHOT . SUCCESS [ 0.559 s]
[INFO] Maven IT Plugin :: mng-5805 extension mk2 2.1-SNAPSHOT SUCCESS [ 0.537 s]
[INFO] Maven IT Plugin :: mng-5805 plugin 2.1-SNAPSHOT .... SUCCESS [ 0.664 s]
[INFO] Maven IT Plugin :: mng-5805 plugin-dep 2.1-SNAPSHOT SUCCESS [ 0.599 s]
[INFO] Maven IT Plugin :: mng-5958 extension 2.1-SNAPSHOT . SUCCESS [ 4.363 s]
[INFO] Maven IT Toolchain 2.1-SNAPSHOT .................... SUCCESS [ 1.322 s]
[INFO] Maven IT Wagon 2.1-SNAPSHOT ........................ SUCCESS [ 1.000 s]
[INFO] Maven IT Support Artifacts 2.1-SNAPSHOT ............ SUCCESS [ 3.358 s]
[INFO] Maven IT Extension 2.1-SNAPSHOT .................... SUCCESS [ 0.571 s]
[INFO] Maven ITs 2.1-SNAPSHOT ............................. SUCCESS [48:14 min]
[INFO] ------------------------------------------------------------------------
[INFO] BUILD SUCCESS
[INFO] ------------------------------------------------------------------------
[INFO] Total time: 50:59 min
[INFO] Finished at: 2019-07-31T04:11:29-07:00
[INFO] ------------------------------------------------------------------------
[Pipeline] }
[Pipeline] // withMaven
[Pipeline] deleteDir
[Pipeline] }
[Pipeline] // dir
[Pipeline] }
[Pipeline] // stage
[Pipeline] }
[Pipeline] // node
[Pipeline] }
[Pipeline] // parallel
[Pipeline] echo
[FAILURE-003] AbortException hudson.AbortException: script returned exit code 1
[Pipeline] stage
[Pipeline] { (Notifications)
[Pipeline] echo
Build result: FAILURE
[Pipeline] jiraIssueSelector
[Pipeline] emailext