You are viewing a plain text version of this content. The canonical link for it is here.
Posted to users@solr.apache.org by Phill Campbell <si...@yahoo.com.INVALID> on 2021/04/19 15:32:12 UTC

BUILD FAILED - Solr 8 on Mac OS Catalina

This is not an Apache Solr question. This is a developer environment question. I apologize for my lack of knowledge with ANT.


$ant common.test

...

-test:
   [junit4] <JUnit4> says jolly good day! Master seed: 3510B76A25B8399C

BUILD FAILED
/development/solr/lucene/common-build.xml:1599: The following error occurred while executing this line:
/development/solr//lucene/common-build.xml:1126: Reference junit.classpath not found.

Total time: 3 minutes 20 seconds



I have tried adding a CLASSPATH environment variable.
I have tried placing nunit	jars in /Library/Java/Exentions and the “user” equivalent location as well.




Common-build.xml

Line 1126 is the “>” on the last line of this snippet:

<junit4:junit4
    taskName="junit4"
    dir="@{workDir}"
    tempdir="@{workDir}/temp"
    maxmemory="${tests.heapsize}"

    statsPropertyPrefix="junit4.stats"

    parallelism="@{threadNum}"

    printSummary="true"
    haltonfailure="${tests.haltonfailure}" 
    failureProperty="tests.failed"

    dynamicAssignmentRatio="${tests.dynamicAssignmentRatio}"
    shuffleOnSlave="true"
    leaveTemporary="${junit4.leaveTemporary}"
    seed="${tests.seed}"
    onNonEmptyWorkDirectory="wipe"

    heartbeat="${tests.heartbeat}"
    uniqueSuiteNames="false"
    
    debugstream="false”
> 



Line 1599 (<test-macro threadNum="${tests.jvms.override}" />)

<!-- Run the actual tests (must be wrapped with -init-totals, -check-totals) -->
<target name="-test">
  <mkdir dir="${junit.output.dir}"/>
  <test-macro threadNum="${tests.jvms.override}" />
</target>


I don’t know if I have a system configuration problem, or if I am running the ANT scripts incorrectly.

Any help appreciated.


Re: BUILD FAILED - Solr 8 on Mac OS Catalina

Posted by dmitri maziuk <dm...@gmail.com>.
On 2021-04-19 10:32 AM, Phill Campbell wrote:

> /development/solr//lucene/common-build.xml:1126: Reference junit.classpath not found.
...
> I don’t know if I have a system configuration problem, or if I am running the ANT scripts incorrectly.
> 
> Any help appreciated.

Try adding something like
```
<path id="junit.classpath">
   <pathelement location="."/>
</path>
```
to your top-level build.xml and see what happens.

My guess is junit.classpath would be set somewhere in junit configs but 
I haven't done java in forever and have no idea how lucene build 
environment is set up, so...

Dima

Re: BUILD FAILED - Solr 8 on Mac OS Catalina

Posted by Phill Campbell <si...@yahoo.com.INVALID>.
I just went through my “junk email folder” and found lots of responses from a few days ago. I do not know why my email let some though and filtered others with the same subject and “from”, but it did. 

Thank you for those responses. I was feeling like the community wasn’t that concerned. I am glad that you all are concerned. Thank you.

> On Apr 20, 2021, at 12:19 PM, Phill Campbell <si...@yahoo.com.INVALID> wrote:
> 
>      [mvn] org.apache.solr.common.util.ObjectReleaseTracker$ObjectTrackerException: org.apache.solr.client.solrj.impl.Http2SolrClient
>      [mvn] 	at org.apache.solr.common.util.ObjectReleaseTracker.track(ObjectReleaseTracker.java:42)
>      [mvn] 	at org.apache.solr.client.solrj.impl.Http2SolrClient.<init>(Http2SolrClient.java:161)
>      [mvn] 	at org.apache.solr.client.solrj.impl.Http2SolrClient$Builder.build(Http2SolrClient.java:840)
>      [mvn] 	at org.apache.solr.handler.component.HttpShardHandlerFactory.init(HttpShardHandlerFactory.java:319)
>      [mvn] 	at org.apache.solr.handler.component.ShardHandlerFactory.newInstance(ShardHandlerFactory.java:51)
>      [mvn] 	at org.apache.solr.core.CoreContainer.load(CoreContainer.java:684)
>      [mvn] 	at org.apache.solr.util.TestHarness.<init>(TestHarness.java:184)
>      [mvn] 	at org.apache.solr.util.TestHarness.<init>(TestHarness.java:156)
>      [mvn] 	at org.apache.solr.util.TestHarness.<init>(TestHarness.java:162)
>      [mvn] 	at org.apache.solr.util.TestHarness.<init>(TestHarness.java:112)
>      [mvn] 	at org.apache.solr.SolrTestCaseJ4.createCore(SolrTestCaseJ4.java:812)
>      [mvn] 	at org.apache.solr.SolrTestCaseJ4.initCore(SolrTestCaseJ4.java:802)
>      [mvn] 	at org.apache.solr.SolrTestCaseJ4.initCore(SolrTestCaseJ4.java:663)
>      [mvn] 	at org.apache.solr.velocity.VelocityResponseWriterTest.beforeClass(VelocityResponseWriterTest.java:41)
>      [mvn] 	at sun.reflect.NativeMethodAccessorImpl.invoke0(Native Method)
>      [mvn] 	at sun.reflect.NativeMethodAccessorImpl.invoke(NativeMethodAccessorImpl.java:62)
>      [mvn] 	at sun.reflect.DelegatingMethodAccessorImpl.invoke(DelegatingMethodAccessorImpl.java:43)
>      [mvn] 	at java.lang.reflect.Method.invoke(Method.java:498)
>      [mvn] 	at com.carrotsearch.randomizedtesting.RandomizedRunner.invoke(RandomizedRunner.java:1750)
>      [mvn] 	at com.carrotsearch.randomizedtesting.RandomizedRunner$6.evaluate(RandomizedRunner.java:878)
>      [mvn] 	at com.carrotsearch.randomizedtesting.RandomizedRunner$7.evaluate(RandomizedRunner.java:894)
>      [mvn] 	at com.carrotsearch.randomizedtesting.rules.StatementAdapter.evaluate(StatementAdapter.java:36)
>      [mvn] 	at com.carrotsearch.randomizedtesting.rules.SystemPropertiesRestoreRule$1.evaluate(SystemPropertiesRestoreRule.java:57)
>      [mvn] 	at org.junit.rules.RunRules.evaluate(RunRules.java:20)
>      [mvn] 	at org.apache.lucene.util.AbstractBeforeAfterRule$1.evaluate(AbstractBeforeAfterRule.java:45)
>      [mvn] 	at com.carrotsearch.randomizedtesting.rules.StatementAdapter.evaluate(StatementAdapter.java:36)
>      [mvn] 	at org.apache.lucene.util.TestRuleStoreClassName$1.evaluate(TestRuleStoreClassName.java:41)
>      [mvn] 	at com.carrotsearch.randomizedtesting.rules.NoShadowingOrOverridesOnMethodsRule$1.evaluate(NoShadowingOrOverridesOnMethodsRule.java:40)
>      [mvn] 	at com.carrotsearch.randomizedtesting.rules.NoShadowingOrOverridesOnMethodsRule$1.evaluate(NoShadowingOrOverridesOnMethodsRule.java:40)
>      [mvn] 	at com.carrotsearch.randomizedtesting.rules.StatementAdapter.evaluate(StatementAdapter.java:36)
>      [mvn] 	at com.carrotsearch.randomizedtesting.rules.StatementAdapter.evaluate(StatementAdapter.java:36)
>      [mvn] 	at com.carrotsearch.randomizedtesting.rules.StatementAdapter.evaluate(StatementAdapter.java:36)
>      [mvn] 	at org.apache.lucene.util.TestRuleAssertionsRequired$1.evaluate(TestRuleAssertionsRequired.java:53)
>      [mvn] 	at org.apache.lucene.util.TestRuleMarkFailure$1.evaluate(TestRuleMarkFailure.java:47)
>      [mvn] 	at org.apache.lucene.util.TestRuleIgnoreAfterMaxFailures$1.evaluate(TestRuleIgnoreAfterMaxFailures.java:64)
>      [mvn] 	at org.apache.lucene.util.TestRuleIgnoreTestSuites$1.evaluate(TestRuleIgnoreTestSuites.java:54)
>      [mvn] 	at org.junit.rules.RunRules.evaluate(RunRules.java:20)
>      [mvn] 	at com.carrotsearch.randomizedtesting.rules.StatementAdapter.evaluate(StatementAdapter.java:36)
>      [mvn] 	at com.carrotsearch.randomizedtesting.ThreadLeakControl$StatementRunner.run(ThreadLeakControl.java:368)
>      [mvn] 	at java.lang.Thread.run(Thread.java:748)
>      [mvn] 
>      [mvn] org.apache.solr.common.util.ObjectReleaseTracker$ObjectTrackerException: org.apache.http.impl.client.InternalHttpClient
>      [mvn] 	at org.apache.solr.common.util.ObjectReleaseTracker.track(ObjectReleaseTracker.java:42)
>      [mvn] 	at org.apache.solr.client.solrj.impl.HttpClientUtil.createClient(HttpClientUtil.java:339)
>      [mvn] 	at org.apache.solr.update.UpdateShardHandler.<init>(UpdateShardHandler.java:124)
>      [mvn] 	at org.apache.solr.core.CoreContainer.load(CoreContainer.java:690)
>      [mvn] 	at org.apache.solr.util.TestHarness.<init>(TestHarness.java:184)
>      [mvn] 	at org.apache.solr.util.TestHarness.<init>(TestHarness.java:156)
>      [mvn] 	at org.apache.solr.util.TestHarness.<init>(TestHarness.java:162)
>      [mvn] 	at org.apache.solr.util.TestHarness.<init>(TestHarness.java:112)
>      [mvn] 	at org.apache.solr.SolrTestCaseJ4.createCore(SolrTestCaseJ4.java:812)
>      [mvn] 	at org.apache.solr.SolrTestCaseJ4.initCore(SolrTestCaseJ4.java:802)
>      [mvn] 	at org.apache.solr.SolrTestCaseJ4.initCore(SolrTestCaseJ4.java:663)
>      [mvn] 	at org.apache.solr.velocity.VelocityResponseWriterTest.beforeClass(VelocityResponseWriterTest.java:41)
>      [mvn] 	at sun.reflect.NativeMethodAccessorImpl.invoke0(Native Method)
>      [mvn] 	at sun.reflect.NativeMethodAccessorImpl.invoke(NativeMethodAccessorImpl.java:62)
>      [mvn] 	at sun.reflect.DelegatingMethodAccessorImpl.invoke(DelegatingMethodAccessorImpl.java:43)
>      [mvn] 	at java.lang.reflect.Method.invoke(Method.java:498)
>      [mvn] 	at com.carrotsearch.randomizedtesting.RandomizedRunner.invoke(RandomizedRunner.java:1750)
>      [mvn] 	at com.carrotsearch.randomizedtesting.RandomizedRunner$6.evaluate(RandomizedRunner.java:878)
>      [mvn] 	at com.carrotsearch.randomizedtesting.RandomizedRunner$7.evaluate(RandomizedRunner.java:894)
>      [mvn] 	at com.carrotsearch.randomizedtesting.rules.StatementAdapter.evaluate(StatementAdapter.java:36)
>      [mvn] 	at com.carrotsearch.randomizedtesting.rules.SystemPropertiesRestoreRule$1.evaluate(SystemPropertiesRestoreRule.java:57)
>      [mvn] 	at org.junit.rules.RunRules.evaluate(RunRules.java:20)
>      [mvn] 	at org.apache.lucene.util.AbstractBeforeAfterRule$1.evaluate(AbstractBeforeAfterRule.java:45)
>      [mvn] 	at com.carrotsearch.randomizedtesting.rules.StatementAdapter.evaluate(StatementAdapter.java:36)
>      [mvn] 	at org.apache.lucene.util.TestRuleStoreClassName$1.evaluate(TestRuleStoreClassName.java:41)
>      [mvn] 	at com.carrotsearch.randomizedtesting.rules.NoShadowingOrOverridesOnMethodsRule$1.evaluate(NoShadowingOrOverridesOnMethodsRule.java:40)
>      [mvn] 	at com.carrotsearch.randomizedtesting.rules.NoShadowingOrOverridesOnMethodsRule$1.evaluate(NoShadowingOrOverridesOnMethodsRule.java:40)
>      [mvn] 	at com.carrotsearch.randomizedtesting.rules.StatementAdapter.evaluate(StatementAdapter.java:36)
>      [mvn] 	at com.carrotsearch.randomizedtesting.rules.StatementAdapter.evaluate(StatementAdapter.java:36)
>      [mvn] 	at com.carrotsearch.randomizedtesting.rules.StatementAdapter.evaluate(StatementAdapter.java:36)
>      [mvn] 	at org.apache.lucene.util.TestRuleAssertionsRequired$1.evaluate(TestRuleAssertionsRequired.java:53)
>      [mvn] 	at org.apache.lucene.util.TestRuleMarkFailure$1.evaluate(TestRuleMarkFailure.java:47)
>      [mvn] 	at org.apache.lucene.util.TestRuleIgnoreAfterMaxFailures$1.evaluate(TestRuleIgnoreAfterMaxFailures.java:64)
>      [mvn] 	at org.apache.lucene.util.TestRuleIgnoreTestSuites$1.evaluate(TestRuleIgnoreTestSuites.java:54)
>      [mvn] 	at org.junit.rules.RunRules.evaluate(RunRules.java:20)
>      [mvn] 	at com.carrotsearch.randomizedtesting.rules.StatementAdapter.evaluate(StatementAdapter.java:36)
>      [mvn] 	at com.carrotsearch.randomizedtesting.ThreadLeakControl$StatementRunner.run(ThreadLeakControl.java:368)
>      [mvn] 	at java.lang.Thread.run(Thread.java:748)
>      [mvn] 
>      [mvn] org.apache.solr.common.util.ObjectReleaseTracker$ObjectTrackerException: org.apache.solr.client.solrj.impl.Http2SolrClient
>      [mvn] 	at org.apache.solr.common.util.ObjectReleaseTracker.track(ObjectReleaseTracker.java:42)
>      [mvn] 	at org.apache.solr.client.solrj.impl.Http2SolrClient.<init>(Http2SolrClient.java:161)
>      [mvn] 	at org.apache.solr.client.solrj.impl.Http2SolrClient$Builder.build(Http2SolrClient.java:840)
>      [mvn] 	at org.apache.solr.update.UpdateShardHandler.<init>(UpdateShardHandler.java:133)
>      [mvn] 	at org.apache.solr.core.CoreContainer.load(CoreContainer.java:690)
>      [mvn] 	at org.apache.solr.util.TestHarness.<init>(TestHarness.java:184)
>      [mvn] 	at org.apache.solr.util.TestHarness.<init>(TestHarness.java:156)
>      [mvn] 	at org.apache.solr.util.TestHarness.<init>(TestHarness.java:162)
>      [mvn] 	at org.apache.solr.util.TestHarness.<init>(TestHarness.java:112)
>      [mvn] 	at org.apache.solr.SolrTestCaseJ4.createCore(SolrTestCaseJ4.java:812)
>      [mvn] 	at org.apache.solr.SolrTestCaseJ4.initCore(SolrTestCaseJ4.java:802)
>      [mvn] 	at org.apache.solr.SolrTestCaseJ4.initCore(SolrTestCaseJ4.java:663)
>      [mvn] 	at org.apache.solr.velocity.VelocityResponseWriterTest.beforeClass(VelocityResponseWriterTest.java:41)
>      [mvn] 	at sun.reflect.NativeMethodAccessorImpl.invoke0(Native Method)
>      [mvn] 	at sun.reflect.NativeMethodAccessorImpl.invoke(NativeMethodAccessorImpl.java:62)
>      [mvn] 	at sun.reflect.DelegatingMethodAccessorImpl.invoke(DelegatingMethodAccessorImpl.java:43)
>      [mvn] 	at java.lang.reflect.Method.invoke(Method.java:498)
>      [mvn] 	at com.carrotsearch.randomizedtesting.RandomizedRunner.invoke(RandomizedRunner.java:1750)
>      [mvn] 	at com.carrotsearch.randomizedtesting.RandomizedRunner$6.evaluate(RandomizedRunner.java:878)
>      [mvn] 	at com.carrotsearch.randomizedtesting.RandomizedRunner$7.evaluate(RandomizedRunner.java:894)
>      [mvn] 	at com.carrotsearch.randomizedtesting.rules.StatementAdapter.evaluate(StatementAdapter.java:36)
>      [mvn] 	at com.carrotsearch.randomizedtesting.rules.SystemPropertiesRestoreRule$1.evaluate(SystemPropertiesRestoreRule.java:57)
>      [mvn] 	at org.junit.rules.RunRules.evaluate(RunRules.java:20)
>      [mvn] 	at org.apache.lucene.util.AbstractBeforeAfterRule$1.evaluate(AbstractBeforeAfterRule.java:45)
>      [mvn] 	at com.carrotsearch.randomizedtesting.rules.StatementAdapter.evaluate(StatementAdapter.java:36)
>      [mvn] 	at org.apache.lucene.util.TestRuleStoreClassName$1.evaluate(TestRuleStoreClassName.java:41)
>      [mvn] 	at com.carrotsearch.randomizedtesting.rules.NoShadowingOrOverridesOnMethodsRule$1.evaluate(NoShadowingOrOverridesOnMethodsRule.java:40)
>      [mvn] 	at com.carrotsearch.randomizedtesting.rules.NoShadowingOrOverridesOnMethodsRule$1.evaluate(NoShadowingOrOverridesOnMethodsRule.java:40)
>      [mvn] 	at com.carrotsearch.randomizedtesting.rules.StatementAdapter.evaluate(StatementAdapter.java:36)
>      [mvn] 	at com.carrotsearch.randomizedtesting.rules.StatementAdapter.evaluate(StatementAdapter.java:36)
>      [mvn] 	at com.carrotsearch.randomizedtesting.rules.StatementAdapter.evaluate(StatementAdapter.java:36)
>      [mvn] 	at org.apache.lucene.util.TestRuleAssertionsRequired$1.evaluate(TestRuleAssertionsRequired.java:53)
>      [mvn] 	at org.apache.lucene.util.TestRuleMarkFailure$1.evaluate(TestRuleMarkFailure.java:47)
>      [mvn] 	at org.apache.lucene.util.TestRuleIgnoreAfterMaxFailures$1.evaluate(TestRuleIgnoreAfterMaxFailures.java:64)
>      [mvn] 	at org.apache.lucene.util.TestRuleIgnoreTestSuites$1.evaluate(TestRuleIgnoreTestSuites.java:54)
>      [mvn] 	at org.junit.rules.RunRules.evaluate(RunRules.java:20)
>      [mvn] 	at com.carrotsearch.randomizedtesting.rules.StatementAdapter.evaluate(StatementAdapter.java:36)
>      [mvn] 	at com.carrotsearch.randomizedtesting.ThreadLeakControl$StatementRunner.run(ThreadLeakControl.java:368)
>      [mvn] 	at java.lang.Thread.run(Thread.java:748)
>      [mvn] 
>      [mvn] >
>      [mvn] 
>      [mvn] Tests in error: 
>      [mvn]   VelocityResponseWriterTest.beforeClass:41->SolrTestCaseJ4.initCore:663->SolrTestCaseJ4.initCore:802->SolrTestCaseJ4.createCore:812 » Runtime
>      [mvn]   VelocityResponseWriterTest.org.apache.solr.velocity.VelocityResponseWriterTest » ThreadLeak
>      [mvn]   VelocityResponseWriterTest.org.apache.solr.velocity.VelocityResponseWriterTest » ThreadLeak
>      [mvn] 
>      [mvn] Tests run: 4, Failures: 1, Errors: 3, Skipped: 0
>      [mvn] 
>      [mvn] [INFO] ------------------------------------------------------------------------
>      [mvn] [INFO] Building Apache Solr Contrib aggregator POM
>      [mvn] [INFO]    task-segment: [install]
>      [mvn] [INFO] ------------------------------------------------------------------------
>      [mvn] [INFO] [groovy:execute {execution: generate-timestamps-and-get-top-level-basedir}]
>      [mvn] [INFO] [buildnumber:create {execution: default}]
>      [mvn] [INFO] [enforcer:enforce {execution: enforce-java-compat-version-and-maven-2.2.1}]
>      [mvn] [INFO] [remote-resources:process {execution: default}]
>      [mvn] [INFO] [bundle:manifest {execution: bundle-manifest}]
>      [mvn] [WARNING] Ignoring project type pom - supportedProjectTypes = [jar, bundle]
>      [mvn] [INFO] [site:attach-descriptor {execution: default-attach-descriptor}]
>      [mvn] [WARNING] DEPRECATED [failOnUnresolvableSignatures]: The setting 'failOnUnresolvableSignatures' was deprecated and will be removed in next version. Use 'ignoreSignaturesOfMissingClasses' instead.
>      [mvn] [INFO] [forbiddenapis:check {execution: solr-shared-check-forbidden-apis}]
>      [mvn] [INFO] Skipping execution for packaging "pom"
>      [mvn] [WARNING] DEPRECATED [failOnUnresolvableSignatures]: The setting 'failOnUnresolvableSignatures' was deprecated and will be removed in next version. Use 'ignoreSignaturesOfMissingClasses' instead.
>      [mvn] [INFO] [forbiddenapis:testCheck {execution: solr-shared-test-check-forbidden-apis}]
>      [mvn] [INFO] Skipping execution for packaging "pom"
>      [mvn] [INFO] [install:install {execution: default-install}]
>      [mvn] [INFO] Installing /Users/me/mysolr/maven-build/solr/contrib/pom.xml to /Users/me/.m2/repository/org/apache/solr/solr-contrib-aggregator/8.8.2-ANCESTRY_1.0.0/solr-contrib-aggregator-8.8.2-ANCESTRY_1.0.0.pom
>      [mvn] [INFO] 
>      [mvn] [INFO] 
>      [mvn] [INFO] ------------------------------------------------------------------------
>      [mvn] [INFO] Reactor Summary:
>      [mvn] [INFO] ------------------------------------------------------------------------
>      [mvn] [INFO] Grandparent POM for Apache Lucene Core and Apache Solr  SUCCESS [3.955s]
>      [mvn] [INFO] Lucene parent POM ..................................... SUCCESS [0.065s]
>      [mvn] [INFO] Lucene Core ........................................... SUCCESS [14.637s]
>      [mvn] [INFO] Lucene codecs ......................................... SUCCESS [1.961s]
>      [mvn] [INFO] Lucene Test Framework ................................. SUCCESS [30.743s]
>      [mvn] [INFO] Lucene Core tests ..................................... SUCCESS [5:15.110s]
>      [mvn] [INFO] Lucene Core aggregator POM ............................ SUCCESS [0.031s]
>      [mvn] [INFO] Lucene Memory ......................................... SUCCESS [1:10.329s]
>      [mvn] [INFO] Lucene codecs tests ................................... SUCCESS [45.263s]
>      [mvn] [INFO] Lucene codecs aggregator POM .......................... SUCCESS [0.034s]
>      [mvn] [INFO] Lucene Common Analyzers ............................... SUCCESS [1:32.545s]
>      [mvn] [INFO] Lucene ICU Analysis Components ........................ SUCCESS [6.635s]
>      [mvn] [INFO] Lucene Kuromoji Japanese Morphological Analyzer ....... SUCCESS [7.887s]
>      [mvn] [INFO] Lucene Morfologik Polish Lemmatizer ................... SUCCESS [1.678s]
>      [mvn] [INFO] Lucene Nori Korean Morphological Analyzer ............. SUCCESS [5.318s]
>      [mvn] [INFO] Lucene OpenNLP integration ............................ SUCCESS [2.191s]
>      [mvn] [INFO] Lucene Phonetic Filters ............................... SUCCESS [3.903s]
>      [mvn] [INFO] Lucene Smart Chinese Analyzer ......................... SUCCESS [1.908s]
>      [mvn] [INFO] Lucene Stempel Analyzer ............................... SUCCESS [1.763s]
>      [mvn] [INFO] Lucene Analysis Modules aggregator POM ................ SUCCESS [0.027s]
>      [mvn] [INFO] Lucene Expressions .................................... SUCCESS [4.128s]
>      [mvn] [INFO] Lucene Queries ........................................ SUCCESS [10.376s]
>      [mvn] [INFO] Lucene Facets ......................................... SUCCESS [15.630s]
>      [mvn] [INFO] Lucene Sandbox ........................................ SUCCESS [11.570s]
>      [mvn] [INFO] Lucene QueryParsers ................................... SUCCESS [10.263s]
>      [mvn] [INFO] Lucene Memory ......................................... SUCCESS [2.449s]
>      [mvn] [INFO] Lucene Highlighter .................................... SUCCESS [14.043s]
>      [mvn] [INFO] Lucene Join ........................................... SUCCESS [5.551s]
>      [mvn] [INFO] Lucene Spatial 3D ..................................... SUCCESS [9.138s]
>      [mvn] [INFO] Lucene Spatial Extras ................................. SUCCESS [43.082s]
>      [mvn] [INFO] Lucene Benchmark ...................................... SUCCESS [12.488s]
>      [mvn] [INFO] Lucene Grouping ....................................... SUCCESS [6.115s]
>      [mvn] [INFO] Lucene Classification ................................. SUCCESS [4.596s]
>      [mvn] [INFO] Lucene Demo ........................................... SUCCESS [3.191s]
>      [mvn] [INFO] Lucene Miscellaneous .................................. SUCCESS [7.490s]
>      [mvn] [INFO] Lucene Monitor ........................................ SUCCESS [11.210s]
>      [mvn] [INFO] Lucene Replicator ..................................... SUCCESS [13.465s]
>      [mvn] [INFO] Lucene Suggest ........................................ SUCCESS [14.478s]
>      [mvn] [INFO] Apache Solr parent POM ................................ SUCCESS [0.026s]
>      [mvn] [INFO] Apache Solr Solrj ..................................... SUCCESS [7.475s]
>      [mvn] [INFO] Apache Solr Core ...................................... SUCCESS [16.640s]
>      [mvn] [INFO] Apache Solr Test Framework ............................ SUCCESS [1.411s]
>      [mvn] [INFO] Apache Solr Analysis Extras ........................... FAILED [1:16.927s]
>      [mvn] [INFO] Apache Solr Core tests ................................ SKIPPED (dependency build failed or was skipped)
>      [mvn] [INFO] Apache Solr Core aggregator POM ....................... SUCCESS [0.032s]
>      [mvn] [INFO] Apache Solr Solrj tests ............................... FAILED [1:24.610s]
>      [mvn] [INFO] Apache Solr Solrj aggregator POM ...................... SUCCESS [0.031s]
>      [mvn] [INFO] Apache Solr Analytics Package ......................... FAILED [1:22.612s]
>      [mvn] [INFO] Apache Solr DataImportHandler ......................... FAILED [1:19.550s]
>      [mvn] [INFO] Apache Solr DataImportHandler Extras .................. SKIPPED (dependency build failed or was skipped)
>      [mvn] [INFO] Apache Solr Content Extraction Library ................ FAILED [1:16.940s]
>      [mvn] [INFO] Apache Solr Jaeger Tracer Configurator Package ........ FAILED [2:49.169s]
>      [mvn] [INFO] Apache Solr Language Identifier ....................... FAILED [1:16.688s]
>      [mvn] [INFO] Apache Solr Learning to Rank Package .................. FAILED [1:19.287s]
>      [mvn] [INFO] Apache Solr Prometheus Exporter Package ............... FAILED [1:20.630s]
>      [mvn] [INFO] Apache Solr Velocity .................................. FAILED [1:16.657s]
>      [mvn] [INFO] Apache Solr Contrib aggregator POM .................... SUCCESS [0.033s]
>      [mvn] [INFO] ------------------------------------------------------------------------
>      [mvn] [INFO] Error for project: Apache Solr Analysis Extras (during install)
>      [mvn] [INFO] ------------------------------------------------------------------------
>      [mvn] [INFO] There are test failures.
>      [mvn] 
>      [mvn] Please refer to /Users/me/mysolr/maven-build/solr/contrib/analysis-extras/target/surefire-reports for the individual test results.
>      [mvn] [INFO] ------------------------------------------------------------------------
>      [mvn] [INFO] Error for project: Apache Solr Solrj tests (during install)
>      [mvn] [INFO] ------------------------------------------------------------------------
>      [mvn] [INFO] There are test failures.
>      [mvn] 
>      [mvn] Please refer to /Users/me/mysolr/maven-build/solr/solrj/src/test/target/surefire-reports for the individual test results.
>      [mvn] [INFO] ------------------------------------------------------------------------
>      [mvn] [INFO] Error for project: Apache Solr Analytics Package (during install)
>      [mvn] [INFO] ------------------------------------------------------------------------
>      [mvn] [INFO] There are test failures.
>      [mvn] 
>      [mvn] Please refer to /Users/me/mysolr/maven-build/solr/contrib/analytics/target/surefire-reports for the individual test results.
>      [mvn] [INFO] ------------------------------------------------------------------------
>      [mvn] [INFO] Error for project: Apache Solr DataImportHandler (during install)
>      [mvn] [INFO] ------------------------------------------------------------------------
>      [mvn] [INFO] There are test failures.
>      [mvn] 
>      [mvn] Please refer to /Users/me/mysolr/maven-build/solr/contrib/dataimporthandler/target/surefire-reports for the individual test results.
>      [mvn] [INFO] ------------------------------------------------------------------------
>      [mvn] [INFO] Error for project: Apache Solr Content Extraction Library (during install)
>      [mvn] [INFO] ------------------------------------------------------------------------
>      [mvn] [INFO] There are test failures.
>      [mvn] 
>      [mvn] Please refer to /Users/me/mysolr/maven-build/solr/contrib/extraction/target/surefire-reports for the individual test results.
>      [mvn] [INFO] ------------------------------------------------------------------------
>      [mvn] [INFO] Error for project: Apache Solr Jaeger Tracer Configurator Package (during install)
>      [mvn] [INFO] ------------------------------------------------------------------------
>      [mvn] [INFO] There are test failures.
>      [mvn] 
>      [mvn] Please refer to /Users/me/mysolr/maven-build/solr/contrib/jaegertracer-configurator/target/surefire-reports for the individual test results.
>      [mvn] [INFO] ------------------------------------------------------------------------
>      [mvn] [INFO] Error for project: Apache Solr Language Identifier (during install)
>      [mvn] [INFO] ------------------------------------------------------------------------
>      [mvn] [INFO] There are test failures.
>      [mvn] 
>      [mvn] Please refer to /Users/me/mysolr/maven-build/solr/contrib/langid/target/surefire-reports for the individual test results.
>      [mvn] [INFO] ------------------------------------------------------------------------
>      [mvn] [INFO] Error for project: Apache Solr Learning to Rank Package (during install)
>      [mvn] [INFO] ------------------------------------------------------------------------
>      [mvn] [INFO] There are test failures.
>      [mvn] 
>      [mvn] Please refer to /Users/me/mysolr/maven-build/solr/contrib/ltr/target/surefire-reports for the individual test results.
>      [mvn] [INFO] ------------------------------------------------------------------------
>      [mvn] [INFO] Error for project: Apache Solr Prometheus Exporter Package (during install)
>      [mvn] [INFO] ------------------------------------------------------------------------
>      [mvn] [INFO] There are test failures.
>      [mvn] 
>      [mvn] Please refer to /Users/me/mysolr/maven-build/solr/contrib/prometheus-exporter/target/surefire-reports for the individual test results.
>      [mvn] [INFO] ------------------------------------------------------------------------
>      [mvn] [INFO] Error for project: Apache Solr Velocity (during install)
>      [mvn] [INFO] ------------------------------------------------------------------------
>      [mvn] [INFO] There are test failures.
>      [mvn] 
>      [mvn] Please refer to /Users/me/mysolr/maven-build/solr/contrib/velocity/target/surefire-reports for the individual test results.
>      [mvn] [INFO] ------------------------------------------------------------------------
>      [mvn] [INFO] For more information, run Maven with the -e switch
>      [mvn] [INFO] ------------------------------------------------------------------------
>      [mvn] [INFO] BUILD ERRORS
>      [mvn] [INFO] ------------------------------------------------------------------------
>      [mvn] [INFO] Total time: 28 minutes 34 seconds
>      [mvn] [INFO] Finished at: Tue Apr 20 11:43:02 MDT 2021
>      [mvn] [INFO] Final Memory: 430M/3383M
>      [mvn] [INFO] ------------------------------------------------------------------------
> 
> BUILD FAILED
> : Java returned: 1
> 
> Total time: 28 minutes 49 seconds
> 
>> On Apr 20, 2021, at 12:09 PM, Phill Campbell <si...@yahoo.com.INVALID> wrote:
>> 
>> I meant to say junit, not nunit below.
>> So, a friend suggested trying the maven build instead of ant.
>> I run the “Apache Solr Core tests” and there are failures. 
>> 
>> Are my expectations wrong that all tests should pass?
>> Is there a subset of tests that are really the tests that matter?
>> 
>> Maybe the only tests that matter are the ones in the subdirectory “Solr”?
>> 
>> I don’t know if it is my development environment, my expectations, or what I need to focus on.
>> 
>> Thank you.
>> 
>>> On Apr 19, 2021, at 9:32 AM, Phill Campbell <si...@yahoo.com.INVALID> wrote:
>>> 
>>> This is not an Apache Solr question. This is a developer environment question. I apologize for my lack of knowledge with ANT.
>>> 
>>> 
>>> $ant common.test
>>> 
>>> ...
>>> 
>>> -test:
>>> [junit4] <JUnit4> says jolly good day! Master seed: 3510B76A25B8399C
>>> 
>>> BUILD FAILED
>>> /development/solr/lucene/common-build.xml:1599: The following error occurred while executing this line:
>>> /development/solr//lucene/common-build.xml:1126: Reference junit.classpath not found.
>>> 
>>> Total time: 3 minutes 20 seconds
>>> 
>>> 
>>> 
>>> I have tried adding a CLASSPATH environment variable.
>>> I have tried placing nunit	jars in /Library/Java/Exentions and the “user” equivalent location as well.
>>> 
>>> 
>>> 
>>> 
>>> Common-build.xml
>>> 
>>> Line 1126 is the “>” on the last line of this snippet:
>>> 
>>> <junit4:junit4
>>>  taskName="junit4"
>>>  dir="@{workDir}"
>>>  tempdir="@{workDir}/temp"
>>>  maxmemory="${tests.heapsize}"
>>> 
>>>  statsPropertyPrefix="junit4.stats"
>>> 
>>>  parallelism="@{threadNum}"
>>> 
>>>  printSummary="true"
>>>  haltonfailure="${tests.haltonfailure}" 
>>>  failureProperty="tests.failed"
>>> 
>>>  dynamicAssignmentRatio="${tests.dynamicAssignmentRatio}"
>>>  shuffleOnSlave="true"
>>>  leaveTemporary="${junit4.leaveTemporary}"
>>>  seed="${tests.seed}"
>>>  onNonEmptyWorkDirectory="wipe"
>>> 
>>>  heartbeat="${tests.heartbeat}"
>>>  uniqueSuiteNames="false"
>>> 
>>>  debugstream="false”
>>>> 
>>> 
>>> 
>>> 
>>> Line 1599 (<test-macro threadNum="${tests.jvms.override}" />)
>>> 
>>> <!-- Run the actual tests (must be wrapped with -init-totals, -check-totals) -->
>>> <target name="-test">
>>> <mkdir dir="${junit.output.dir}"/>
>>> <test-macro threadNum="${tests.jvms.override}" />
>>> </target>
>>> 
>>> 
>>> I don’t know if I have a system configuration problem, or if I am running the ANT scripts incorrectly.
>>> 
>>> Any help appreciated.
>>> 
>> 
> 


Re: BUILD FAILED - Solr 8 on Mac OS Catalina

Posted by Phill Campbell <si...@yahoo.com.INVALID>.
      [mvn] org.apache.solr.common.util.ObjectReleaseTracker$ObjectTrackerException: org.apache.solr.client.solrj.impl.Http2SolrClient
      [mvn] 	at org.apache.solr.common.util.ObjectReleaseTracker.track(ObjectReleaseTracker.java:42)
      [mvn] 	at org.apache.solr.client.solrj.impl.Http2SolrClient.<init>(Http2SolrClient.java:161)
      [mvn] 	at org.apache.solr.client.solrj.impl.Http2SolrClient$Builder.build(Http2SolrClient.java:840)
      [mvn] 	at org.apache.solr.handler.component.HttpShardHandlerFactory.init(HttpShardHandlerFactory.java:319)
      [mvn] 	at org.apache.solr.handler.component.ShardHandlerFactory.newInstance(ShardHandlerFactory.java:51)
      [mvn] 	at org.apache.solr.core.CoreContainer.load(CoreContainer.java:684)
      [mvn] 	at org.apache.solr.util.TestHarness.<init>(TestHarness.java:184)
      [mvn] 	at org.apache.solr.util.TestHarness.<init>(TestHarness.java:156)
      [mvn] 	at org.apache.solr.util.TestHarness.<init>(TestHarness.java:162)
      [mvn] 	at org.apache.solr.util.TestHarness.<init>(TestHarness.java:112)
      [mvn] 	at org.apache.solr.SolrTestCaseJ4.createCore(SolrTestCaseJ4.java:812)
      [mvn] 	at org.apache.solr.SolrTestCaseJ4.initCore(SolrTestCaseJ4.java:802)
      [mvn] 	at org.apache.solr.SolrTestCaseJ4.initCore(SolrTestCaseJ4.java:663)
      [mvn] 	at org.apache.solr.velocity.VelocityResponseWriterTest.beforeClass(VelocityResponseWriterTest.java:41)
      [mvn] 	at sun.reflect.NativeMethodAccessorImpl.invoke0(Native Method)
      [mvn] 	at sun.reflect.NativeMethodAccessorImpl.invoke(NativeMethodAccessorImpl.java:62)
      [mvn] 	at sun.reflect.DelegatingMethodAccessorImpl.invoke(DelegatingMethodAccessorImpl.java:43)
      [mvn] 	at java.lang.reflect.Method.invoke(Method.java:498)
      [mvn] 	at com.carrotsearch.randomizedtesting.RandomizedRunner.invoke(RandomizedRunner.java:1750)
      [mvn] 	at com.carrotsearch.randomizedtesting.RandomizedRunner$6.evaluate(RandomizedRunner.java:878)
      [mvn] 	at com.carrotsearch.randomizedtesting.RandomizedRunner$7.evaluate(RandomizedRunner.java:894)
      [mvn] 	at com.carrotsearch.randomizedtesting.rules.StatementAdapter.evaluate(StatementAdapter.java:36)
      [mvn] 	at com.carrotsearch.randomizedtesting.rules.SystemPropertiesRestoreRule$1.evaluate(SystemPropertiesRestoreRule.java:57)
      [mvn] 	at org.junit.rules.RunRules.evaluate(RunRules.java:20)
      [mvn] 	at org.apache.lucene.util.AbstractBeforeAfterRule$1.evaluate(AbstractBeforeAfterRule.java:45)
      [mvn] 	at com.carrotsearch.randomizedtesting.rules.StatementAdapter.evaluate(StatementAdapter.java:36)
      [mvn] 	at org.apache.lucene.util.TestRuleStoreClassName$1.evaluate(TestRuleStoreClassName.java:41)
      [mvn] 	at com.carrotsearch.randomizedtesting.rules.NoShadowingOrOverridesOnMethodsRule$1.evaluate(NoShadowingOrOverridesOnMethodsRule.java:40)
      [mvn] 	at com.carrotsearch.randomizedtesting.rules.NoShadowingOrOverridesOnMethodsRule$1.evaluate(NoShadowingOrOverridesOnMethodsRule.java:40)
      [mvn] 	at com.carrotsearch.randomizedtesting.rules.StatementAdapter.evaluate(StatementAdapter.java:36)
      [mvn] 	at com.carrotsearch.randomizedtesting.rules.StatementAdapter.evaluate(StatementAdapter.java:36)
      [mvn] 	at com.carrotsearch.randomizedtesting.rules.StatementAdapter.evaluate(StatementAdapter.java:36)
      [mvn] 	at org.apache.lucene.util.TestRuleAssertionsRequired$1.evaluate(TestRuleAssertionsRequired.java:53)
      [mvn] 	at org.apache.lucene.util.TestRuleMarkFailure$1.evaluate(TestRuleMarkFailure.java:47)
      [mvn] 	at org.apache.lucene.util.TestRuleIgnoreAfterMaxFailures$1.evaluate(TestRuleIgnoreAfterMaxFailures.java:64)
      [mvn] 	at org.apache.lucene.util.TestRuleIgnoreTestSuites$1.evaluate(TestRuleIgnoreTestSuites.java:54)
      [mvn] 	at org.junit.rules.RunRules.evaluate(RunRules.java:20)
      [mvn] 	at com.carrotsearch.randomizedtesting.rules.StatementAdapter.evaluate(StatementAdapter.java:36)
      [mvn] 	at com.carrotsearch.randomizedtesting.ThreadLeakControl$StatementRunner.run(ThreadLeakControl.java:368)
      [mvn] 	at java.lang.Thread.run(Thread.java:748)
      [mvn] 
      [mvn] org.apache.solr.common.util.ObjectReleaseTracker$ObjectTrackerException: org.apache.http.impl.client.InternalHttpClient
      [mvn] 	at org.apache.solr.common.util.ObjectReleaseTracker.track(ObjectReleaseTracker.java:42)
      [mvn] 	at org.apache.solr.client.solrj.impl.HttpClientUtil.createClient(HttpClientUtil.java:339)
      [mvn] 	at org.apache.solr.update.UpdateShardHandler.<init>(UpdateShardHandler.java:124)
      [mvn] 	at org.apache.solr.core.CoreContainer.load(CoreContainer.java:690)
      [mvn] 	at org.apache.solr.util.TestHarness.<init>(TestHarness.java:184)
      [mvn] 	at org.apache.solr.util.TestHarness.<init>(TestHarness.java:156)
      [mvn] 	at org.apache.solr.util.TestHarness.<init>(TestHarness.java:162)
      [mvn] 	at org.apache.solr.util.TestHarness.<init>(TestHarness.java:112)
      [mvn] 	at org.apache.solr.SolrTestCaseJ4.createCore(SolrTestCaseJ4.java:812)
      [mvn] 	at org.apache.solr.SolrTestCaseJ4.initCore(SolrTestCaseJ4.java:802)
      [mvn] 	at org.apache.solr.SolrTestCaseJ4.initCore(SolrTestCaseJ4.java:663)
      [mvn] 	at org.apache.solr.velocity.VelocityResponseWriterTest.beforeClass(VelocityResponseWriterTest.java:41)
      [mvn] 	at sun.reflect.NativeMethodAccessorImpl.invoke0(Native Method)
      [mvn] 	at sun.reflect.NativeMethodAccessorImpl.invoke(NativeMethodAccessorImpl.java:62)
      [mvn] 	at sun.reflect.DelegatingMethodAccessorImpl.invoke(DelegatingMethodAccessorImpl.java:43)
      [mvn] 	at java.lang.reflect.Method.invoke(Method.java:498)
      [mvn] 	at com.carrotsearch.randomizedtesting.RandomizedRunner.invoke(RandomizedRunner.java:1750)
      [mvn] 	at com.carrotsearch.randomizedtesting.RandomizedRunner$6.evaluate(RandomizedRunner.java:878)
      [mvn] 	at com.carrotsearch.randomizedtesting.RandomizedRunner$7.evaluate(RandomizedRunner.java:894)
      [mvn] 	at com.carrotsearch.randomizedtesting.rules.StatementAdapter.evaluate(StatementAdapter.java:36)
      [mvn] 	at com.carrotsearch.randomizedtesting.rules.SystemPropertiesRestoreRule$1.evaluate(SystemPropertiesRestoreRule.java:57)
      [mvn] 	at org.junit.rules.RunRules.evaluate(RunRules.java:20)
      [mvn] 	at org.apache.lucene.util.AbstractBeforeAfterRule$1.evaluate(AbstractBeforeAfterRule.java:45)
      [mvn] 	at com.carrotsearch.randomizedtesting.rules.StatementAdapter.evaluate(StatementAdapter.java:36)
      [mvn] 	at org.apache.lucene.util.TestRuleStoreClassName$1.evaluate(TestRuleStoreClassName.java:41)
      [mvn] 	at com.carrotsearch.randomizedtesting.rules.NoShadowingOrOverridesOnMethodsRule$1.evaluate(NoShadowingOrOverridesOnMethodsRule.java:40)
      [mvn] 	at com.carrotsearch.randomizedtesting.rules.NoShadowingOrOverridesOnMethodsRule$1.evaluate(NoShadowingOrOverridesOnMethodsRule.java:40)
      [mvn] 	at com.carrotsearch.randomizedtesting.rules.StatementAdapter.evaluate(StatementAdapter.java:36)
      [mvn] 	at com.carrotsearch.randomizedtesting.rules.StatementAdapter.evaluate(StatementAdapter.java:36)
      [mvn] 	at com.carrotsearch.randomizedtesting.rules.StatementAdapter.evaluate(StatementAdapter.java:36)
      [mvn] 	at org.apache.lucene.util.TestRuleAssertionsRequired$1.evaluate(TestRuleAssertionsRequired.java:53)
      [mvn] 	at org.apache.lucene.util.TestRuleMarkFailure$1.evaluate(TestRuleMarkFailure.java:47)
      [mvn] 	at org.apache.lucene.util.TestRuleIgnoreAfterMaxFailures$1.evaluate(TestRuleIgnoreAfterMaxFailures.java:64)
      [mvn] 	at org.apache.lucene.util.TestRuleIgnoreTestSuites$1.evaluate(TestRuleIgnoreTestSuites.java:54)
      [mvn] 	at org.junit.rules.RunRules.evaluate(RunRules.java:20)
      [mvn] 	at com.carrotsearch.randomizedtesting.rules.StatementAdapter.evaluate(StatementAdapter.java:36)
      [mvn] 	at com.carrotsearch.randomizedtesting.ThreadLeakControl$StatementRunner.run(ThreadLeakControl.java:368)
      [mvn] 	at java.lang.Thread.run(Thread.java:748)
      [mvn] 
      [mvn] org.apache.solr.common.util.ObjectReleaseTracker$ObjectTrackerException: org.apache.solr.client.solrj.impl.Http2SolrClient
      [mvn] 	at org.apache.solr.common.util.ObjectReleaseTracker.track(ObjectReleaseTracker.java:42)
      [mvn] 	at org.apache.solr.client.solrj.impl.Http2SolrClient.<init>(Http2SolrClient.java:161)
      [mvn] 	at org.apache.solr.client.solrj.impl.Http2SolrClient$Builder.build(Http2SolrClient.java:840)
      [mvn] 	at org.apache.solr.update.UpdateShardHandler.<init>(UpdateShardHandler.java:133)
      [mvn] 	at org.apache.solr.core.CoreContainer.load(CoreContainer.java:690)
      [mvn] 	at org.apache.solr.util.TestHarness.<init>(TestHarness.java:184)
      [mvn] 	at org.apache.solr.util.TestHarness.<init>(TestHarness.java:156)
      [mvn] 	at org.apache.solr.util.TestHarness.<init>(TestHarness.java:162)
      [mvn] 	at org.apache.solr.util.TestHarness.<init>(TestHarness.java:112)
      [mvn] 	at org.apache.solr.SolrTestCaseJ4.createCore(SolrTestCaseJ4.java:812)
      [mvn] 	at org.apache.solr.SolrTestCaseJ4.initCore(SolrTestCaseJ4.java:802)
      [mvn] 	at org.apache.solr.SolrTestCaseJ4.initCore(SolrTestCaseJ4.java:663)
      [mvn] 	at org.apache.solr.velocity.VelocityResponseWriterTest.beforeClass(VelocityResponseWriterTest.java:41)
      [mvn] 	at sun.reflect.NativeMethodAccessorImpl.invoke0(Native Method)
      [mvn] 	at sun.reflect.NativeMethodAccessorImpl.invoke(NativeMethodAccessorImpl.java:62)
      [mvn] 	at sun.reflect.DelegatingMethodAccessorImpl.invoke(DelegatingMethodAccessorImpl.java:43)
      [mvn] 	at java.lang.reflect.Method.invoke(Method.java:498)
      [mvn] 	at com.carrotsearch.randomizedtesting.RandomizedRunner.invoke(RandomizedRunner.java:1750)
      [mvn] 	at com.carrotsearch.randomizedtesting.RandomizedRunner$6.evaluate(RandomizedRunner.java:878)
      [mvn] 	at com.carrotsearch.randomizedtesting.RandomizedRunner$7.evaluate(RandomizedRunner.java:894)
      [mvn] 	at com.carrotsearch.randomizedtesting.rules.StatementAdapter.evaluate(StatementAdapter.java:36)
      [mvn] 	at com.carrotsearch.randomizedtesting.rules.SystemPropertiesRestoreRule$1.evaluate(SystemPropertiesRestoreRule.java:57)
      [mvn] 	at org.junit.rules.RunRules.evaluate(RunRules.java:20)
      [mvn] 	at org.apache.lucene.util.AbstractBeforeAfterRule$1.evaluate(AbstractBeforeAfterRule.java:45)
      [mvn] 	at com.carrotsearch.randomizedtesting.rules.StatementAdapter.evaluate(StatementAdapter.java:36)
      [mvn] 	at org.apache.lucene.util.TestRuleStoreClassName$1.evaluate(TestRuleStoreClassName.java:41)
      [mvn] 	at com.carrotsearch.randomizedtesting.rules.NoShadowingOrOverridesOnMethodsRule$1.evaluate(NoShadowingOrOverridesOnMethodsRule.java:40)
      [mvn] 	at com.carrotsearch.randomizedtesting.rules.NoShadowingOrOverridesOnMethodsRule$1.evaluate(NoShadowingOrOverridesOnMethodsRule.java:40)
      [mvn] 	at com.carrotsearch.randomizedtesting.rules.StatementAdapter.evaluate(StatementAdapter.java:36)
      [mvn] 	at com.carrotsearch.randomizedtesting.rules.StatementAdapter.evaluate(StatementAdapter.java:36)
      [mvn] 	at com.carrotsearch.randomizedtesting.rules.StatementAdapter.evaluate(StatementAdapter.java:36)
      [mvn] 	at org.apache.lucene.util.TestRuleAssertionsRequired$1.evaluate(TestRuleAssertionsRequired.java:53)
      [mvn] 	at org.apache.lucene.util.TestRuleMarkFailure$1.evaluate(TestRuleMarkFailure.java:47)
      [mvn] 	at org.apache.lucene.util.TestRuleIgnoreAfterMaxFailures$1.evaluate(TestRuleIgnoreAfterMaxFailures.java:64)
      [mvn] 	at org.apache.lucene.util.TestRuleIgnoreTestSuites$1.evaluate(TestRuleIgnoreTestSuites.java:54)
      [mvn] 	at org.junit.rules.RunRules.evaluate(RunRules.java:20)
      [mvn] 	at com.carrotsearch.randomizedtesting.rules.StatementAdapter.evaluate(StatementAdapter.java:36)
      [mvn] 	at com.carrotsearch.randomizedtesting.ThreadLeakControl$StatementRunner.run(ThreadLeakControl.java:368)
      [mvn] 	at java.lang.Thread.run(Thread.java:748)
      [mvn] 
      [mvn] >
      [mvn] 
      [mvn] Tests in error: 
      [mvn]   VelocityResponseWriterTest.beforeClass:41->SolrTestCaseJ4.initCore:663->SolrTestCaseJ4.initCore:802->SolrTestCaseJ4.createCore:812 » Runtime
      [mvn]   VelocityResponseWriterTest.org.apache.solr.velocity.VelocityResponseWriterTest » ThreadLeak
      [mvn]   VelocityResponseWriterTest.org.apache.solr.velocity.VelocityResponseWriterTest » ThreadLeak
      [mvn] 
      [mvn] Tests run: 4, Failures: 1, Errors: 3, Skipped: 0
      [mvn] 
      [mvn] [INFO] ------------------------------------------------------------------------
      [mvn] [INFO] Building Apache Solr Contrib aggregator POM
      [mvn] [INFO]    task-segment: [install]
      [mvn] [INFO] ------------------------------------------------------------------------
      [mvn] [INFO] [groovy:execute {execution: generate-timestamps-and-get-top-level-basedir}]
      [mvn] [INFO] [buildnumber:create {execution: default}]
      [mvn] [INFO] [enforcer:enforce {execution: enforce-java-compat-version-and-maven-2.2.1}]
      [mvn] [INFO] [remote-resources:process {execution: default}]
      [mvn] [INFO] [bundle:manifest {execution: bundle-manifest}]
      [mvn] [WARNING] Ignoring project type pom - supportedProjectTypes = [jar, bundle]
      [mvn] [INFO] [site:attach-descriptor {execution: default-attach-descriptor}]
      [mvn] [WARNING] DEPRECATED [failOnUnresolvableSignatures]: The setting 'failOnUnresolvableSignatures' was deprecated and will be removed in next version. Use 'ignoreSignaturesOfMissingClasses' instead.
      [mvn] [INFO] [forbiddenapis:check {execution: solr-shared-check-forbidden-apis}]
      [mvn] [INFO] Skipping execution for packaging "pom"
      [mvn] [WARNING] DEPRECATED [failOnUnresolvableSignatures]: The setting 'failOnUnresolvableSignatures' was deprecated and will be removed in next version. Use 'ignoreSignaturesOfMissingClasses' instead.
      [mvn] [INFO] [forbiddenapis:testCheck {execution: solr-shared-test-check-forbidden-apis}]
      [mvn] [INFO] Skipping execution for packaging "pom"
      [mvn] [INFO] [install:install {execution: default-install}]
      [mvn] [INFO] Installing /Users/me/mysolr/maven-build/solr/contrib/pom.xml to /Users/me/.m2/repository/org/apache/solr/solr-contrib-aggregator/8.8.2-ANCESTRY_1.0.0/solr-contrib-aggregator-8.8.2-ANCESTRY_1.0.0.pom
      [mvn] [INFO] 
      [mvn] [INFO] 
      [mvn] [INFO] ------------------------------------------------------------------------
      [mvn] [INFO] Reactor Summary:
      [mvn] [INFO] ------------------------------------------------------------------------
      [mvn] [INFO] Grandparent POM for Apache Lucene Core and Apache Solr  SUCCESS [3.955s]
      [mvn] [INFO] Lucene parent POM ..................................... SUCCESS [0.065s]
      [mvn] [INFO] Lucene Core ........................................... SUCCESS [14.637s]
      [mvn] [INFO] Lucene codecs ......................................... SUCCESS [1.961s]
      [mvn] [INFO] Lucene Test Framework ................................. SUCCESS [30.743s]
      [mvn] [INFO] Lucene Core tests ..................................... SUCCESS [5:15.110s]
      [mvn] [INFO] Lucene Core aggregator POM ............................ SUCCESS [0.031s]
      [mvn] [INFO] Lucene Memory ......................................... SUCCESS [1:10.329s]
      [mvn] [INFO] Lucene codecs tests ................................... SUCCESS [45.263s]
      [mvn] [INFO] Lucene codecs aggregator POM .......................... SUCCESS [0.034s]
      [mvn] [INFO] Lucene Common Analyzers ............................... SUCCESS [1:32.545s]
      [mvn] [INFO] Lucene ICU Analysis Components ........................ SUCCESS [6.635s]
      [mvn] [INFO] Lucene Kuromoji Japanese Morphological Analyzer ....... SUCCESS [7.887s]
      [mvn] [INFO] Lucene Morfologik Polish Lemmatizer ................... SUCCESS [1.678s]
      [mvn] [INFO] Lucene Nori Korean Morphological Analyzer ............. SUCCESS [5.318s]
      [mvn] [INFO] Lucene OpenNLP integration ............................ SUCCESS [2.191s]
      [mvn] [INFO] Lucene Phonetic Filters ............................... SUCCESS [3.903s]
      [mvn] [INFO] Lucene Smart Chinese Analyzer ......................... SUCCESS [1.908s]
      [mvn] [INFO] Lucene Stempel Analyzer ............................... SUCCESS [1.763s]
      [mvn] [INFO] Lucene Analysis Modules aggregator POM ................ SUCCESS [0.027s]
      [mvn] [INFO] Lucene Expressions .................................... SUCCESS [4.128s]
      [mvn] [INFO] Lucene Queries ........................................ SUCCESS [10.376s]
      [mvn] [INFO] Lucene Facets ......................................... SUCCESS [15.630s]
      [mvn] [INFO] Lucene Sandbox ........................................ SUCCESS [11.570s]
      [mvn] [INFO] Lucene QueryParsers ................................... SUCCESS [10.263s]
      [mvn] [INFO] Lucene Memory ......................................... SUCCESS [2.449s]
      [mvn] [INFO] Lucene Highlighter .................................... SUCCESS [14.043s]
      [mvn] [INFO] Lucene Join ........................................... SUCCESS [5.551s]
      [mvn] [INFO] Lucene Spatial 3D ..................................... SUCCESS [9.138s]
      [mvn] [INFO] Lucene Spatial Extras ................................. SUCCESS [43.082s]
      [mvn] [INFO] Lucene Benchmark ...................................... SUCCESS [12.488s]
      [mvn] [INFO] Lucene Grouping ....................................... SUCCESS [6.115s]
      [mvn] [INFO] Lucene Classification ................................. SUCCESS [4.596s]
      [mvn] [INFO] Lucene Demo ........................................... SUCCESS [3.191s]
      [mvn] [INFO] Lucene Miscellaneous .................................. SUCCESS [7.490s]
      [mvn] [INFO] Lucene Monitor ........................................ SUCCESS [11.210s]
      [mvn] [INFO] Lucene Replicator ..................................... SUCCESS [13.465s]
      [mvn] [INFO] Lucene Suggest ........................................ SUCCESS [14.478s]
      [mvn] [INFO] Apache Solr parent POM ................................ SUCCESS [0.026s]
      [mvn] [INFO] Apache Solr Solrj ..................................... SUCCESS [7.475s]
      [mvn] [INFO] Apache Solr Core ...................................... SUCCESS [16.640s]
      [mvn] [INFO] Apache Solr Test Framework ............................ SUCCESS [1.411s]
      [mvn] [INFO] Apache Solr Analysis Extras ........................... FAILED [1:16.927s]
      [mvn] [INFO] Apache Solr Core tests ................................ SKIPPED (dependency build failed or was skipped)
      [mvn] [INFO] Apache Solr Core aggregator POM ....................... SUCCESS [0.032s]
      [mvn] [INFO] Apache Solr Solrj tests ............................... FAILED [1:24.610s]
      [mvn] [INFO] Apache Solr Solrj aggregator POM ...................... SUCCESS [0.031s]
      [mvn] [INFO] Apache Solr Analytics Package ......................... FAILED [1:22.612s]
      [mvn] [INFO] Apache Solr DataImportHandler ......................... FAILED [1:19.550s]
      [mvn] [INFO] Apache Solr DataImportHandler Extras .................. SKIPPED (dependency build failed or was skipped)
      [mvn] [INFO] Apache Solr Content Extraction Library ................ FAILED [1:16.940s]
      [mvn] [INFO] Apache Solr Jaeger Tracer Configurator Package ........ FAILED [2:49.169s]
      [mvn] [INFO] Apache Solr Language Identifier ....................... FAILED [1:16.688s]
      [mvn] [INFO] Apache Solr Learning to Rank Package .................. FAILED [1:19.287s]
      [mvn] [INFO] Apache Solr Prometheus Exporter Package ............... FAILED [1:20.630s]
      [mvn] [INFO] Apache Solr Velocity .................................. FAILED [1:16.657s]
      [mvn] [INFO] Apache Solr Contrib aggregator POM .................... SUCCESS [0.033s]
      [mvn] [INFO] ------------------------------------------------------------------------
      [mvn] [INFO] Error for project: Apache Solr Analysis Extras (during install)
      [mvn] [INFO] ------------------------------------------------------------------------
      [mvn] [INFO] There are test failures.
      [mvn] 
      [mvn] Please refer to /Users/me/mysolr/maven-build/solr/contrib/analysis-extras/target/surefire-reports for the individual test results.
      [mvn] [INFO] ------------------------------------------------------------------------
      [mvn] [INFO] Error for project: Apache Solr Solrj tests (during install)
      [mvn] [INFO] ------------------------------------------------------------------------
      [mvn] [INFO] There are test failures.
      [mvn] 
      [mvn] Please refer to /Users/me/mysolr/maven-build/solr/solrj/src/test/target/surefire-reports for the individual test results.
      [mvn] [INFO] ------------------------------------------------------------------------
      [mvn] [INFO] Error for project: Apache Solr Analytics Package (during install)
      [mvn] [INFO] ------------------------------------------------------------------------
      [mvn] [INFO] There are test failures.
      [mvn] 
      [mvn] Please refer to /Users/me/mysolr/maven-build/solr/contrib/analytics/target/surefire-reports for the individual test results.
      [mvn] [INFO] ------------------------------------------------------------------------
      [mvn] [INFO] Error for project: Apache Solr DataImportHandler (during install)
      [mvn] [INFO] ------------------------------------------------------------------------
      [mvn] [INFO] There are test failures.
      [mvn] 
      [mvn] Please refer to /Users/me/mysolr/maven-build/solr/contrib/dataimporthandler/target/surefire-reports for the individual test results.
      [mvn] [INFO] ------------------------------------------------------------------------
      [mvn] [INFO] Error for project: Apache Solr Content Extraction Library (during install)
      [mvn] [INFO] ------------------------------------------------------------------------
      [mvn] [INFO] There are test failures.
      [mvn] 
      [mvn] Please refer to /Users/me/mysolr/maven-build/solr/contrib/extraction/target/surefire-reports for the individual test results.
      [mvn] [INFO] ------------------------------------------------------------------------
      [mvn] [INFO] Error for project: Apache Solr Jaeger Tracer Configurator Package (during install)
      [mvn] [INFO] ------------------------------------------------------------------------
      [mvn] [INFO] There are test failures.
      [mvn] 
      [mvn] Please refer to /Users/me/mysolr/maven-build/solr/contrib/jaegertracer-configurator/target/surefire-reports for the individual test results.
      [mvn] [INFO] ------------------------------------------------------------------------
      [mvn] [INFO] Error for project: Apache Solr Language Identifier (during install)
      [mvn] [INFO] ------------------------------------------------------------------------
      [mvn] [INFO] There are test failures.
      [mvn] 
      [mvn] Please refer to /Users/me/mysolr/maven-build/solr/contrib/langid/target/surefire-reports for the individual test results.
      [mvn] [INFO] ------------------------------------------------------------------------
      [mvn] [INFO] Error for project: Apache Solr Learning to Rank Package (during install)
      [mvn] [INFO] ------------------------------------------------------------------------
      [mvn] [INFO] There are test failures.
      [mvn] 
      [mvn] Please refer to /Users/me/mysolr/maven-build/solr/contrib/ltr/target/surefire-reports for the individual test results.
      [mvn] [INFO] ------------------------------------------------------------------------
      [mvn] [INFO] Error for project: Apache Solr Prometheus Exporter Package (during install)
      [mvn] [INFO] ------------------------------------------------------------------------
      [mvn] [INFO] There are test failures.
      [mvn] 
      [mvn] Please refer to /Users/me/mysolr/maven-build/solr/contrib/prometheus-exporter/target/surefire-reports for the individual test results.
      [mvn] [INFO] ------------------------------------------------------------------------
      [mvn] [INFO] Error for project: Apache Solr Velocity (during install)
      [mvn] [INFO] ------------------------------------------------------------------------
      [mvn] [INFO] There are test failures.
      [mvn] 
      [mvn] Please refer to /Users/me/mysolr/maven-build/solr/contrib/velocity/target/surefire-reports for the individual test results.
      [mvn] [INFO] ------------------------------------------------------------------------
      [mvn] [INFO] For more information, run Maven with the -e switch
      [mvn] [INFO] ------------------------------------------------------------------------
      [mvn] [INFO] BUILD ERRORS
      [mvn] [INFO] ------------------------------------------------------------------------
      [mvn] [INFO] Total time: 28 minutes 34 seconds
      [mvn] [INFO] Finished at: Tue Apr 20 11:43:02 MDT 2021
      [mvn] [INFO] Final Memory: 430M/3383M
      [mvn] [INFO] ------------------------------------------------------------------------

BUILD FAILED
: Java returned: 1

Total time: 28 minutes 49 seconds

> On Apr 20, 2021, at 12:09 PM, Phill Campbell <si...@yahoo.com.INVALID> wrote:
> 
> I meant to say junit, not nunit below.
> So, a friend suggested trying the maven build instead of ant.
> I run the “Apache Solr Core tests” and there are failures. 
> 
> Are my expectations wrong that all tests should pass?
> Is there a subset of tests that are really the tests that matter?
> 
> Maybe the only tests that matter are the ones in the subdirectory “Solr”?
> 
> I don’t know if it is my development environment, my expectations, or what I need to focus on.
> 
> Thank you.
> 
>> On Apr 19, 2021, at 9:32 AM, Phill Campbell <si...@yahoo.com.INVALID> wrote:
>> 
>> This is not an Apache Solr question. This is a developer environment question. I apologize for my lack of knowledge with ANT.
>> 
>> 
>> $ant common.test
>> 
>> ...
>> 
>> -test:
>>  [junit4] <JUnit4> says jolly good day! Master seed: 3510B76A25B8399C
>> 
>> BUILD FAILED
>> /development/solr/lucene/common-build.xml:1599: The following error occurred while executing this line:
>> /development/solr//lucene/common-build.xml:1126: Reference junit.classpath not found.
>> 
>> Total time: 3 minutes 20 seconds
>> 
>> 
>> 
>> I have tried adding a CLASSPATH environment variable.
>> I have tried placing nunit	jars in /Library/Java/Exentions and the “user” equivalent location as well.
>> 
>> 
>> 
>> 
>> Common-build.xml
>> 
>> Line 1126 is the “>” on the last line of this snippet:
>> 
>> <junit4:junit4
>>   taskName="junit4"
>>   dir="@{workDir}"
>>   tempdir="@{workDir}/temp"
>>   maxmemory="${tests.heapsize}"
>> 
>>   statsPropertyPrefix="junit4.stats"
>> 
>>   parallelism="@{threadNum}"
>> 
>>   printSummary="true"
>>   haltonfailure="${tests.haltonfailure}" 
>>   failureProperty="tests.failed"
>> 
>>   dynamicAssignmentRatio="${tests.dynamicAssignmentRatio}"
>>   shuffleOnSlave="true"
>>   leaveTemporary="${junit4.leaveTemporary}"
>>   seed="${tests.seed}"
>>   onNonEmptyWorkDirectory="wipe"
>> 
>>   heartbeat="${tests.heartbeat}"
>>   uniqueSuiteNames="false"
>> 
>>   debugstream="false”
>>> 
>> 
>> 
>> 
>> Line 1599 (<test-macro threadNum="${tests.jvms.override}" />)
>> 
>> <!-- Run the actual tests (must be wrapped with -init-totals, -check-totals) -->
>> <target name="-test">
>> <mkdir dir="${junit.output.dir}"/>
>> <test-macro threadNum="${tests.jvms.override}" />
>> </target>
>> 
>> 
>> I don’t know if I have a system configuration problem, or if I am running the ANT scripts incorrectly.
>> 
>> Any help appreciated.
>> 
> 


Re: BUILD FAILED - Solr 8 on Mac OS Catalina

Posted by Phill Campbell <si...@yahoo.com.INVALID>.
I meant to say junit, not nunit below.
So, a friend suggested trying the maven build instead of ant.
I run the “Apache Solr Core tests” and there are failures. 

Are my expectations wrong that all tests should pass?
Is there a subset of tests that are really the tests that matter?

Maybe the only tests that matter are the ones in the subdirectory “Solr”?

I don’t know if it is my development environment, my expectations, or what I need to focus on.

Thank you.

> On Apr 19, 2021, at 9:32 AM, Phill Campbell <si...@yahoo.com.INVALID> wrote:
> 
> This is not an Apache Solr question. This is a developer environment question. I apologize for my lack of knowledge with ANT.
> 
> 
> $ant common.test
> 
> ...
> 
> -test:
>   [junit4] <JUnit4> says jolly good day! Master seed: 3510B76A25B8399C
> 
> BUILD FAILED
> /development/solr/lucene/common-build.xml:1599: The following error occurred while executing this line:
> /development/solr//lucene/common-build.xml:1126: Reference junit.classpath not found.
> 
> Total time: 3 minutes 20 seconds
> 
> 
> 
> I have tried adding a CLASSPATH environment variable.
> I have tried placing nunit	jars in /Library/Java/Exentions and the “user” equivalent location as well.
> 
> 
> 
> 
> Common-build.xml
> 
> Line 1126 is the “>” on the last line of this snippet:
> 
> <junit4:junit4
>    taskName="junit4"
>    dir="@{workDir}"
>    tempdir="@{workDir}/temp"
>    maxmemory="${tests.heapsize}"
> 
>    statsPropertyPrefix="junit4.stats"
> 
>    parallelism="@{threadNum}"
> 
>    printSummary="true"
>    haltonfailure="${tests.haltonfailure}" 
>    failureProperty="tests.failed"
> 
>    dynamicAssignmentRatio="${tests.dynamicAssignmentRatio}"
>    shuffleOnSlave="true"
>    leaveTemporary="${junit4.leaveTemporary}"
>    seed="${tests.seed}"
>    onNonEmptyWorkDirectory="wipe"
> 
>    heartbeat="${tests.heartbeat}"
>    uniqueSuiteNames="false"
> 
>    debugstream="false”
>> 
> 
> 
> 
> Line 1599 (<test-macro threadNum="${tests.jvms.override}" />)
> 
> <!-- Run the actual tests (must be wrapped with -init-totals, -check-totals) -->
> <target name="-test">
>  <mkdir dir="${junit.output.dir}"/>
>  <test-macro threadNum="${tests.jvms.override}" />
> </target>
> 
> 
> I don’t know if I have a system configuration problem, or if I am running the ANT scripts incorrectly.
> 
> Any help appreciated.
>