You are viewing a plain text version of this content. The canonical link for it is here.
Posted to dev@jmeter.apache.org by Apache Jenkins Server <je...@builds.apache.org> on 2023/11/24 07:03:24 UTC
Build failed in Jenkins: JMeter » JMeter-trunk #694
See <https://ci-builds.apache.org/job/JMeter/job/JMeter-trunk/694/display/redirect?page=changes>
Changes:
[Vladimir Sitnikov] fix(deps): update com.miglayout to v11
------------------------------------------
[...truncated 336.77 KB...]
WARN StatusConsoleListener The use of package scanning to locate plugins is deprecated and will be removed in a future release
WARN StatusConsoleListener The use of package scanning to locate plugins is deprecated and will be removed in a future release
summary + 1 in 00:00:02 = 0.5/s Avg: 1912 Min: 1912 Max: 1912 Err: 0 (0.00%) Active: 1 Started: 1 Finished: 0
> Task :src:dist:distTarSourceSha512
Checksum <https://ci-builds.apache.org/job/JMeter/job/JMeter-trunk/694/artifact/src/dist/build/distributions/apache-jmeter-5.6.3-SNAPSHOT_src.tgz> to <https://ci-builds.apache.org/job/JMeter/job/JMeter-trunk/ws/src/dist/build/checksums/distTarSourceSha512/apache-jmeter-5.6.3-SNAPSHOT_src.tgz.sha512>
> Task :src:core:spotbugsMain
The following classes needed for analysis were missing:
com.github.weisj.swingdsl.visualpadding.VisualPaddingProvider
SpotBugs ended with exit code 3
> Task :src:core:test
[0;1m 1.1sec[0m, org.apache.jmeter.threads.openmodel.[0;1mThreadsInterruptAtFinishTest[0m > [0;1mopenmodel[0m interrupts sleep()
[0;34;1mWARNING[0m [0;1m 24.5sec[0m, 374 completed, 0 failed, [0;34;1m 2[0m skipped, [0;34;1mGradle Test Run :src:core:test[0m
> Task :src:core:check
> Task :src:core:assemble
> Task :src:dist-check:batchFTP_TESTS
summary + 5 in 00:00:01 = 3.7/s Avg: 39 Min: 11 Max: 72 Err: 0 (0.00%) Active: 0 Started: 1 Finished: 1
summary = 6 in 00:00:03 = 1.8/s Avg: 351 Min: 11 Max: 1912 Err: 0 (0.00%)
Tidying up ... @ 2023 Nov 24 07:01:31 UTC (1700809291644)
... end of run
No errors present in the logfile <https://ci-builds.apache.org/job/JMeter/job/JMeter-trunk/ws/bin/FTP_TESTS.log> (the file is empty)
> Task :src:components:test
[0;1m 2.1sec[0m, org.apache.jmeter.threads.openmodel.[0;1mOpenModelThreadGroupConfigElementTest[0m > [0;1mensure[0m thread group initializes counter only once for each thread()
[0;1m 2.1sec[0m, 1 completed, 0 failed, 0 skipped, org.apache.jmeter.threads.openmodel.OpenModelThreadGroupConfigElementTest
[0;34;1mWARNING[0m [0;1m 45.1sec[0m, 554 completed, 0 failed, [0;34;1m 3[0m skipped, [0;34;1mGradle Test Run :src:components:test[0m
> Task :src:components:check
> Task :src:components:assemble
> Task :src:dist-check:batchHTMLParserTestFile_2
WARN StatusConsoleListener The use of package scanning to locate plugins is deprecated and will be removed in a future release
WARN StatusConsoleListener The use of package scanning to locate plugins is deprecated and will be removed in a future release
WARN StatusConsoleListener The use of package scanning to locate plugins is deprecated and will be removed in a future release
WARN StatusConsoleListener The use of package scanning to locate plugins is deprecated and will be removed in a future release
Creating summariser <summary>
Created the tree successfully using <https://ci-builds.apache.org/job/JMeter/job/JMeter-trunk/ws/bin/testfiles/HTMLParserTestFile_2.jmx>
Starting standalone test @ 2023 Nov 24 07:01:34 UTC (1700809294363)
Waiting for possible Shutdown/StopTestNow/HeapDump/ThreadDump message on port 4445
summary + 1 in 00:00:00 = 6.2/s Avg: 82 Min: 82 Max: 82 Err: 0 (0.00%) Active: 1 Started: 1 Finished: 0
summary = 1 in 00:00:00 = 6.2/s Avg: 82 Min: 82 Max: 82 Err: 0 (0.00%)
Tidying up ... @ 2023 Nov 24 07:01:34 UTC (1700809294688)
... end of run
No errors present in the logfile <https://ci-builds.apache.org/job/JMeter/job/JMeter-trunk/ws/bin/HTMLParserTestFile_2.log> (the file is empty)
> Task :src:dist-check:batchHttp4ImplDigestAuth SKIPPED
> Task :src:protocol:http:test
[0;1m 12.2sec[0m, org.apache.jmeter.protocol.http.control.[0;1mDnsManagerTest[0m > [0;1mbadDnsInCustomResolverShouldFailHttpSampler(String,[0m WireMockServer)[1], [1] HttpClient4
[0;34;1mWARNING[0m [0;1m 12.2sec[0m, 2 completed, 0 failed, [0;34;1m 1[0m skipped, org.apache.jmeter.protocol.http.control.[0;1mDnsManagerTest[0m > [0;1mbadDnsInCustomResolverShouldFailHttpSampler(String,[0m WireMockServer)
[0;34;1mWARNING[0m [0;1m 14.0sec[0m, 2 completed, 0 failed, [0;34;1m 1[0m skipped, org.apache.jmeter.protocol.http.control.[0;34;1mDnsManagerTest[0m
> Task :src:dist:distZip FAILED
> Task :src:dist-check:batchHttp4ImplPreemptiveBasicAuth
WARN StatusConsoleListener The use of package scanning to locate plugins is deprecated and will be removed in a future release
WARN StatusConsoleListener The use of package scanning to locate plugins is deprecated and will be removed in a future release
WARN StatusConsoleListener The use of package scanning to locate plugins is deprecated and will be removed in a future release
WARN StatusConsoleListener The use of package scanning to locate plugins is deprecated and will be removed in a future release
Creating summariser <summary>
Created the tree successfully using <https://ci-builds.apache.org/job/JMeter/job/JMeter-trunk/ws/bin/testfiles/Http4ImplPreemptiveBasicAuth.jmx>
Starting standalone test @ 2023 Nov 24 07:01:37 UTC (1700809297380)
Waiting for possible Shutdown/StopTestNow/HeapDump/ThreadDump message on port 4445
WARN StatusConsoleListener The use of package scanning to locate plugins is deprecated and will be removed in a future release
WARN StatusConsoleListener The use of package scanning to locate plugins is deprecated and will be removed in a future release
WARN StatusConsoleListener The use of package scanning to locate plugins is deprecated and will be removed in a future release
WARN StatusConsoleListener The use of package scanning to locate plugins is deprecated and will be removed in a future release
summary = 12 in 00:00:04 = 2.7/s Avg: 86 Min: 30 Max: 323 Err: 0 (0.00%)
Tidying up ... @ 2023 Nov 24 07:01:42 UTC (1700809302123)
... end of run
No errors present in the logfile <https://ci-builds.apache.org/job/JMeter/job/JMeter-trunk/ws/bin/Http4ImplPreemptiveBasicAuth.log> (the file is empty)
> Task :src:protocol:http:test
[0;1m 2.2sec[0m, org.apache.jmeter.protocol.http.control.[0;1mTestCacheManagerHC4[0m > [0;1mtestCacheHttpClientBug51932()[0m
[0;1m 3.0sec[0m, org.apache.jmeter.protocol.http.control.[0;1mTestCacheManagerHC4[0m > [0;1mtestExpires()[0m
[0;1m 3.0sec[0m, org.apache.jmeter.protocol.http.control.[0;1mTestCacheManagerHC4[0m > [0;1mtestExpiresBug59962()[0m
[0;1m 3.0sec[0m, org.apache.jmeter.protocol.http.control.[0;1mTestCacheManagerHC4[0m > [0;1mtestCacheControl()[0m
[0;1m 5.0sec[0m, org.apache.jmeter.protocol.http.control.[0;1mTestCacheManagerHC4[0m > [0;1mtestNoCacheControlNoMaxAgeNoExpire()[0m
[0;1m 3.0sec[0m, org.apache.jmeter.protocol.http.control.[0;1mTestCacheManagerHC4[0m > [0;1mtestPrivateCacheExpireNoMaxAge()[0m
[0;1m 4.9sec[0m, org.apache.jmeter.protocol.http.control.[0;1mTestCacheManagerHC4[0m > [0;1mtestPrivateCacheNoMaxAgeNoExpire()[0m
[0;1m 3.0sec[0m, org.apache.jmeter.protocol.http.control.[0;1mTestCacheManagerHC4[0m > [0;1mtestPrivateCache()[0m
[0;1m 27.2sec[0m, 26 completed, 0 failed, 0 skipped, org.apache.jmeter.protocol.http.control.TestCacheManagerHC4
[0;1m 3.0sec[0m, org.apache.jmeter.protocol.http.control.[0;1mTestCacheManagerUrlConnection[0m > [0;1mtestCacheHttpClientBug51932()[0m
[0;1m 2.9sec[0m, org.apache.jmeter.protocol.http.control.[0;1mTestCacheManagerUrlConnection[0m > [0;1mtestExpires()[0m
[0;1m 3.0sec[0m, org.apache.jmeter.protocol.http.control.[0;1mTestCacheManagerUrlConnection[0m > [0;1mtestExpiresBug59962()[0m
[0;1m 3.0sec[0m, org.apache.jmeter.protocol.http.control.[0;1mTestCacheManagerUrlConnection[0m > [0;1mtestCacheControl()[0m
[0;1m 5.0sec[0m, org.apache.jmeter.protocol.http.control.[0;1mTestCacheManagerUrlConnection[0m > [0;1mtestNoCacheControlNoMaxAgeNoExpire()[0m
[0;1m 3.0sec[0m, org.apache.jmeter.protocol.http.control.[0;1mTestCacheManagerUrlConnection[0m > [0;1mtestPrivateCacheExpireNoMaxAge()[0m
[0;1m 5.0sec[0m, org.apache.jmeter.protocol.http.control.[0;1mTestCacheManagerUrlConnection[0m > [0;1mtestPrivateCacheNoMaxAgeNoExpire()[0m
[0;1m 3.0sec[0m, org.apache.jmeter.protocol.http.control.[0;1mTestCacheManagerUrlConnection[0m > [0;1mtestPrivateCache()[0m
[0;1m 28.0sec[0m, 25 completed, 0 failed, 0 skipped, org.apache.jmeter.protocol.http.control.TestCacheManagerUrlConnection
[0;1m 1.2sec[0m, org.apache.jmeter.protocol.http.sampler.[0;1mSamplingNamingTest[0m > [0;1mtestBug63364(String)[0m[1], Run 1: implementation:HttpClient4
[0;1m 2.2sec[0m, 2 completed, 0 failed, 0 skipped, org.apache.jmeter.protocol.http.sampler.[0;1mSamplingNamingTest[0m > [0;1mtestBug63364(String)[0m
[0;1m 2.2sec[0m, 2 completed, 0 failed, 0 skipped, org.apache.jmeter.protocol.http.sampler.SamplingNamingTest
[0;1m 1.2sec[0m, org.apache.jmeter.protocol.http.[0;1mHttpRequestInterruptTest[0m > [0;1mhttp[0m request interrupts(String, WireMockRuntimeInfo)[1], [1] HttpClient4
[0;1m 1.1sec[0m, org.apache.jmeter.protocol.http.[0;1mHttpRequestInterruptTest[0m > [0;1mhttp[0m request interrupts(String, WireMockRuntimeInfo)[2], [2] HTTPSampler
[0;1m 2.3sec[0m, 2 completed, 0 failed, 0 skipped, org.apache.jmeter.protocol.http.[0;1mHttpRequestInterruptTest[0m > [0;1mhttp[0m request interrupts(String, WireMockRuntimeInfo)
[0;1m 2.8sec[0m, 2 completed, 0 failed, 0 skipped, org.apache.jmeter.protocol.http.HttpRequestInterruptTest
[0;34;1mWARNING[0m [0;1m101.7sec[0m, 800 completed, 0 failed, [0;34;1m 1[0m skipped, [0;34;1mGradle Test Run :src:protocol:http:test[0m
checksum-dependency elapsed time: 2449ms, configurations processed: 65 (add -PchecksumTimingsPrint to print detailed timings)
checksum-dependency elapsed time: 136668ms, configurations processed: 741
SHA-512 computation time: 40ms (goes in parallel, it might exceed wall-clock time), files processed: 32, processed: 4MiB, skipped: 13487MiB
PGP signature resolution time: 241ms (wall-clock), resolution requests: 444, signatures resolved: 402
PGP key resolution time: 134667ms (wall-clock), resolution requests: 444, download time: 1253ms (goes in parallel, it might exceed wall-clock time), keys downloaded: 1
PGP signature verification time: 12101ms (goes in parallel, it might exceed wall-clock time), files processed: 949, processed: 1202MiB, skipped: 12246MiB
Build [0;1mjmeter [0;1;31mFAILURE[0;1m[0m reason:
Execution [0;1;31mfailed[0m for task '[0;1m:src:dist:distZip[0m':
Could not add file '<https://ci-builds.apache.org/job/JMeter/job/JMeter-trunk/ws/bin/ftp_test'> to ZIP '<https://ci-builds.apache.org/job/JMeter/job/JMeter-trunk/694/artifact/src/dist/build/distributions/apache-jmeter-5.6.3-SNAPSHOT.zip'.>
[0;0;90mat org.gradle.api.internal.file.archive.ZipCopyAction$StreamAction.visitDir(ZipCopyAction.java:138)
[0m [0;0;90mat org.gradle.api.internal.file.archive.ZipCopyAction$StreamAction.processFile(ZipCopyAction.java:110)
[0m [0;0;90mat org.gradle.api.internal.file.copy.NormalizingCopyActionDecorator.maybeVisit(NormalizingCopyActionDecorator.java:102)
[0m [0;0;90mat org.gradle.api.internal.file.copy.NormalizingCopyActionDecorator.lambda$execute$1(NormalizingCopyActionDecorator.java:78)
[0m [0;0;90mat org.gradle.api.internal.file.archive.ZipCopyAction.lambda$execute$0(ZipCopyAction.java:84)
[0m [0;0;90mat org.gradle.internal.IoActions.withResource(IoActions.java:76)
[0m [0;0;90mat org.gradle.api.internal.file.archive.ZipCopyAction.execute(ZipCopyAction.java:83)
[0m [0;0;90mat org.gradle.api.internal.file.copy.NormalizingCopyActionDecorator.execute(NormalizingCopyActionDecorator.java:61)
[0m [0;0;90mat org.gradle.api.internal.file.copy.DuplicateHandlingCopyActionDecorator.execute(DuplicateHandlingCopyActionDecorator.java:47)
[0m [0;0;90mat org.gradle.api.internal.file.copy.CopyActionExecuter.execute(CopyActionExecuter.java:47)
[0m [0;0;90mat org.gradle.api.tasks.AbstractCopyTask.copy(AbstractCopyTask.java:149)
[0m [0;0;90mat org.gradle.internal.reflect.JavaMethod.invoke(JavaMethod.java:125)
[0m [0;0;90mat org.gradle.api.internal.project.taskfactory.StandardTaskAction.doExecute(StandardTaskAction.java:58)
[0m [0;0;90mat org.gradle.api.internal.project.taskfactory.StandardTaskAction.execute(StandardTaskAction.java:51)
[0m [0;0;90mat org.gradle.api.internal.project.taskfactory.StandardTaskAction.execute(StandardTaskAction.java:29)
[0m [0;0;90mat org.gradle.api.internal.tasks.execution.TaskExecution$3.run(TaskExecution.java:242)
[0m [0;0;90mat org.gradle.internal.operations.DefaultBuildOperationRunner$1.execute(DefaultBuildOperationRunner.java:29)
[0m [0;0;90mat org.gradle.internal.operations.DefaultBuildOperationRunner$1.execute(DefaultBuildOperationRunner.java:26)
[0m [0;0;90mat org.gradle.internal.operations.DefaultBuildOperationRunner$2.execute(DefaultBuildOperationRunner.java:66)
[0m [0;0;90mat org.gradle.internal.operations.DefaultBuildOperationRunner$2.execute(DefaultBuildOperationRunner.java:59)
[0m [0;0;90mat org.gradle.internal.operations.DefaultBuildOperationRunner.execute(DefaultBuildOperationRunner.java:157)
[0m [0;0;90mat org.gradle.internal.operations.DefaultBuildOperationRunner.execute(DefaultBuildOperationRunner.java:59)
[0m [0;0;90mat org.gradle.internal.operations.DefaultBuildOperationRunner.run(DefaultBuildOperationRunner.java:47)
[0m [0;0;90mat org.gradle.internal.operations.DefaultBuildOperationExecutor.run(DefaultBuildOperationExecutor.java:68)
[0m [0;0;90mat org.gradle.api.internal.tasks.execution.TaskExecution.executeAction(TaskExecution.java:227)
[0m [0;0;90mat org.gradle.api.internal.tasks.execution.TaskExecution.executeActions(TaskExecution.java:210)
[0m [0;0;90mat org.gradle.api.internal.tasks.execution.TaskExecution.executeWithPreviousOutputFiles(TaskExecution.java:193)
[0m [0;0;90mat org.gradle.api.internal.tasks.execution.TaskExecution.execute(TaskExecution.java:166)
[0m [0;0;90mat org.gradle.internal.execution.steps.ExecuteStep.executeInternal(ExecuteStep.java:105)
[0m [0;0;90mat org.gradle.internal.execution.steps.ExecuteStep.access$000(ExecuteStep.java:44)
[0m [0;0;90mat org.gradle.internal.execution.steps.ExecuteStep$1.call(ExecuteStep.java:59)
[0m [0;0;90mat org.gradle.internal.execution.steps.ExecuteStep$1.call(ExecuteStep.java:56)
[0m [0;0;90mat org.gradle.internal.operations.DefaultBuildOperationRunner$CallableBuildOperationWorker.execute(DefaultBuildOperationRunner.java:204)
[0m [0;0;90mat org.gradle.internal.operations.DefaultBuildOperationRunner$CallableBuildOperationWorker.execute(DefaultBuildOperationRunner.java:199)
[0m [0;0;90mat org.gradle.internal.operations.DefaultBuildOperationRunner$2.execute(DefaultBuildOperationRunner.java:66)
[0m [0;0;90mat org.gradle.internal.operations.DefaultBuildOperationRunner$2.execute(DefaultBuildOperationRunner.java:59)
[0m [0;0;90mat org.gradle.internal.operations.DefaultBuildOperationRunner.execute(DefaultBuildOperationRunner.java:157)
[0m [0;0;90mat org.gradle.internal.operations.DefaultBuildOperationRunner.execute(DefaultBuildOperationRunner.java:59)
[0m [0;0;90mat org.gradle.internal.operations.DefaultBuildOperationRunner.call(DefaultBuildOperationRunner.java:53)
[0m [0;0;90mat org.gradle.internal.operations.DefaultBuildOperationExecutor.call(DefaultBuildOperationExecutor.java:73)
[0m [0;0;90mat org.gradle.internal.execution.steps.ExecuteStep.execute(ExecuteStep.java:56)
[0m [0;0;90mat org.gradle.internal.execution.steps.ExecuteStep.execute(ExecuteStep.java:44)
[0m [0;0;90mat org.gradle.internal.execution.steps.RemovePreviousOutputsStep.execute(RemovePreviousOutputsStep.java:67)
[0m [0;0;90mat org.gradle.internal.execution.steps.RemovePreviousOutputsStep.execute(RemovePreviousOutputsStep.java:37)
[0m [0;0;90mat org.gradle.internal.execution.steps.CancelExecutionStep.execute(CancelExecutionStep.java:41)
[0m [0;0;90mat org.gradle.internal.execution.steps.TimeoutStep.executeWithoutTimeout(TimeoutStep.java:74)
[0m [0;0;90mat org.gradle.internal.execution.steps.TimeoutStep.execute(TimeoutStep.java:55)
[0m [0;0;90mat org.gradle.internal.execution.steps.CreateOutputsStep.execute(CreateOutputsStep.java:50)
[0m [0;0;90mat org.gradle.internal.execution.steps.CreateOutputsStep.execute(CreateOutputsStep.java:28)
[0m [0;0;90mat org.gradle.internal.execution.steps.CaptureStateAfterExecutionStep.executeDelegateBroadcastingChanges(CaptureStateAfterExecutionStep.java:100)
[0m [0;0;90mat org.gradle.internal.execution.steps.CaptureStateAfterExecutionStep.execute(CaptureStateAfterExecutionStep.java:72)
[0m [0;0;90mat org.gradle.internal.execution.steps.CaptureStateAfterExecutionStep.execute(CaptureStateAfterExecutionStep.java:50)
[0m [0;0;90mat org.gradle.internal.execution.steps.ResolveInputChangesStep.execute(ResolveInputChangesStep.java:40)
[0m [0;0;90mat org.gradle.internal.execution.steps.ResolveInputChangesStep.execute(ResolveInputChangesStep.java:29)
[0m [0;0;90mat org.gradle.internal.execution.steps.BuildCacheStep.executeWithoutCache(BuildCacheStep.java:166)
[0m [0;0;90mat org.gradle.internal.execution.steps.BuildCacheStep.lambda$execute$1(BuildCacheStep.java:70)
[0m [0;0;90mat org.gradle.internal.Either$Right.fold(Either.java:175)
[0m [0;0;90mat org.gradle.internal.execution.caching.CachingState.fold(CachingState.java:59)
[0m [0;0;90mat org.gradle.internal.execution.steps.BuildCacheStep.execute(BuildCacheStep.java:68)
[0m [0;0;90mat org.gradle.internal.execution.steps.BuildCacheStep.execute(BuildCacheStep.java:46)
[0m [0;0;90mat org.gradle.internal.execution.steps.StoreExecutionStateStep.execute(StoreExecutionStateStep.java:36)
[0m [0;0;90mat org.gradle.internal.execution.steps.StoreExecutionStateStep.execute(StoreExecutionStateStep.java:25)
[0m [0;0;90mat org.gradle.internal.execution.steps.RecordOutputsStep.execute(RecordOutputsStep.java:36)
[0m [0;0;90mat org.gradle.internal.execution.steps.RecordOutputsStep.execute(RecordOutputsStep.java:22)
[0m [0;0;90mat org.gradle.internal.execution.steps.SkipUpToDateStep.executeBecause(SkipUpToDateStep.java:91)
[0m [0;0;90mat org.gradle.internal.execution.steps.SkipUpToDateStep.lambda$execute$2(SkipUpToDateStep.java:55)
[0m [0;0;90mat org.gradle.internal.execution.steps.SkipUpToDateStep.execute(SkipUpToDateStep.java:55)
[0m [0;0;90mat org.gradle.internal.execution.steps.SkipUpToDateStep.execute(SkipUpToDateStep.java:37)
[0m [0;0;90mat org.gradle.internal.execution.steps.ResolveChangesStep.execute(ResolveChangesStep.java:65)
[0m [0;0;90mat org.gradle.internal.execution.steps.ResolveChangesStep.execute(ResolveChangesStep.java:36)
[0m [0;0;90mat org.gradle.internal.execution.steps.legacy.MarkSnapshottingInputsFinishedStep.execute(MarkSnapshottingInputsFinishedStep.java:37)
[0m [0;0;90mat org.gradle.internal.execution.steps.legacy.MarkSnapshottingInputsFinishedStep.execute(MarkSnapshottingInputsFinishedStep.java:27)
[0m [0;0;90mat org.gradle.internal.execution.steps.ResolveCachingStateStep.execute(ResolveCachingStateStep.java:76)
[0m [0;0;90mat org.gradle.internal.execution.steps.ResolveCachingStateStep.execute(ResolveCachingStateStep.java:37)
[0m [0;0;90mat org.gradle.internal.execution.steps.ValidateStep.execute(ValidateStep.java:94)
[0m [0;0;90mat org.gradle.internal.execution.steps.ValidateStep.execute(ValidateStep.java:49)
[0m [0;0;90mat org.gradle.internal.execution.steps.CaptureStateBeforeExecutionStep.execute(CaptureStateBeforeExecutionStep.java:71)
[0m [0;0;90mat org.gradle.internal.execution.steps.CaptureStateBeforeExecutionStep.execute(CaptureStateBeforeExecutionStep.java:45)
[0m [0;0;90mat org.gradle.internal.execution.steps.SkipEmptyWorkStep.executeWithNonEmptySources(SkipEmptyWorkStep.java:177)
[0m [0;0;90mat org.gradle.internal.execution.steps.SkipEmptyWorkStep.execute(SkipEmptyWorkStep.java:86)
[0m [0;0;90mat org.gradle.internal.execution.steps.SkipEmptyWorkStep.execute(SkipEmptyWorkStep.java:53)
[0m [0;0;90mat org.gradle.internal.execution.steps.RemoveUntrackedExecutionStateStep.execute(RemoveUntrackedExecutionStateStep.java:32)
[0m [0;0;90mat org.gradle.internal.execution.steps.RemoveUntrackedExecutionStateStep.execute(RemoveUntrackedExecutionStateStep.java:21)
[0m [0;0;90mat org.gradle.internal.execution.steps.legacy.MarkSnapshottingInputsStartedStep.execute(MarkSnapshottingInputsStartedStep.java:38)
[0m [0;0;90mat org.gradle.internal.execution.steps.LoadPreviousExecutionStateStep.execute(LoadPreviousExecutionStateStep.java:36)
[0m [0;0;90mat org.gradle.internal.execution.steps.LoadPreviousExecutionStateStep.execute(LoadPreviousExecutionStateStep.java:23)
[0m [0;0;90mat org.gradle.internal.execution.steps.CleanupStaleOutputsStep.execute(CleanupStaleOutputsStep.java:75)
[0m [0;0;90mat org.gradle.internal.execution.steps.CleanupStaleOutputsStep.execute(CleanupStaleOutputsStep.java:41)
[0m [0;0;90mat org.gradle.internal.execution.steps.AssignWorkspaceStep.lambda$execute$0(AssignWorkspaceStep.java:32)
[0m [0;0;90mat org.gradle.api.internal.tasks.execution.TaskExecution$4.withWorkspace(TaskExecution.java:287)
[0m [0;0;90mat org.gradle.internal.execution.steps.AssignWorkspaceStep.execute(AssignWorkspaceStep.java:30)
[0m [0;0;90mat org.gradle.internal.execution.steps.AssignWorkspaceStep.execute(AssignWorkspaceStep.java:21)
[0m [0;0;90mat org.gradle.internal.execution.steps.IdentityCacheStep.execute(IdentityCacheStep.java:37)
[0m [0;0;90mat org.gradle.internal.execution.steps.IdentityCacheStep.execute(IdentityCacheStep.java:27)
[0m [0;0;90mat org.gradle.internal.execution.steps.IdentifyStep.execute(IdentifyStep.java:47)
[0m [0;0;90mat org.gradle.internal.execution.steps.IdentifyStep.execute(IdentifyStep.java:34)
[0m Caused by: org.gradle.internal.file.FileException: Could not get file mode for '<https://ci-builds.apache.org/job/JMeter/job/JMeter-trunk/ws/bin/ftp_test'.>
[0;0;90mat org.gradle.internal.nativeintegration.filesystem.services.GenericFileSystem.getUnixMode(GenericFileSystem.java:100)
[0m [0;0;90mat org.gradle.api.internal.file.DefaultFileTreeElement.getMode(DefaultFileTreeElement.java:81)
[0m [0;0;90mat org.gradle.api.internal.file.copy.DefaultFileCopyDetails.getMode(DefaultFileCopyDetails.java:162)
[0m [0;0;90mat org.gradle.api.internal.file.archive.ZipCopyAction$StreamAction.visitDir(ZipCopyAction.java:134)
[0m[0;0;90m ... 95 more
[0m Caused by: net.rubygrapefruit.platform.NativeException: Could not get UNIX mode on <https://ci-builds.apache.org/job/JMeter/job/JMeter-trunk/ws/bin/ftp_test>: file does not exist.
at net.rubygrapefruit.platform.internal.DefaultPosixFiles.getMode(DefaultPosixFiles.java:72)
[0;0;90mat org.gradle.internal.nativeintegration.filesystem.services.NativePlatformBackedStat.getUnixMode(NativePlatformBackedStat.java:33)
[0m [0;0;90mat org.gradle.internal.nativeintegration.filesystem.services.GenericFileSystem.getUnixMode(GenericFileSystem.java:98)
[0m[0;0;90m ... 98 more
[0m
FAILURE: Build failed with an exception.
* What went wrong:
Execution failed for task ':src:dist:distZip'.
> Could not add file '<https://ci-builds.apache.org/job/JMeter/job/JMeter-trunk/ws/bin/ftp_test'> to ZIP '<https://ci-builds.apache.org/job/JMeter/job/JMeter-trunk/694/artifact/src/dist/build/distributions/apache-jmeter-5.6.3-SNAPSHOT.zip'.>
* Try:
> Run with --stacktrace option to get the stack trace.
> Run with --info or --debug option to get more log output.
* Get more help at https://help.gradle.org
BUILD FAILED in 6m 10s
624 actionable tasks: 269 executed, 355 up-to-date
Publishing build scan...
https://ge.apache.org/s/wm46e5x37vnyw
See the profiling report at: file://<https://ci-builds.apache.org/job/JMeter/job/JMeter-trunk/ws/build/reports/profile/profile-2023-11-24-06-56-38.html>
A fine-grained performance profile is available: use the --scan option.
Build step 'Invoke Gradle script' changed build result to FAILURE
Build step 'Invoke Gradle script' marked build as failure
Xvfb stopping
Archiving artifacts
Recording test results
[Checks API] No suitable checks publisher found.
Jenkins build is back to normal : JMeter » JMeter-trunk #695
Posted by Apache Jenkins Server <je...@builds.apache.org>.
See <https://ci-builds.apache.org/job/JMeter/job/JMeter-trunk/695/display/redirect?page=changes>