You are viewing a plain text version of this content. The canonical link for it is here.
Posted to dev@kafka.apache.org by Apache Jenkins Server <je...@builds.apache.org> on 2016/08/23 06:12:52 UTC
Build failed in Jenkins: kafka-trunk-jdk8 #832
See <https://builds.apache.org/job/kafka-trunk-jdk8/832/changes>
Changes:
[ismael] KAFKA-3916; Check for disconnects properly before sending from the
------------------------------------------
[...truncated 10986 lines...]
org.apache.kafka.streams.state.internals.StreamThreadStateStoreProviderTest > shouldReturnEmptyListIfStoreExistsButIsNotOfTypeValueStore STARTED
org.apache.kafka.streams.state.internals.StreamThreadStateStoreProviderTest > shouldReturnEmptyListIfStoreExistsButIsNotOfTypeValueStore PASSED
org.apache.kafka.streams.state.internals.StreamThreadStateStoreProviderTest > shouldFindKeyValueStores STARTED
org.apache.kafka.streams.state.internals.StreamThreadStateStoreProviderTest > shouldFindKeyValueStores PASSED
org.apache.kafka.streams.state.internals.StreamThreadStateStoreProviderTest > shouldThrowInvalidStoreExceptionIfWindowStoreClosed STARTED
org.apache.kafka.streams.state.internals.StreamThreadStateStoreProviderTest > shouldThrowInvalidStoreExceptionIfWindowStoreClosed PASSED
org.apache.kafka.streams.state.internals.CompositeReadOnlyWindowStoreTest > shouldNotGetValuesFromOtherStores STARTED
org.apache.kafka.streams.state.internals.CompositeReadOnlyWindowStoreTest > shouldNotGetValuesFromOtherStores PASSED
org.apache.kafka.streams.state.internals.CompositeReadOnlyWindowStoreTest > shouldReturnEmptyIteratorIfNoData STARTED
org.apache.kafka.streams.state.internals.CompositeReadOnlyWindowStoreTest > shouldReturnEmptyIteratorIfNoData PASSED
org.apache.kafka.streams.state.internals.CompositeReadOnlyWindowStoreTest > shouldFindValueForKeyWhenMultiStores STARTED
org.apache.kafka.streams.state.internals.CompositeReadOnlyWindowStoreTest > shouldFindValueForKeyWhenMultiStores PASSED
org.apache.kafka.streams.state.internals.CompositeReadOnlyWindowStoreTest > shouldFetchValuesFromWindowStore STARTED
org.apache.kafka.streams.state.internals.CompositeReadOnlyWindowStoreTest > shouldFetchValuesFromWindowStore PASSED
org.apache.kafka.streams.state.internals.CompositeReadOnlyKeyValueStoreTest > shouldReturnValueIfExists STARTED
org.apache.kafka.streams.state.internals.CompositeReadOnlyKeyValueStoreTest > shouldReturnValueIfExists PASSED
org.apache.kafka.streams.state.internals.CompositeReadOnlyKeyValueStoreTest > shouldNotGetValuesFromOtherStores STARTED
org.apache.kafka.streams.state.internals.CompositeReadOnlyKeyValueStoreTest > shouldNotGetValuesFromOtherStores PASSED
org.apache.kafka.streams.state.internals.CompositeReadOnlyKeyValueStoreTest > shouldGetApproximateEntriesAcrossAllStores STARTED
org.apache.kafka.streams.state.internals.CompositeReadOnlyKeyValueStoreTest > shouldGetApproximateEntriesAcrossAllStores PASSED
org.apache.kafka.streams.state.internals.CompositeReadOnlyKeyValueStoreTest > shouldReturnLongMaxValueOnOverflow STARTED
org.apache.kafka.streams.state.internals.CompositeReadOnlyKeyValueStoreTest > shouldReturnLongMaxValueOnOverflow PASSED
org.apache.kafka.streams.state.internals.CompositeReadOnlyKeyValueStoreTest > shouldReturnNullIfKeyDoesntExist STARTED
org.apache.kafka.streams.state.internals.CompositeReadOnlyKeyValueStoreTest > shouldReturnNullIfKeyDoesntExist PASSED
org.apache.kafka.streams.state.internals.CompositeReadOnlyKeyValueStoreTest > shouldSupportRange STARTED
org.apache.kafka.streams.state.internals.CompositeReadOnlyKeyValueStoreTest > shouldSupportRange PASSED
org.apache.kafka.streams.state.internals.CompositeReadOnlyKeyValueStoreTest > shouldFindValueForKeyWhenMultiStores STARTED
org.apache.kafka.streams.state.internals.CompositeReadOnlyKeyValueStoreTest > shouldFindValueForKeyWhenMultiStores PASSED
org.apache.kafka.streams.state.internals.CompositeReadOnlyKeyValueStoreTest > shouldThrowInvalidStoreExceptionIfNoStoresExistOnAll STARTED
org.apache.kafka.streams.state.internals.CompositeReadOnlyKeyValueStoreTest > shouldThrowInvalidStoreExceptionIfNoStoresExistOnAll PASSED
org.apache.kafka.streams.state.internals.CompositeReadOnlyKeyValueStoreTest > shouldThrowInvalidStoreExceptionIfNoStoresExistOnGet STARTED
org.apache.kafka.streams.state.internals.CompositeReadOnlyKeyValueStoreTest > shouldThrowInvalidStoreExceptionIfNoStoresExistOnGet PASSED
org.apache.kafka.streams.state.internals.CompositeReadOnlyKeyValueStoreTest > shouldSupportRangeAcrossMultipleKVStores STARTED
org.apache.kafka.streams.state.internals.CompositeReadOnlyKeyValueStoreTest > shouldSupportRangeAcrossMultipleKVStores PASSED
org.apache.kafka.streams.state.internals.CompositeReadOnlyKeyValueStoreTest > shouldThrowInvalidStoreExceptionIfNoStoresExistOnRange STARTED
org.apache.kafka.streams.state.internals.CompositeReadOnlyKeyValueStoreTest > shouldThrowInvalidStoreExceptionIfNoStoresExistOnRange PASSED
org.apache.kafka.streams.state.internals.CompositeReadOnlyKeyValueStoreTest > shouldSupportAllAcrossMultipleStores STARTED
org.apache.kafka.streams.state.internals.CompositeReadOnlyKeyValueStoreTest > shouldSupportAllAcrossMultipleStores PASSED
org.apache.kafka.streams.state.internals.InMemoryLRUCacheStoreTest > testEvict STARTED
org.apache.kafka.streams.state.internals.InMemoryLRUCacheStoreTest > testEvict PASSED
org.apache.kafka.streams.state.internals.InMemoryLRUCacheStoreTest > testSize STARTED
org.apache.kafka.streams.state.internals.InMemoryLRUCacheStoreTest > testSize PASSED
org.apache.kafka.streams.state.internals.InMemoryLRUCacheStoreTest > testPutIfAbsent STARTED
org.apache.kafka.streams.state.internals.InMemoryLRUCacheStoreTest > testPutIfAbsent PASSED
org.apache.kafka.streams.state.internals.InMemoryLRUCacheStoreTest > testRestoreWithDefaultSerdes STARTED
org.apache.kafka.streams.state.internals.InMemoryLRUCacheStoreTest > testRestoreWithDefaultSerdes PASSED
org.apache.kafka.streams.state.internals.InMemoryLRUCacheStoreTest > testRestore STARTED
org.apache.kafka.streams.state.internals.InMemoryLRUCacheStoreTest > testRestore PASSED
org.apache.kafka.streams.state.internals.InMemoryLRUCacheStoreTest > testPutGetRange STARTED
org.apache.kafka.streams.state.internals.InMemoryLRUCacheStoreTest > testPutGetRange PASSED
org.apache.kafka.streams.state.internals.InMemoryLRUCacheStoreTest > testPutGetRangeWithDefaultSerdes STARTED
org.apache.kafka.streams.state.internals.InMemoryLRUCacheStoreTest > testPutGetRangeWithDefaultSerdes PASSED
org.apache.kafka.streams.state.internals.WindowStoreUtilsTest > testSerialization STARTED
org.apache.kafka.streams.state.internals.WindowStoreUtilsTest > testSerialization PASSED
org.apache.kafka.streams.state.internals.QueryableStoreProviderTest > shouldNotReturnKVStoreWhenIsWindowStore STARTED
org.apache.kafka.streams.state.internals.QueryableStoreProviderTest > shouldNotReturnKVStoreWhenIsWindowStore PASSED
org.apache.kafka.streams.state.internals.QueryableStoreProviderTest > shouldReturnNullIfKVStoreDoesntExist STARTED
org.apache.kafka.streams.state.internals.QueryableStoreProviderTest > shouldReturnNullIfKVStoreDoesntExist PASSED
org.apache.kafka.streams.state.internals.QueryableStoreProviderTest > shouldReturnNullIfWindowStoreDoesntExist STARTED
org.apache.kafka.streams.state.internals.QueryableStoreProviderTest > shouldReturnNullIfWindowStoreDoesntExist PASSED
org.apache.kafka.streams.state.internals.QueryableStoreProviderTest > shouldNotReturnWindowStoreWhenIsKVStore STARTED
org.apache.kafka.streams.state.internals.QueryableStoreProviderTest > shouldNotReturnWindowStoreWhenIsKVStore PASSED
org.apache.kafka.streams.state.internals.QueryableStoreProviderTest > shouldReturnKVStoreWhenItExists STARTED
org.apache.kafka.streams.state.internals.QueryableStoreProviderTest > shouldReturnKVStoreWhenItExists PASSED
org.apache.kafka.streams.state.internals.QueryableStoreProviderTest > shouldReturnWindowStoreWhenItExists STARTED
org.apache.kafka.streams.state.internals.QueryableStoreProviderTest > shouldReturnWindowStoreWhenItExists PASSED
org.apache.kafka.streams.state.internals.WrappingStoreProviderTest > shouldThrowInvalidStoreExceptionIfNoStoreOfTypeFound STARTED
org.apache.kafka.streams.state.internals.WrappingStoreProviderTest > shouldThrowInvalidStoreExceptionIfNoStoreOfTypeFound PASSED
org.apache.kafka.streams.state.internals.WrappingStoreProviderTest > shouldFindWindowStores STARTED
org.apache.kafka.streams.state.internals.WrappingStoreProviderTest > shouldFindWindowStores PASSED
org.apache.kafka.streams.state.internals.WrappingStoreProviderTest > shouldFindKeyValueStores STARTED
org.apache.kafka.streams.state.internals.WrappingStoreProviderTest > shouldFindKeyValueStores PASSED
org.apache.kafka.streams.state.internals.InMemoryKeyValueStoreTest > testSize STARTED
org.apache.kafka.streams.state.internals.InMemoryKeyValueStoreTest > testSize PASSED
org.apache.kafka.streams.state.internals.InMemoryKeyValueStoreTest > testPutIfAbsent STARTED
org.apache.kafka.streams.state.internals.InMemoryKeyValueStoreTest > testPutIfAbsent PASSED
org.apache.kafka.streams.state.internals.InMemoryKeyValueStoreTest > testRestoreWithDefaultSerdes STARTED
org.apache.kafka.streams.state.internals.InMemoryKeyValueStoreTest > testRestoreWithDefaultSerdes PASSED
org.apache.kafka.streams.state.internals.InMemoryKeyValueStoreTest > testRestore STARTED
org.apache.kafka.streams.state.internals.InMemoryKeyValueStoreTest > testRestore PASSED
org.apache.kafka.streams.state.internals.InMemoryKeyValueStoreTest > testPutGetRange STARTED
org.apache.kafka.streams.state.internals.InMemoryKeyValueStoreTest > testPutGetRange PASSED
org.apache.kafka.streams.state.internals.InMemoryKeyValueStoreTest > testPutGetRangeWithDefaultSerdes STARTED
org.apache.kafka.streams.state.internals.InMemoryKeyValueStoreTest > testPutGetRangeWithDefaultSerdes PASSED
org.apache.kafka.streams.state.internals.RocksDBKeyValueStoreTest > shouldUseCustomRocksDbConfigSetter STARTED
org.apache.kafka.streams.state.internals.RocksDBKeyValueStoreTest > shouldUseCustomRocksDbConfigSetter PASSED
org.apache.kafka.streams.state.internals.RocksDBKeyValueStoreTest > testSize STARTED
org.apache.kafka.streams.state.internals.RocksDBKeyValueStoreTest > testSize PASSED
org.apache.kafka.streams.state.internals.RocksDBKeyValueStoreTest > testPutIfAbsent STARTED
org.apache.kafka.streams.state.internals.RocksDBKeyValueStoreTest > testPutIfAbsent PASSED
org.apache.kafka.streams.state.internals.RocksDBKeyValueStoreTest > testRestoreWithDefaultSerdes STARTED
org.apache.kafka.streams.state.internals.RocksDBKeyValueStoreTest > testRestoreWithDefaultSerdes PASSED
org.apache.kafka.streams.state.internals.RocksDBKeyValueStoreTest > testRestore STARTED
org.apache.kafka.streams.state.internals.RocksDBKeyValueStoreTest > testRestore PASSED
org.apache.kafka.streams.state.internals.RocksDBKeyValueStoreTest > testPutGetRange STARTED
org.apache.kafka.streams.state.internals.RocksDBKeyValueStoreTest > testPutGetRange PASSED
org.apache.kafka.streams.state.internals.RocksDBKeyValueStoreTest > testPutGetRangeWithDefaultSerdes STARTED
org.apache.kafka.streams.state.internals.RocksDBKeyValueStoreTest > testPutGetRangeWithDefaultSerdes PASSED
org.apache.kafka.streams.integration.FanoutIntegrationTest > shouldFanoutTheInput STARTED
org.apache.kafka.streams.integration.FanoutIntegrationTest > shouldFanoutTheInput PASSED
org.apache.kafka.streams.integration.KStreamAggregationIntegrationTest > shouldReduce STARTED
org.apache.kafka.streams.integration.KStreamAggregationIntegrationTest > shouldReduce PASSED
org.apache.kafka.streams.integration.KStreamAggregationIntegrationTest > shouldAggregate STARTED
ERROR: Could not install GRADLE_2_4_RC_2_HOME
java.lang.NullPointerException
at hudson.plugins.toolenv.ToolEnvBuildWrapper$1.buildEnvVars(ToolEnvBuildWrapper.java:46)
at hudson.model.AbstractBuild.getEnvironment(AbstractBuild.java:931)
at hudson.plugins.git.GitSCM.getParamExpandedRepos(GitSCM.java:404)
at hudson.plugins.git.GitSCM.compareRemoteRevisionWithImpl(GitSCM.java:609)
at hudson.plugins.git.GitSCM.compareRemoteRevisionWith(GitSCM.java:574)
at hudson.scm.SCM.compareRemoteRevisionWith(SCM.java:381)
at hudson.scm.SCM.poll(SCM.java:398)
at hudson.model.AbstractProject._poll(AbstractProject.java:1446)
at hudson.model.AbstractProject.poll(AbstractProject.java:1349)
at hudson.triggers.SCMTrigger$Runner.runPolling(SCMTrigger.java:528)
at hudson.triggers.SCMTrigger$Runner.run(SCMTrigger.java:557)
at hudson.util.SequentialExecutionQueue$QueueEntry.run(SequentialExecutionQueue.java:119)
at java.util.concurrent.Executors$RunnableAdapter.call(Executors.java:511)
at java.util.concurrent.FutureTask.run(FutureTask.java:266)
at java.util.concurrent.ThreadPoolExecutor.runWorker(ThreadPoolExecutor.java:1142)
at java.util.concurrent.ThreadPoolExecutor$Worker.run(ThreadPoolExecutor.java:617)
at java.lang.Thread.run(Thread.java:745)
ERROR: Could not install GRADLE_2_4_RC_2_HOME
java.lang.NullPointerException
at hudson.plugins.toolenv.ToolEnvBuildWrapper$1.buildEnvVars(ToolEnvBuildWrapper.java:46)
at hudson.model.AbstractBuild.getEnvironment(AbstractBuild.java:931)
at hudson.plugins.git.GitSCM.getParamExpandedRepos(GitSCM.java:404)
at hudson.plugins.git.GitSCM.compareRemoteRevisionWithImpl(GitSCM.java:609)
at hudson.plugins.git.GitSCM.compareRemoteRevisionWith(GitSCM.java:574)
at hudson.scm.SCM.compareRemoteRevisionWith(SCM.java:381)
at hudson.scm.SCM.poll(SCM.java:398)
at hudson.model.AbstractProject._poll(AbstractProject.java:1446)
at hudson.model.AbstractProject.poll(AbstractProject.java:1349)
at hudson.triggers.SCMTrigger$Runner.runPolling(SCMTrigger.java:528)
at hudson.triggers.SCMTrigger$Runner.run(SCMTrigger.java:557)
at hudson.util.SequentialExecutionQueue$QueueEntry.run(SequentialExecutionQueue.java:119)
at java.util.concurrent.Executors$RunnableAdapter.call(Executors.java:511)
at java.util.concurrent.FutureTask.run(FutureTask.java:266)
at java.util.concurrent.ThreadPoolExecutor.runWorker(ThreadPoolExecutor.java:1142)
at java.util.concurrent.ThreadPoolExecutor$Worker.run(ThreadPoolExecutor.java:617)
at java.lang.Thread.run(Thread.java:745)
Build timed out (after 180 minutes). Marking the build as failed.
Build was aborted
Recording test results
Setting GRADLE_2_4_RC_2_HOME=/home/jenkins/jenkins-slave/tools/hudson.plugins.gradle.GradleInstallation/Gradle_2.4-rc-2
Setting GRADLE_2_4_RC_2_HOME=/home/jenkins/jenkins-slave/tools/hudson.plugins.gradle.GradleInstallation/Gradle_2.4-rc-2
Jenkins build is back to normal : kafka-trunk-jdk8 #843
Posted by Apache Jenkins Server <je...@builds.apache.org>.
See <https://builds.apache.org/job/kafka-trunk-jdk8/843/changes>
Build failed in Jenkins: kafka-trunk-jdk8 #842
Posted by Apache Jenkins Server <je...@builds.apache.org>.
See <https://builds.apache.org/job/kafka-trunk-jdk8/842/changes>
Changes:
[junrao] KAFKA-4015; Change cleanup.policy config to accept a list of valid
------------------------------------------
[...truncated 6875 lines...]
kafka.api.AuthorizerIntegrationTest > testCreatePermissionNeededForWritingToNonExistentTopic STARTED
kafka.api.AuthorizerIntegrationTest > testCreatePermissionNeededForWritingToNonExistentTopic PASSED
kafka.api.AuthorizerIntegrationTest > testSimpleConsumeWithOffsetLookupAndNoGroupAccess STARTED
kafka.api.AuthorizerIntegrationTest > testSimpleConsumeWithOffsetLookupAndNoGroupAccess PASSED
kafka.api.AuthorizerIntegrationTest > testConsumeWithTopicDescribe STARTED
kafka.api.AuthorizerIntegrationTest > testConsumeWithTopicDescribe PASSED
kafka.api.AuthorizerIntegrationTest > testOffsetFetchWithNoTopicAccess STARTED
kafka.api.AuthorizerIntegrationTest > testOffsetFetchWithNoTopicAccess PASSED
kafka.api.AuthorizerIntegrationTest > testCommitWithNoTopicAccess STARTED
kafka.api.AuthorizerIntegrationTest > testCommitWithNoTopicAccess PASSED
kafka.api.AuthorizerIntegrationTest > testProduceWithNoTopicAccess STARTED
kafka.api.AuthorizerIntegrationTest > testProduceWithNoTopicAccess PASSED
kafka.api.AuthorizerIntegrationTest > testProduceWithTopicWrite STARTED
kafka.api.AuthorizerIntegrationTest > testProduceWithTopicWrite PASSED
kafka.api.AuthorizerIntegrationTest > testAuthorization STARTED
kafka.api.AuthorizerIntegrationTest > testAuthorization PASSED
kafka.api.AuthorizerIntegrationTest > testUnauthorizedDeleteWithDescribe STARTED
kafka.api.AuthorizerIntegrationTest > testUnauthorizedDeleteWithDescribe PASSED
kafka.api.AuthorizerIntegrationTest > testConsumeWithTopicAndGroupRead STARTED
kafka.api.AuthorizerIntegrationTest > testConsumeWithTopicAndGroupRead PASSED
kafka.api.AuthorizerIntegrationTest > testUnauthorizedDeleteWithoutDescribe STARTED
kafka.api.AuthorizerIntegrationTest > testUnauthorizedDeleteWithoutDescribe PASSED
kafka.api.AuthorizerIntegrationTest > testConsumeWithTopicWrite STARTED
kafka.api.AuthorizerIntegrationTest > testConsumeWithTopicWrite PASSED
kafka.api.AuthorizerIntegrationTest > testOffsetFetchWithNoGroupAccess STARTED
kafka.api.AuthorizerIntegrationTest > testOffsetFetchWithNoGroupAccess PASSED
kafka.api.AuthorizerIntegrationTest > testCommitWithNoAccess STARTED
kafka.api.AuthorizerIntegrationTest > testCommitWithNoAccess PASSED
kafka.api.AuthorizerIntegrationTest > testCommitWithNoGroupAccess STARTED
kafka.api.AuthorizerIntegrationTest > testCommitWithNoGroupAccess PASSED
kafka.api.AuthorizerIntegrationTest > testConsumeWithNoAccess STARTED
kafka.api.AuthorizerIntegrationTest > testConsumeWithNoAccess PASSED
kafka.api.AuthorizerIntegrationTest > testOffsetFetchWithTopicAndGroupRead STARTED
kafka.api.AuthorizerIntegrationTest > testOffsetFetchWithTopicAndGroupRead PASSED
kafka.api.AuthorizerIntegrationTest > testCommitWithTopicDescribe STARTED
kafka.api.AuthorizerIntegrationTest > testCommitWithTopicDescribe PASSED
kafka.api.AuthorizerIntegrationTest > testProduceWithTopicDescribe STARTED
kafka.api.AuthorizerIntegrationTest > testProduceWithTopicDescribe PASSED
kafka.api.AuthorizerIntegrationTest > testOffsetFetchTopicDescribe STARTED
kafka.api.AuthorizerIntegrationTest > testOffsetFetchTopicDescribe PASSED
kafka.api.AuthorizerIntegrationTest > testCommitWithTopicAndGroupRead STARTED
kafka.api.AuthorizerIntegrationTest > testCommitWithTopicAndGroupRead PASSED
kafka.api.AuthorizerIntegrationTest > testSimpleConsumeWithExplicitSeekAndNoGroupAccess STARTED
kafka.api.AuthorizerIntegrationTest > testSimpleConsumeWithExplicitSeekAndNoGroupAccess PASSED
kafka.api.SaslPlainPlaintextConsumerTest > testCoordinatorFailover STARTED
kafka.api.SaslPlainPlaintextConsumerTest > testCoordinatorFailover PASSED
kafka.api.SaslPlainPlaintextConsumerTest > testSimpleConsumption STARTED
kafka.api.SaslPlainPlaintextConsumerTest > testSimpleConsumption PASSED
kafka.api.RequestResponseSerializationTest > testSerializationAndDeserialization STARTED
kafka.api.RequestResponseSerializationTest > testSerializationAndDeserialization PASSED
kafka.api.RequestResponseSerializationTest > testFetchResponseVersion STARTED
kafka.api.RequestResponseSerializationTest > testFetchResponseVersion PASSED
kafka.api.RequestResponseSerializationTest > testProduceResponseVersion STARTED
kafka.api.RequestResponseSerializationTest > testProduceResponseVersion PASSED
kafka.api.SaslPlainSslEndToEndAuthorizationTest > testNoConsumeAcl STARTED
kafka.api.SaslPlainSslEndToEndAuthorizationTest > testNoConsumeAcl PASSED
kafka.api.SaslPlainSslEndToEndAuthorizationTest > testProduceConsumeViaAssign STARTED
kafka.api.SaslPlainSslEndToEndAuthorizationTest > testProduceConsumeViaAssign PASSED
kafka.api.SaslPlainSslEndToEndAuthorizationTest > testNoProduceAcl STARTED
kafka.api.SaslPlainSslEndToEndAuthorizationTest > testNoProduceAcl PASSED
kafka.api.SaslPlainSslEndToEndAuthorizationTest > testNoGroupAcl STARTED
kafka.api.SaslPlainSslEndToEndAuthorizationTest > testNoGroupAcl PASSED
kafka.api.SaslPlainSslEndToEndAuthorizationTest > testProduceConsumeViaSubscribe STARTED
kafka.api.SaslPlainSslEndToEndAuthorizationTest > testProduceConsumeViaSubscribe PASSED
kafka.api.SaslSslConsumerTest > testCoordinatorFailover STARTED
kafka.api.SaslSslConsumerTest > testCoordinatorFailover PASSED
kafka.api.SaslSslConsumerTest > testSimpleConsumption STARTED
kafka.api.SaslSslConsumerTest > testSimpleConsumption PASSED
kafka.api.test.ProducerCompressionTest > testCompression[0] STARTED
kafka.api.test.ProducerCompressionTest > testCompression[0] PASSED
kafka.api.test.ProducerCompressionTest > testCompression[1] STARTED
kafka.api.test.ProducerCompressionTest > testCompression[1] PASSED
kafka.api.test.ProducerCompressionTest > testCompression[2] STARTED
kafka.api.test.ProducerCompressionTest > testCompression[2] PASSED
kafka.api.test.ProducerCompressionTest > testCompression[3] STARTED
kafka.api.test.ProducerCompressionTest > testCompression[3] PASSED
kafka.controller.ControllerFailoverTest > testMetadataUpdate STARTED
kafka.controller.ControllerFailoverTest > testMetadataUpdate PASSED
kafka.tools.MirrorMakerTest > testDefaultMirrorMakerMessageHandlerWithNoTimestampInSourceMessage STARTED
kafka.tools.MirrorMakerTest > testDefaultMirrorMakerMessageHandlerWithNoTimestampInSourceMessage PASSED
kafka.tools.MirrorMakerTest > testDefaultMirrorMakerMessageHandler STARTED
kafka.tools.MirrorMakerTest > testDefaultMirrorMakerMessageHandler PASSED
kafka.tools.ConsoleProducerTest > testParseKeyProp STARTED
kafka.tools.ConsoleProducerTest > testParseKeyProp PASSED
kafka.tools.ConsoleProducerTest > testValidConfigsOldProducer STARTED
kafka.tools.ConsoleProducerTest > testValidConfigsOldProducer PASSED
kafka.tools.ConsoleProducerTest > testInvalidConfigs STARTED
kafka.tools.ConsoleProducerTest > testInvalidConfigs PASSED
kafka.tools.ConsoleProducerTest > testValidConfigsNewProducer STARTED
kafka.tools.ConsoleProducerTest > testValidConfigsNewProducer PASSED
kafka.tools.ConsoleConsumerTest > shouldLimitReadsToMaxMessageLimit STARTED
kafka.tools.ConsoleConsumerTest > shouldLimitReadsToMaxMessageLimit PASSED
kafka.tools.ConsoleConsumerTest > shouldParseValidNewConsumerValidConfig STARTED
kafka.tools.ConsoleConsumerTest > shouldParseValidNewConsumerValidConfig PASSED
kafka.tools.ConsoleConsumerTest > shouldStopWhenOutputCheckErrorFails STARTED
kafka.tools.ConsoleConsumerTest > shouldStopWhenOutputCheckErrorFails PASSED
kafka.tools.ConsoleConsumerTest > shouldParseValidNewSimpleConsumerValidConfigWithStringOffset STARTED
kafka.tools.ConsoleConsumerTest > shouldParseValidNewSimpleConsumerValidConfigWithStringOffset PASSED
kafka.tools.ConsoleConsumerTest > shouldParseConfigsFromFile STARTED
kafka.tools.ConsoleConsumerTest > shouldParseConfigsFromFile PASSED
kafka.tools.ConsoleConsumerTest > shouldParseValidNewSimpleConsumerValidConfigWithNumericOffset STARTED
kafka.tools.ConsoleConsumerTest > shouldParseValidNewSimpleConsumerValidConfigWithNumericOffset PASSED
kafka.tools.ConsoleConsumerTest > shouldParseValidOldConsumerValidConfig STARTED
kafka.tools.ConsoleConsumerTest > shouldParseValidOldConsumerValidConfig PASSED
unit.kafka.admin.ReassignPartitionsClusterTest > shouldExpandCluster STARTED
unit.kafka.admin.ReassignPartitionsClusterTest > shouldExpandCluster PASSED
unit.kafka.admin.ReassignPartitionsClusterTest > shouldMoveSinglePartition STARTED
unit.kafka.admin.ReassignPartitionsClusterTest > shouldMoveSinglePartition PASSED
unit.kafka.admin.ReassignPartitionsClusterTest > shouldShrinkCluster STARTED
unit.kafka.admin.ReassignPartitionsClusterTest > shouldShrinkCluster PASSED
unit.kafka.server.ApiVersionsTest > testApiVersions STARTED
unit.kafka.server.ApiVersionsTest > testApiVersions PASSED
integration.kafka.api.GroupCoordinatorIntegrationTest > testGroupCoordinatorPropagatesOfffsetsTopicCompressionCodec STARTED
integration.kafka.api.GroupCoordinatorIntegrationTest > testGroupCoordinatorPropagatesOfffsetsTopicCompressionCodec PASSED
832 tests completed, 1 failed
:kafka-trunk-jdk8:core:test FAILED
:test_core_2_11 FAILED
FAILURE: Build failed with an exception.
* What went wrong:
Execution failed for task ':core:test'.
> There were failing tests. See the report at: file://<https://builds.apache.org/job/kafka-trunk-jdk8/ws/core/build/reports/tests/test/index.html>
* Try:
Run with --stacktrace option to get the stack trace. Run with --info or --debug option to get more log output.
BUILD FAILED
Total time: 1 hrs 51 mins 34.17 secs
Build step 'Execute shell' marked build as failure
Recording test results
Setting GRADLE_2_4_RC_2_HOME=/home/jenkins/jenkins-slave/tools/hudson.plugins.gradle.GradleInstallation/Gradle_2.4-rc-2
Setting GRADLE_2_4_RC_2_HOME=/home/jenkins/jenkins-slave/tools/hudson.plugins.gradle.GradleInstallation/Gradle_2.4-rc-2
Build failed in Jenkins: kafka-trunk-jdk8 #841
Posted by Apache Jenkins Server <je...@builds.apache.org>.
See <https://builds.apache.org/job/kafka-trunk-jdk8/841/changes>
Changes:
[ismael] MINOR: Update rocksDB dependency to 4.9.0
[ismael] MINOR: Fix wording in Metadata.add javadoc
------------------------------------------
[...truncated 12126 lines...]
org.apache.kafka.streams.kstream.internals.KTableKTableLeftJoinTest > testJoin PASSED
org.apache.kafka.streams.kstream.internals.KTableKTableLeftJoinTest > testNotSendingOldValue STARTED
org.apache.kafka.streams.kstream.internals.KTableKTableLeftJoinTest > testNotSendingOldValue PASSED
org.apache.kafka.streams.kstream.internals.KeyValuePrinterProcessorTest > testPrintKeyValueWithProvidedSerde STARTED
org.apache.kafka.streams.kstream.internals.KeyValuePrinterProcessorTest > testPrintKeyValueWithProvidedSerde PASSED
org.apache.kafka.streams.kstream.internals.KeyValuePrinterProcessorTest > testPrintKeyValuesWithName STARTED
org.apache.kafka.streams.kstream.internals.KeyValuePrinterProcessorTest > testPrintKeyValuesWithName PASSED
org.apache.kafka.streams.kstream.internals.KeyValuePrinterProcessorTest > testPrintKeyValueDefaultSerde STARTED
org.apache.kafka.streams.kstream.internals.KeyValuePrinterProcessorTest > testPrintKeyValueDefaultSerde PASSED
org.apache.kafka.streams.kstream.internals.KTableSourceTest > testSendingOldValue STARTED
org.apache.kafka.streams.kstream.internals.KTableSourceTest > testSendingOldValue PASSED
org.apache.kafka.streams.kstream.internals.KTableSourceTest > testNotSendingOldValue STARTED
org.apache.kafka.streams.kstream.internals.KTableSourceTest > testNotSendingOldValue PASSED
org.apache.kafka.streams.kstream.internals.KTableSourceTest > testKTable STARTED
org.apache.kafka.streams.kstream.internals.KTableSourceTest > testKTable PASSED
org.apache.kafka.streams.kstream.internals.KTableSourceTest > testValueGetter STARTED
org.apache.kafka.streams.kstream.internals.KTableSourceTest > testValueGetter PASSED
org.apache.kafka.streams.kstream.internals.KTableMapKeysTest > testMapKeysConvertingToStream STARTED
org.apache.kafka.streams.kstream.internals.KTableMapKeysTest > testMapKeysConvertingToStream PASSED
org.apache.kafka.streams.kstream.internals.KStreamForeachTest > testForeach STARTED
org.apache.kafka.streams.kstream.internals.KStreamForeachTest > testForeach PASSED
org.apache.kafka.streams.kstream.internals.KTableKTableOuterJoinTest > testSendingOldValue STARTED
org.apache.kafka.streams.kstream.internals.KTableKTableOuterJoinTest > testSendingOldValue PASSED
org.apache.kafka.streams.kstream.internals.KTableKTableOuterJoinTest > testJoin STARTED
org.apache.kafka.streams.kstream.internals.KTableKTableOuterJoinTest > testJoin PASSED
org.apache.kafka.streams.kstream.internals.KTableKTableOuterJoinTest > testNotSendingOldValue STARTED
org.apache.kafka.streams.kstream.internals.KTableKTableOuterJoinTest > testNotSendingOldValue PASSED
org.apache.kafka.streams.kstream.internals.KStreamKStreamJoinTest > testOuterJoin STARTED
org.apache.kafka.streams.kstream.internals.KStreamKStreamJoinTest > testOuterJoin PASSED
org.apache.kafka.streams.kstream.internals.KStreamKStreamJoinTest > testJoin STARTED
org.apache.kafka.streams.kstream.internals.KStreamKStreamJoinTest > testJoin PASSED
org.apache.kafka.streams.kstream.internals.KStreamKStreamJoinTest > testWindowing STARTED
org.apache.kafka.streams.kstream.internals.KStreamKStreamJoinTest > testWindowing PASSED
org.apache.kafka.streams.kstream.internals.KStreamFlatMapValuesTest > testFlatMapValues STARTED
org.apache.kafka.streams.kstream.internals.KStreamFlatMapValuesTest > testFlatMapValues PASSED
org.apache.kafka.streams.kstream.internals.KTableKTableJoinTest > testJoin STARTED
org.apache.kafka.streams.kstream.internals.KTableKTableJoinTest > testJoin PASSED
org.apache.kafka.streams.kstream.internals.KTableKTableJoinTest > testNotSendingOldValues STARTED
org.apache.kafka.streams.kstream.internals.KTableKTableJoinTest > testNotSendingOldValues PASSED
org.apache.kafka.streams.kstream.internals.KTableKTableJoinTest > testSendingOldValues STARTED
org.apache.kafka.streams.kstream.internals.KTableKTableJoinTest > testSendingOldValues PASSED
org.apache.kafka.streams.kstream.internals.KTableAggregateTest > testAggBasic STARTED
org.apache.kafka.streams.kstream.internals.KTableAggregateTest > testAggBasic PASSED
org.apache.kafka.streams.kstream.internals.KTableAggregateTest > testCount STARTED
org.apache.kafka.streams.kstream.internals.KTableAggregateTest > testCount PASSED
org.apache.kafka.streams.kstream.internals.KTableAggregateTest > testAggRepartition STARTED
org.apache.kafka.streams.kstream.internals.KTableAggregateTest > testAggRepartition PASSED
org.apache.kafka.streams.kstream.internals.KTableAggregateTest > testRemoveOldBeforeAddNew STARTED
org.apache.kafka.streams.kstream.internals.KTableAggregateTest > testRemoveOldBeforeAddNew PASSED
org.apache.kafka.streams.kstream.internals.KStreamFilterTest > testFilterNot STARTED
org.apache.kafka.streams.kstream.internals.KStreamFilterTest > testFilterNot PASSED
org.apache.kafka.streams.kstream.internals.KStreamFilterTest > testFilter STARTED
org.apache.kafka.streams.kstream.internals.KStreamFilterTest > testFilter PASSED
org.apache.kafka.streams.kstream.internals.KStreamFlatMapTest > testFlatMap STARTED
org.apache.kafka.streams.kstream.internals.KStreamFlatMapTest > testFlatMap PASSED
org.apache.kafka.streams.kstream.internals.KStreamWindowAggregateTest > testAggBasic STARTED
org.apache.kafka.streams.kstream.internals.KStreamWindowAggregateTest > testAggBasic PASSED
org.apache.kafka.streams.kstream.internals.KStreamWindowAggregateTest > testJoin STARTED
org.apache.kafka.streams.kstream.internals.KStreamWindowAggregateTest > testJoin PASSED
org.apache.kafka.streams.kstream.internals.KStreamSelectKeyTest > testSelectKey STARTED
org.apache.kafka.streams.kstream.internals.KStreamSelectKeyTest > testSelectKey PASSED
org.apache.kafka.streams.kstream.internals.KStreamMapTest > testMap STARTED
org.apache.kafka.streams.kstream.internals.KStreamMapTest > testMap PASSED
org.apache.kafka.streams.kstream.internals.KStreamTransformValuesTest > testTransform STARTED
org.apache.kafka.streams.kstream.internals.KStreamTransformValuesTest > testTransform PASSED
org.apache.kafka.streams.kstream.internals.KTableFilterTest > testSendingOldValue STARTED
org.apache.kafka.streams.kstream.internals.KTableFilterTest > testSendingOldValue PASSED
org.apache.kafka.streams.kstream.internals.KTableFilterTest > testNotSendingOldValue STARTED
org.apache.kafka.streams.kstream.internals.KTableFilterTest > testNotSendingOldValue PASSED
org.apache.kafka.streams.kstream.internals.KTableFilterTest > testSkipNullOnMaterialization STARTED
org.apache.kafka.streams.kstream.internals.KTableFilterTest > testSkipNullOnMaterialization PASSED
org.apache.kafka.streams.kstream.internals.KTableFilterTest > testKTable STARTED
org.apache.kafka.streams.kstream.internals.KTableFilterTest > testKTable PASSED
org.apache.kafka.streams.kstream.internals.KTableFilterTest > testValueGetter STARTED
org.apache.kafka.streams.kstream.internals.KTableFilterTest > testValueGetter PASSED
org.apache.kafka.streams.kstream.internals.KStreamTransformTest > testTransform STARTED
org.apache.kafka.streams.kstream.internals.KStreamTransformTest > testTransform PASSED
org.apache.kafka.streams.kstream.internals.KGroupedStreamImplTest > shouldNotHaveNullReducerOnReduce STARTED
org.apache.kafka.streams.kstream.internals.KGroupedStreamImplTest > shouldNotHaveNullReducerOnReduce PASSED
org.apache.kafka.streams.kstream.internals.KGroupedStreamImplTest > shouldNotHaveNullStoreNameOnReduce STARTED
org.apache.kafka.streams.kstream.internals.KGroupedStreamImplTest > shouldNotHaveNullStoreNameOnReduce PASSED
org.apache.kafka.streams.kstream.internals.KGroupedStreamImplTest > shouldNotHaveNullAdderOnWindowedAggregate STARTED
org.apache.kafka.streams.kstream.internals.KGroupedStreamImplTest > shouldNotHaveNullAdderOnWindowedAggregate PASSED
org.apache.kafka.streams.kstream.internals.KGroupedStreamImplTest > shouldNotHaveNullInitializerOnWindowedAggregate STARTED
org.apache.kafka.streams.kstream.internals.KGroupedStreamImplTest > shouldNotHaveNullInitializerOnWindowedAggregate PASSED
org.apache.kafka.streams.kstream.internals.KGroupedStreamImplTest > shouldNotHaveNullReducerWithWindowedReduce STARTED
org.apache.kafka.streams.kstream.internals.KGroupedStreamImplTest > shouldNotHaveNullReducerWithWindowedReduce PASSED
org.apache.kafka.streams.kstream.internals.KGroupedStreamImplTest > shouldNotHaveNullStoreNameOnAggregate STARTED
org.apache.kafka.streams.kstream.internals.KGroupedStreamImplTest > shouldNotHaveNullStoreNameOnAggregate PASSED
org.apache.kafka.streams.kstream.internals.KGroupedStreamImplTest > shouldNotHaveNullAdderOnAggregate STARTED
org.apache.kafka.streams.kstream.internals.KGroupedStreamImplTest > shouldNotHaveNullAdderOnAggregate PASSED
org.apache.kafka.streams.kstream.internals.KGroupedStreamImplTest > shouldNotHaveNullWindowsWithWindowedReduce STARTED
org.apache.kafka.streams.kstream.internals.KGroupedStreamImplTest > shouldNotHaveNullWindowsWithWindowedReduce PASSED
org.apache.kafka.streams.kstream.internals.KGroupedStreamImplTest > shouldNotHaveNullWindowsOnWindowedAggregate STARTED
org.apache.kafka.streams.kstream.internals.KGroupedStreamImplTest > shouldNotHaveNullWindowsOnWindowedAggregate PASSED
org.apache.kafka.streams.kstream.internals.KGroupedStreamImplTest > shouldNotHaveNullStoreNameOnWindowedAggregate STARTED
org.apache.kafka.streams.kstream.internals.KGroupedStreamImplTest > shouldNotHaveNullStoreNameOnWindowedAggregate PASSED
org.apache.kafka.streams.kstream.internals.KGroupedStreamImplTest > shouldNotHaveNullStoreNameWithWindowedReduce STARTED
org.apache.kafka.streams.kstream.internals.KGroupedStreamImplTest > shouldNotHaveNullStoreNameWithWindowedReduce PASSED
org.apache.kafka.streams.kstream.internals.KGroupedStreamImplTest > shouldNotHaveNullInitializerOnAggregate STARTED
org.apache.kafka.streams.kstream.internals.KGroupedStreamImplTest > shouldNotHaveNullInitializerOnAggregate PASSED
org.apache.kafka.streams.kstream.KStreamBuilderTest > shouldHaveCorrectSourceTopicsForTableFromMergedStream STARTED
org.apache.kafka.streams.kstream.KStreamBuilderTest > shouldHaveCorrectSourceTopicsForTableFromMergedStream PASSED
org.apache.kafka.streams.kstream.KStreamBuilderTest > shouldHaveCorrectSourceTopicsForTableFromMergedStreamWithProcessors STARTED
org.apache.kafka.streams.kstream.KStreamBuilderTest > shouldHaveCorrectSourceTopicsForTableFromMergedStreamWithProcessors PASSED
org.apache.kafka.streams.kstream.KStreamBuilderTest > testMerge STARTED
org.apache.kafka.streams.kstream.KStreamBuilderTest > testMerge PASSED
org.apache.kafka.streams.kstream.KStreamBuilderTest > testFrom STARTED
org.apache.kafka.streams.kstream.KStreamBuilderTest > testFrom PASSED
org.apache.kafka.streams.kstream.KStreamBuilderTest > shouldThrowExceptionWhenTopicNamesAreNull STARTED
org.apache.kafka.streams.kstream.KStreamBuilderTest > shouldThrowExceptionWhenTopicNamesAreNull PASSED
org.apache.kafka.streams.kstream.KStreamBuilderTest > shouldThrowExceptionWhenNoTopicPresent STARTED
org.apache.kafka.streams.kstream.KStreamBuilderTest > shouldThrowExceptionWhenNoTopicPresent PASSED
org.apache.kafka.streams.kstream.KStreamBuilderTest > testNewName STARTED
org.apache.kafka.streams.kstream.KStreamBuilderTest > testNewName PASSED
353 tests completed, 1 failed
:streams:test FAILED
FAILURE: Build failed with an exception.
* What went wrong:
Execution failed for task ':streams:test'.
> There were failing tests. See the report at: file://<https://builds.apache.org/job/kafka-trunk-jdk8/ws/streams/build/reports/tests/test/index.html>
* Try:
Run with --stacktrace option to get the stack trace. Run with --info or --debug option to get more log output.
BUILD FAILED
Total time: 1 hrs 4 mins 12.98 secs
Build step 'Execute shell' marked build as failure
Recording test results
Setting GRADLE_2_4_RC_2_HOME=/home/jenkins/jenkins-slave/tools/hudson.plugins.gradle.GradleInstallation/Gradle_2.4-rc-2
Setting GRADLE_2_4_RC_2_HOME=/home/jenkins/jenkins-slave/tools/hudson.plugins.gradle.GradleInstallation/Gradle_2.4-rc-2
Build failed in Jenkins: kafka-trunk-jdk8 #840
Posted by Apache Jenkins Server <je...@builds.apache.org>.
See <https://builds.apache.org/job/kafka-trunk-jdk8/840/>
------------------------------------------
[...truncated 10776 lines...]
org.apache.kafka.clients.consumer.KafkaConsumerTest > testCommitsFetchedDuringAssign STARTED
org.apache.kafka.clients.consumer.KafkaConsumerTest > testCommitsFetchedDuringAssign PASSED
org.apache.kafka.clients.consumer.KafkaConsumerTest > testOsDefaultSocketBufferSizes STARTED
org.apache.kafka.clients.consumer.KafkaConsumerTest > testOsDefaultSocketBufferSizes PASSED
org.apache.kafka.clients.consumer.KafkaConsumerTest > testAssignOnNullTopicPartition STARTED
org.apache.kafka.clients.consumer.KafkaConsumerTest > testAssignOnNullTopicPartition PASSED
org.apache.kafka.clients.consumer.KafkaConsumerTest > testSeekNegative STARTED
org.apache.kafka.clients.consumer.KafkaConsumerTest > testSeekNegative PASSED
org.apache.kafka.clients.consumer.KafkaConsumerTest > testAssignOnEmptyTopicInPartition STARTED
org.apache.kafka.clients.consumer.KafkaConsumerTest > testAssignOnEmptyTopicInPartition PASSED
org.apache.kafka.clients.consumer.KafkaConsumerTest > testInvalidSocketReceiveBufferSize STARTED
org.apache.kafka.clients.consumer.KafkaConsumerTest > testInvalidSocketReceiveBufferSize PASSED
org.apache.kafka.clients.consumer.KafkaConsumerTest > testAutoCommitSentBeforePositionUpdate STARTED
org.apache.kafka.clients.consumer.KafkaConsumerTest > testAutoCommitSentBeforePositionUpdate PASSED
org.apache.kafka.clients.consumer.KafkaConsumerTest > testSubscriptionOnNullPattern STARTED
org.apache.kafka.clients.consumer.KafkaConsumerTest > testSubscriptionOnNullPattern PASSED
org.apache.kafka.clients.consumer.KafkaConsumerTest > verifyHeartbeatSent STARTED
org.apache.kafka.clients.consumer.KafkaConsumerTest > verifyHeartbeatSent PASSED
org.apache.kafka.clients.consumer.KafkaConsumerTest > verifyHeartbeatSentWhenFetchedDataReady STARTED
org.apache.kafka.clients.consumer.KafkaConsumerTest > verifyHeartbeatSentWhenFetchedDataReady PASSED
org.apache.kafka.clients.consumer.KafkaConsumerTest > testAssignOnEmptyTopicPartition STARTED
org.apache.kafka.clients.consumer.KafkaConsumerTest > testAssignOnEmptyTopicPartition PASSED
org.apache.kafka.clients.consumer.KafkaConsumerTest > testSubscriptionOnNullTopic STARTED
org.apache.kafka.clients.consumer.KafkaConsumerTest > testSubscriptionOnNullTopic PASSED
org.apache.kafka.clients.consumer.KafkaConsumerTest > testSubscription STARTED
org.apache.kafka.clients.consumer.KafkaConsumerTest > testSubscription PASSED
org.apache.kafka.clients.consumer.KafkaConsumerTest > testInterceptorConstructorClose STARTED
org.apache.kafka.clients.consumer.KafkaConsumerTest > testInterceptorConstructorClose PASSED
org.apache.kafka.clients.consumer.KafkaConsumerTest > testSubscriptionOnEmptyTopic STARTED
org.apache.kafka.clients.consumer.KafkaConsumerTest > testSubscriptionOnEmptyTopic PASSED
org.apache.kafka.clients.consumer.KafkaConsumerTest > testWakeupWithFetchDataAvailable STARTED
org.apache.kafka.clients.consumer.KafkaConsumerTest > testWakeupWithFetchDataAvailable PASSED
org.apache.kafka.clients.consumer.KafkaConsumerTest > testSubscriptionOnNullTopicCollection STARTED
org.apache.kafka.clients.consumer.KafkaConsumerTest > testSubscriptionOnNullTopicCollection PASSED
org.apache.kafka.clients.consumer.ConsumerConfigTest > testDeserializerToPropertyConfig STARTED
org.apache.kafka.clients.consumer.ConsumerConfigTest > testDeserializerToPropertyConfig PASSED
org.apache.kafka.clients.consumer.ConsumerConfigTest > testDeserializerToMapConfig STARTED
org.apache.kafka.clients.consumer.ConsumerConfigTest > testDeserializerToMapConfig PASSED
org.apache.kafka.clients.consumer.RoundRobinAssignorTest > testOneConsumerNoTopic STARTED
org.apache.kafka.clients.consumer.RoundRobinAssignorTest > testOneConsumerNoTopic PASSED
org.apache.kafka.clients.consumer.RoundRobinAssignorTest > testTwoConsumersTwoTopicsSixPartitions STARTED
org.apache.kafka.clients.consumer.RoundRobinAssignorTest > testTwoConsumersTwoTopicsSixPartitions PASSED
org.apache.kafka.clients.consumer.RoundRobinAssignorTest > testOneConsumerOneTopic STARTED
org.apache.kafka.clients.consumer.RoundRobinAssignorTest > testOneConsumerOneTopic PASSED
org.apache.kafka.clients.consumer.RoundRobinAssignorTest > testMultipleConsumersMixedTopics STARTED
org.apache.kafka.clients.consumer.RoundRobinAssignorTest > testMultipleConsumersMixedTopics PASSED
org.apache.kafka.clients.consumer.RoundRobinAssignorTest > testTwoConsumersOneTopicOnePartition STARTED
org.apache.kafka.clients.consumer.RoundRobinAssignorTest > testTwoConsumersOneTopicOnePartition PASSED
org.apache.kafka.clients.consumer.RoundRobinAssignorTest > testOneConsumerMultipleTopics STARTED
org.apache.kafka.clients.consumer.RoundRobinAssignorTest > testOneConsumerMultipleTopics PASSED
org.apache.kafka.clients.consumer.RoundRobinAssignorTest > testOnlyAssignsPartitionsFromSubscribedTopics STARTED
org.apache.kafka.clients.consumer.RoundRobinAssignorTest > testOnlyAssignsPartitionsFromSubscribedTopics PASSED
org.apache.kafka.clients.consumer.RoundRobinAssignorTest > testTwoConsumersOneTopicTwoPartitions STARTED
org.apache.kafka.clients.consumer.RoundRobinAssignorTest > testTwoConsumersOneTopicTwoPartitions PASSED
org.apache.kafka.clients.consumer.RoundRobinAssignorTest > testOneConsumerNonexistentTopic STARTED
org.apache.kafka.clients.consumer.RoundRobinAssignorTest > testOneConsumerNonexistentTopic PASSED
org.apache.kafka.clients.consumer.MockConsumerTest > testSimpleMock STARTED
org.apache.kafka.clients.consumer.MockConsumerTest > testSimpleMock PASSED
org.apache.kafka.clients.consumer.SerializeCompatibilityOffsetAndMetadataTest > testSerializationRoundtrip STARTED
org.apache.kafka.clients.consumer.SerializeCompatibilityOffsetAndMetadataTest > testSerializationRoundtrip PASSED
org.apache.kafka.clients.consumer.SerializeCompatibilityOffsetAndMetadataTest > testOffsetMetadataSerializationCompatibility STARTED
org.apache.kafka.clients.consumer.SerializeCompatibilityOffsetAndMetadataTest > testOffsetMetadataSerializationCompatibility PASSED
org.apache.kafka.clients.consumer.ConsumerRecordsTest > iterator STARTED
org.apache.kafka.clients.consumer.ConsumerRecordsTest > iterator PASSED
org.apache.kafka.clients.ClientUtilsTest > testOnlyBadHostname STARTED
org.apache.kafka.clients.ClientUtilsTest > testOnlyBadHostname PASSED
org.apache.kafka.clients.ClientUtilsTest > testParseAndValidateAddresses STARTED
org.apache.kafka.clients.ClientUtilsTest > testParseAndValidateAddresses PASSED
org.apache.kafka.clients.ClientUtilsTest > testNoPort STARTED
org.apache.kafka.clients.ClientUtilsTest > testNoPort PASSED
:examples:checkstyleMain
:examples:compileTestJava UP-TO-DATE
:examples:processTestResources UP-TO-DATE
:examples:testClasses UP-TO-DATE
:examples:checkstyleTest UP-TO-DATE
:examples:test UP-TO-DATE
:log4j-appender:checkstyleMain
:log4j-appender:compileTestJavawarning: [options] bootstrap class path not set in conjunction with -source 1.7
1 warning
:log4j-appender:processTestResources UP-TO-DATE
:log4j-appender:testClasses
:log4j-appender:checkstyleTest
:log4j-appender:test
org.apache.kafka.log4jappender.KafkaLog4jAppenderTest > testLog4jAppends STARTED
org.apache.kafka.log4jappender.KafkaLog4jAppenderTest > testLog4jAppends PASSED
org.apache.kafka.log4jappender.KafkaLog4jAppenderTest > testKafkaLog4jConfigs STARTED
org.apache.kafka.log4jappender.KafkaLog4jAppenderTest > testKafkaLog4jConfigs PASSED
:streams:checkstyleMain
:streams:compileTestJavawarning: [options] bootstrap class path not set in conjunction with -source 1.7
<https://builds.apache.org/job/kafka-trunk-jdk8/ws/streams/src/test/java/org/apache/kafka/streams/kstream/internals/KStreamImplTest.java>:203: warning: non-varargs call of varargs method with inexact argument type for last parameter;
testStream.branch(null);
^
cast to Predicate<String,String> for a varargs call
cast to Predicate<String,String>[] for a non-varargs call and to suppress this warning
Note: <https://builds.apache.org/job/kafka-trunk-jdk8/ws/streams/src/test/java/org/apache/kafka/streams/processor/internals/StreamsMetadataStateTest.java> uses or overrides a deprecated API.
Note: Recompile with -Xlint:deprecation for details.
Note: Some input files use unchecked or unsafe operations.
Note: Recompile with -Xlint:unchecked for details.
2 warnings
:streams:processTestResources
:streams:testClasses
:streams:checkstyleTest
:streams:test
org.apache.kafka.streams.integration.InternalTopicIntegrationTest > shouldCompactTopicsForStateChangelogs STARTED
org.apache.kafka.streams.integration.InternalTopicIntegrationTest > shouldCompactTopicsForStateChangelogs PASSED
org.apache.kafka.streams.integration.KStreamRepartitionJoinTest > shouldCorrectlyRepartitionOnJoinOperations STARTED
org.apache.kafka.streams.integration.KStreamRepartitionJoinTest > shouldCorrectlyRepartitionOnJoinOperations PASSED
org.apache.kafka.streams.integration.QueryableStateIntegrationTest > shouldBeAbleToQueryState STARTED
org.apache.kafka.streams.integration.QueryableStateIntegrationTest > shouldBeAbleToQueryState PASSED
org.apache.kafka.streams.integration.KStreamAggregationIntegrationTest > shouldReduce STARTED
org.apache.kafka.streams.integration.KStreamAggregationIntegrationTest > shouldReduce PASSED
org.apache.kafka.streams.integration.KStreamAggregationIntegrationTest > shouldAggregate STARTED
org.apache.kafka.streams.integration.KStreamAggregationIntegrationTest > shouldAggregate PASSED
org.apache.kafka.streams.integration.KStreamAggregationIntegrationTest > shouldCount STARTED
org.apache.kafka.streams.integration.KStreamAggregationIntegrationTest > shouldCount PASSED
org.apache.kafka.streams.integration.KStreamAggregationIntegrationTest > shouldGroupByKey STARTED
org.apache.kafka.streams.integration.KStreamAggregationIntegrationTest > shouldGroupByKey PASSED
org.apache.kafka.streams.integration.KStreamAggregationIntegrationTest > shouldReduceWindowed STARTED
org.apache.kafka.streams.integration.KStreamAggregationIntegrationTest > shouldReduceWindowed PASSED
org.apache.kafka.streams.integration.KStreamAggregationIntegrationTest > shouldAggregateWindowed STARTED
org.apache.kafka.streams.integration.KStreamAggregationIntegrationTest > shouldAggregateWindowed PASSED
org.apache.kafka.streams.integration.FanoutIntegrationTest > shouldFanoutTheInput STARTED
org.apache.kafka.streams.integration.FanoutIntegrationTest > shouldFanoutTheInput PASSED
org.apache.kafka.streams.integration.ResetIntegrationTest > testReprocessingFromScratchAfterReset STARTED
org.apache.kafka.streams.integration.ResetIntegrationTest > testReprocessingFromScratchAfterReset FAILED
java.lang.AssertionError: Condition not met within timeout 30000. Did not receive 10 number of records
at org.apache.kafka.test.TestUtils.waitForCondition(TestUtils.java:256)
at org.apache.kafka.streams.integration.utils.IntegrationTestUtils.waitUntilMinKeyValueRecordsReceived(IntegrationTestUtils.java:206)
at org.apache.kafka.streams.integration.utils.IntegrationTestUtils.waitUntilMinKeyValueRecordsReceived(IntegrationTestUtils.java:176)
at org.apache.kafka.streams.integration.ResetIntegrationTest.testReprocessingFromScratchAfterReset(ResetIntegrationTest.java:110)
11 tests completed, 1 failed
:streams:test FAILED
FAILURE: Build failed with an exception.
* What went wrong:
Execution failed for task ':streams:test'.
> Process 'Gradle Test Executor 4' finished with non-zero exit value 1
* Try:
Run with --stacktrace option to get the stack trace. Run with --info or --debug option to get more log output.
BUILD FAILED
Total time: 2 hrs 17 mins 53.856 secs
Build step 'Execute shell' marked build as failure
Recording test results
Setting GRADLE_2_4_RC_2_HOME=/home/jenkins/jenkins-slave/tools/hudson.plugins.gradle.GradleInstallation/Gradle_2.4-rc-2
ERROR: Step ?Publish JUnit test result report? failed: No test report files were found. Configuration error?
Setting GRADLE_2_4_RC_2_HOME=/home/jenkins/jenkins-slave/tools/hudson.plugins.gradle.GradleInstallation/Gradle_2.4-rc-2
Build failed in Jenkins: kafka-trunk-jdk8 #839
Posted by Apache Jenkins Server <je...@builds.apache.org>.
See <https://builds.apache.org/job/kafka-trunk-jdk8/839/>
------------------------------------------
Started by user ijuma
[EnvInject] - Loading node environment variables.
Building remotely on ubuntu-us1 (Ubuntu golang-ppa ubuntu-us ubuntu) in workspace <https://builds.apache.org/job/kafka-trunk-jdk8/ws/>
> git rev-parse --is-inside-work-tree # timeout=10
Fetching changes from the remote Git repository
> git config remote.origin.url https://git-wip-us.apache.org/repos/asf/kafka.git # timeout=10
Fetching upstream changes from https://git-wip-us.apache.org/repos/asf/kafka.git
> git --version # timeout=10
> git -c core.askpass=true fetch --tags --progress https://git-wip-us.apache.org/repos/asf/kafka.git +refs/heads/*:refs/remotes/origin/*
> git rev-parse refs/remotes/origin/trunk^{commit} # timeout=10
> git rev-parse refs/remotes/origin/origin/trunk^{commit} # timeout=10
Checking out Revision 7a877895a1c8494d48bf2c18e2f74fb913ed036a (refs/remotes/origin/trunk)
> git config core.sparsecheckout # timeout=10
> git checkout -f 7a877895a1c8494d48bf2c18e2f74fb913ed036a
> git rev-list 7a877895a1c8494d48bf2c18e2f74fb913ed036a # timeout=10
FATAL: Unable to produce a script file
java.io.IOException: Failed to create a temp file on <https://builds.apache.org/job/kafka-trunk-jdk8/ws/>
at hudson.FilePath.createTextTempFile(FilePath.java:1410)
at hudson.tasks.CommandInterpreter.createScriptFile(CommandInterpreter.java:142)
at hudson.tasks.CommandInterpreter.perform(CommandInterpreter.java:80)
at hudson.tasks.CommandInterpreter.perform(CommandInterpreter.java:64)
at hudson.tasks.BuildStepMonitor$1.perform(BuildStepMonitor.java:20)
at hudson.model.AbstractBuild$AbstractBuildExecution.perform(AbstractBuild.java:779)
at hudson.model.Build$BuildExecution.build(Build.java:205)
at hudson.model.Build$BuildExecution.doRun(Build.java:162)
at hudson.model.AbstractBuild$AbstractBuildExecution.run(AbstractBuild.java:534)
at hudson.model.Run.execute(Run.java:1741)
at hudson.model.FreeStyleBuild.run(FreeStyleBuild.java:43)
at hudson.model.ResourceController.execute(ResourceController.java:98)
at hudson.model.Executor.run(Executor.java:410)
Caused by: java.io.IOException: remote file operation failed: <https://builds.apache.org/job/kafka-trunk-jdk8/ws/> at hudson.remoting.Channel@2cc3b3b:ubuntu-us1: java.io.IOException: No space left on device
at hudson.FilePath.act(FilePath.java:1014)
at hudson.FilePath.act(FilePath.java:996)
at hudson.FilePath.createTextTempFile(FilePath.java:1384)
... 12 more
Caused by: java.io.IOException: No space left on device
at java.io.FileOutputStream.writeBytes(Native Method)
at java.io.FileOutputStream.write(FileOutputStream.java:345)
at sun.nio.cs.StreamEncoder.writeBytes(StreamEncoder.java:221)
at sun.nio.cs.StreamEncoder.implClose(StreamEncoder.java:316)
at sun.nio.cs.StreamEncoder.close(StreamEncoder.java:149)
at java.io.OutputStreamWriter.close(OutputStreamWriter.java:233)
at hudson.FilePath$17.invoke(FilePath.java:1403)
at hudson.FilePath$17.invoke(FilePath.java:1384)
at hudson.FilePath$FileCallableWrapper.call(FilePath.java:2772)
at hudson.remoting.UserRequest.perform(UserRequest.java:153)
at hudson.remoting.UserRequest.perform(UserRequest.java:50)
at hudson.remoting.Request$2.run(Request.java:332)
at hudson.remoting.InterceptingExecutorService$1.call(InterceptingExecutorService.java:68)
at java.util.concurrent.FutureTask.run(FutureTask.java:262)
at java.util.concurrent.ThreadPoolExecutor.runWorker(ThreadPoolExecutor.java:1145)
at java.util.concurrent.ThreadPoolExecutor$Worker.run(ThreadPoolExecutor.java:615)
at java.lang.Thread.run(Thread.java:745)
at ......remote call to ubuntu-us1(Native Method)
at hudson.remoting.Channel.attachCallSiteStackTrace(Channel.java:1416)
at hudson.remoting.UserResponse.retrieve(UserRequest.java:253)
at hudson.remoting.Channel.call(Channel.java:781)
at hudson.FilePath.act(FilePath.java:1007)
... 14 more
Build step 'Execute shell' marked build as failure
Recording test results
Setting GRADLE_2_4_RC_2_HOME=/home/jenkins/jenkins-slave/tools/hudson.plugins.gradle.GradleInstallation/Gradle_2.4-rc-2
ERROR: Step ‘Publish JUnit test result report’ failed: Test reports were found but none of them are new. Did tests run?
For example, <https://builds.apache.org/job/kafka-trunk-jdk8/ws/core/build/test-results/TEST-integration.kafka.api.GroupCoordinatorIntegrationTest.xml> is 1 day 20 hr old
Setting GRADLE_2_4_RC_2_HOME=/home/jenkins/jenkins-slave/tools/hudson.plugins.gradle.GradleInstallation/Gradle_2.4-rc-2
Build failed in Jenkins: kafka-trunk-jdk8 #838
Posted by Apache Jenkins Server <je...@builds.apache.org>.
See <https://builds.apache.org/job/kafka-trunk-jdk8/838/>
------------------------------------------
Started by user ijuma
[EnvInject] - Loading node environment variables.
Building remotely on ubuntu-us1 (Ubuntu golang-ppa ubuntu-us ubuntu) in workspace <https://builds.apache.org/job/kafka-trunk-jdk8/ws/>
> git rev-parse --is-inside-work-tree # timeout=10
Fetching changes from the remote Git repository
> git config remote.origin.url https://git-wip-us.apache.org/repos/asf/kafka.git # timeout=10
Fetching upstream changes from https://git-wip-us.apache.org/repos/asf/kafka.git
> git --version # timeout=10
> git -c core.askpass=true fetch --tags --progress https://git-wip-us.apache.org/repos/asf/kafka.git +refs/heads/*:refs/remotes/origin/*
> git rev-parse refs/remotes/origin/trunk^{commit} # timeout=10
> git rev-parse refs/remotes/origin/origin/trunk^{commit} # timeout=10
Checking out Revision 7a877895a1c8494d48bf2c18e2f74fb913ed036a (refs/remotes/origin/trunk)
> git config core.sparsecheckout # timeout=10
> git checkout -f 7a877895a1c8494d48bf2c18e2f74fb913ed036a
> git rev-list 7a877895a1c8494d48bf2c18e2f74fb913ed036a # timeout=10
FATAL: Unable to produce a script file
java.io.IOException: Failed to create a temp file on <https://builds.apache.org/job/kafka-trunk-jdk8/ws/>
at hudson.FilePath.createTextTempFile(FilePath.java:1410)
at hudson.tasks.CommandInterpreter.createScriptFile(CommandInterpreter.java:142)
at hudson.tasks.CommandInterpreter.perform(CommandInterpreter.java:80)
at hudson.tasks.CommandInterpreter.perform(CommandInterpreter.java:64)
at hudson.tasks.BuildStepMonitor$1.perform(BuildStepMonitor.java:20)
at hudson.model.AbstractBuild$AbstractBuildExecution.perform(AbstractBuild.java:779)
at hudson.model.Build$BuildExecution.build(Build.java:205)
at hudson.model.Build$BuildExecution.doRun(Build.java:162)
at hudson.model.AbstractBuild$AbstractBuildExecution.run(AbstractBuild.java:534)
at hudson.model.Run.execute(Run.java:1741)
at hudson.model.FreeStyleBuild.run(FreeStyleBuild.java:43)
at hudson.model.ResourceController.execute(ResourceController.java:98)
at hudson.model.Executor.run(Executor.java:410)
Caused by: java.io.IOException: remote file operation failed: <https://builds.apache.org/job/kafka-trunk-jdk8/ws/> at hudson.remoting.Channel@2cc3b3b:ubuntu-us1: java.io.IOException: No space left on device
at hudson.FilePath.act(FilePath.java:1014)
at hudson.FilePath.act(FilePath.java:996)
at hudson.FilePath.createTextTempFile(FilePath.java:1384)
... 12 more
Caused by: java.io.IOException: No space left on device
at java.io.FileOutputStream.writeBytes(Native Method)
at java.io.FileOutputStream.write(FileOutputStream.java:345)
at sun.nio.cs.StreamEncoder.writeBytes(StreamEncoder.java:221)
at sun.nio.cs.StreamEncoder.implClose(StreamEncoder.java:316)
at sun.nio.cs.StreamEncoder.close(StreamEncoder.java:149)
at java.io.OutputStreamWriter.close(OutputStreamWriter.java:233)
at hudson.FilePath$17.invoke(FilePath.java:1403)
at hudson.FilePath$17.invoke(FilePath.java:1384)
at hudson.FilePath$FileCallableWrapper.call(FilePath.java:2772)
at hudson.remoting.UserRequest.perform(UserRequest.java:153)
at hudson.remoting.UserRequest.perform(UserRequest.java:50)
at hudson.remoting.Request$2.run(Request.java:332)
at hudson.remoting.InterceptingExecutorService$1.call(InterceptingExecutorService.java:68)
at java.util.concurrent.FutureTask.run(FutureTask.java:262)
at java.util.concurrent.ThreadPoolExecutor.runWorker(ThreadPoolExecutor.java:1145)
at java.util.concurrent.ThreadPoolExecutor$Worker.run(ThreadPoolExecutor.java:615)
at java.lang.Thread.run(Thread.java:745)
at ......remote call to ubuntu-us1(Native Method)
at hudson.remoting.Channel.attachCallSiteStackTrace(Channel.java:1416)
at hudson.remoting.UserResponse.retrieve(UserRequest.java:253)
at hudson.remoting.Channel.call(Channel.java:781)
at hudson.FilePath.act(FilePath.java:1007)
... 14 more
Build step 'Execute shell' marked build as failure
Recording test results
Setting GRADLE_2_4_RC_2_HOME=/home/jenkins/jenkins-slave/tools/hudson.plugins.gradle.GradleInstallation/Gradle_2.4-rc-2
ERROR: Step ‘Publish JUnit test result report’ failed: Test reports were found but none of them are new. Did tests run?
For example, <https://builds.apache.org/job/kafka-trunk-jdk8/ws/core/build/test-results/TEST-integration.kafka.api.GroupCoordinatorIntegrationTest.xml> is 1 day 20 hr old
Setting GRADLE_2_4_RC_2_HOME=/home/jenkins/jenkins-slave/tools/hudson.plugins.gradle.GradleInstallation/Gradle_2.4-rc-2
Build failed in Jenkins: kafka-trunk-jdk8 #837
Posted by Apache Jenkins Server <je...@builds.apache.org>.
See <https://builds.apache.org/job/kafka-trunk-jdk8/837/>
------------------------------------------
Started by an SCM change
[EnvInject] - Loading node environment variables.
Building remotely on ubuntu-us1 (Ubuntu golang-ppa ubuntu-us ubuntu) in workspace <https://builds.apache.org/job/kafka-trunk-jdk8/ws/>
> git rev-parse --is-inside-work-tree # timeout=10
Fetching changes from the remote Git repository
> git config remote.origin.url https://git-wip-us.apache.org/repos/asf/kafka.git # timeout=10
Fetching upstream changes from https://git-wip-us.apache.org/repos/asf/kafka.git
> git --version # timeout=10
> git -c core.askpass=true fetch --tags --progress https://git-wip-us.apache.org/repos/asf/kafka.git +refs/heads/*:refs/remotes/origin/*
> git rev-parse refs/remotes/origin/trunk^{commit} # timeout=10
> git rev-parse refs/remotes/origin/origin/trunk^{commit} # timeout=10
Checking out Revision 7a877895a1c8494d48bf2c18e2f74fb913ed036a (refs/remotes/origin/trunk)
> git config core.sparsecheckout # timeout=10
> git checkout -f 7a877895a1c8494d48bf2c18e2f74fb913ed036a
> git rev-list 7a877895a1c8494d48bf2c18e2f74fb913ed036a # timeout=10
FATAL: Unable to produce a script file
java.io.IOException: Failed to create a temp file on <https://builds.apache.org/job/kafka-trunk-jdk8/ws/>
at hudson.FilePath.createTextTempFile(FilePath.java:1410)
at hudson.tasks.CommandInterpreter.createScriptFile(CommandInterpreter.java:142)
at hudson.tasks.CommandInterpreter.perform(CommandInterpreter.java:80)
at hudson.tasks.CommandInterpreter.perform(CommandInterpreter.java:64)
at hudson.tasks.BuildStepMonitor$1.perform(BuildStepMonitor.java:20)
at hudson.model.AbstractBuild$AbstractBuildExecution.perform(AbstractBuild.java:779)
at hudson.model.Build$BuildExecution.build(Build.java:205)
at hudson.model.Build$BuildExecution.doRun(Build.java:162)
at hudson.model.AbstractBuild$AbstractBuildExecution.run(AbstractBuild.java:534)
at hudson.model.Run.execute(Run.java:1741)
at hudson.model.FreeStyleBuild.run(FreeStyleBuild.java:43)
at hudson.model.ResourceController.execute(ResourceController.java:98)
at hudson.model.Executor.run(Executor.java:410)
Caused by: java.io.IOException: remote file operation failed: <https://builds.apache.org/job/kafka-trunk-jdk8/ws/> at hudson.remoting.Channel@2cc3b3b:ubuntu-us1: java.io.IOException: No space left on device
at hudson.FilePath.act(FilePath.java:1014)
at hudson.FilePath.act(FilePath.java:996)
at hudson.FilePath.createTextTempFile(FilePath.java:1384)
... 12 more
Caused by: java.io.IOException: No space left on device
at java.io.FileOutputStream.writeBytes(Native Method)
at java.io.FileOutputStream.write(FileOutputStream.java:345)
at sun.nio.cs.StreamEncoder.writeBytes(StreamEncoder.java:221)
at sun.nio.cs.StreamEncoder.implClose(StreamEncoder.java:316)
at sun.nio.cs.StreamEncoder.close(StreamEncoder.java:149)
at java.io.OutputStreamWriter.close(OutputStreamWriter.java:233)
at hudson.FilePath$17.invoke(FilePath.java:1403)
at hudson.FilePath$17.invoke(FilePath.java:1384)
at hudson.FilePath$FileCallableWrapper.call(FilePath.java:2772)
at hudson.remoting.UserRequest.perform(UserRequest.java:153)
at hudson.remoting.UserRequest.perform(UserRequest.java:50)
at hudson.remoting.Request$2.run(Request.java:332)
at hudson.remoting.InterceptingExecutorService$1.call(InterceptingExecutorService.java:68)
at java.util.concurrent.FutureTask.run(FutureTask.java:262)
at java.util.concurrent.ThreadPoolExecutor.runWorker(ThreadPoolExecutor.java:1145)
at java.util.concurrent.ThreadPoolExecutor$Worker.run(ThreadPoolExecutor.java:615)
at java.lang.Thread.run(Thread.java:745)
at ......remote call to ubuntu-us1(Native Method)
at hudson.remoting.Channel.attachCallSiteStackTrace(Channel.java:1416)
at hudson.remoting.UserResponse.retrieve(UserRequest.java:253)
at hudson.remoting.Channel.call(Channel.java:781)
at hudson.FilePath.act(FilePath.java:1007)
... 14 more
Build step 'Execute shell' marked build as failure
Recording test results
Setting GRADLE_2_4_RC_2_HOME=/home/jenkins/jenkins-slave/tools/hudson.plugins.gradle.GradleInstallation/Gradle_2.4-rc-2
ERROR: Step ‘Publish JUnit test result report’ failed: Test reports were found but none of them are new. Did tests run?
For example, <https://builds.apache.org/job/kafka-trunk-jdk8/ws/core/build/test-results/TEST-integration.kafka.api.GroupCoordinatorIntegrationTest.xml> is 1 day 20 hr old
Setting GRADLE_2_4_RC_2_HOME=/home/jenkins/jenkins-slave/tools/hudson.plugins.gradle.GradleInstallation/Gradle_2.4-rc-2
Build failed in Jenkins: kafka-trunk-jdk8 #836
Posted by Apache Jenkins Server <je...@builds.apache.org>.
See <https://builds.apache.org/job/kafka-trunk-jdk8/836/changes>
Changes:
[ismael] KAFKA-3937; Kafka Clients Leak Native Memory For Longer Than Needed With
[ismael] KAFKA-4082; Upgrade to Gradle 3.0
------------------------------------------
Started by an SCM change
[EnvInject] - Loading node environment variables.
Building remotely on ubuntu-us1 (Ubuntu golang-ppa ubuntu-us ubuntu) in workspace <https://builds.apache.org/job/kafka-trunk-jdk8/ws/>
> git rev-parse --is-inside-work-tree # timeout=10
Fetching changes from the remote Git repository
> git config remote.origin.url https://git-wip-us.apache.org/repos/asf/kafka.git # timeout=10
Fetching upstream changes from https://git-wip-us.apache.org/repos/asf/kafka.git
> git --version # timeout=10
> git -c core.askpass=true fetch --tags --progress https://git-wip-us.apache.org/repos/asf/kafka.git +refs/heads/*:refs/remotes/origin/*
> git rev-parse refs/remotes/origin/trunk^{commit} # timeout=10
> git rev-parse refs/remotes/origin/origin/trunk^{commit} # timeout=10
Checking out Revision 7a877895a1c8494d48bf2c18e2f74fb913ed036a (refs/remotes/origin/trunk)
> git config core.sparsecheckout # timeout=10
> git checkout -f 7a877895a1c8494d48bf2c18e2f74fb913ed036a
> git rev-list cec2769e2281ac731e8cfd12b5d8e34e0ebe38cd # timeout=10
FATAL: Unable to produce a script file
java.io.IOException: Failed to create a temp file on <https://builds.apache.org/job/kafka-trunk-jdk8/ws/>
at hudson.FilePath.createTextTempFile(FilePath.java:1410)
at hudson.tasks.CommandInterpreter.createScriptFile(CommandInterpreter.java:142)
at hudson.tasks.CommandInterpreter.perform(CommandInterpreter.java:80)
at hudson.tasks.CommandInterpreter.perform(CommandInterpreter.java:64)
at hudson.tasks.BuildStepMonitor$1.perform(BuildStepMonitor.java:20)
at hudson.model.AbstractBuild$AbstractBuildExecution.perform(AbstractBuild.java:779)
at hudson.model.Build$BuildExecution.build(Build.java:205)
at hudson.model.Build$BuildExecution.doRun(Build.java:162)
at hudson.model.AbstractBuild$AbstractBuildExecution.run(AbstractBuild.java:534)
at hudson.model.Run.execute(Run.java:1741)
at hudson.model.FreeStyleBuild.run(FreeStyleBuild.java:43)
at hudson.model.ResourceController.execute(ResourceController.java:98)
at hudson.model.Executor.run(Executor.java:410)
Caused by: java.io.IOException: remote file operation failed: <https://builds.apache.org/job/kafka-trunk-jdk8/ws/> at hudson.remoting.Channel@2cc3b3b:ubuntu-us1: java.io.IOException: No space left on device
at hudson.FilePath.act(FilePath.java:1014)
at hudson.FilePath.act(FilePath.java:996)
at hudson.FilePath.createTextTempFile(FilePath.java:1384)
... 12 more
Caused by: java.io.IOException: No space left on device
at java.io.FileOutputStream.writeBytes(Native Method)
at java.io.FileOutputStream.write(FileOutputStream.java:345)
at sun.nio.cs.StreamEncoder.writeBytes(StreamEncoder.java:221)
at sun.nio.cs.StreamEncoder.implClose(StreamEncoder.java:316)
at sun.nio.cs.StreamEncoder.close(StreamEncoder.java:149)
at java.io.OutputStreamWriter.close(OutputStreamWriter.java:233)
at hudson.FilePath$17.invoke(FilePath.java:1403)
at hudson.FilePath$17.invoke(FilePath.java:1384)
at hudson.FilePath$FileCallableWrapper.call(FilePath.java:2772)
at hudson.remoting.UserRequest.perform(UserRequest.java:153)
at hudson.remoting.UserRequest.perform(UserRequest.java:50)
at hudson.remoting.Request$2.run(Request.java:332)
at hudson.remoting.InterceptingExecutorService$1.call(InterceptingExecutorService.java:68)
at java.util.concurrent.FutureTask.run(FutureTask.java:262)
at java.util.concurrent.ThreadPoolExecutor.runWorker(ThreadPoolExecutor.java:1145)
at java.util.concurrent.ThreadPoolExecutor$Worker.run(ThreadPoolExecutor.java:615)
at java.lang.Thread.run(Thread.java:745)
at ......remote call to ubuntu-us1(Native Method)
at hudson.remoting.Channel.attachCallSiteStackTrace(Channel.java:1416)
at hudson.remoting.UserResponse.retrieve(UserRequest.java:253)
at hudson.remoting.Channel.call(Channel.java:781)
at hudson.FilePath.act(FilePath.java:1007)
... 14 more
Build step 'Execute shell' marked build as failure
Recording test results
Setting GRADLE_2_4_RC_2_HOME=/home/jenkins/jenkins-slave/tools/hudson.plugins.gradle.GradleInstallation/Gradle_2.4-rc-2
ERROR: Step ‘Publish JUnit test result report’ failed: Test reports were found but none of them are new. Did tests run?
For example, <https://builds.apache.org/job/kafka-trunk-jdk8/ws/core/build/test-results/TEST-integration.kafka.api.GroupCoordinatorIntegrationTest.xml> is 23 hr old
Setting GRADLE_2_4_RC_2_HOME=/home/jenkins/jenkins-slave/tools/hudson.plugins.gradle.GradleInstallation/Gradle_2.4-rc-2
Build failed in Jenkins: kafka-trunk-jdk8 #835
Posted by Apache Jenkins Server <je...@builds.apache.org>.
See <https://builds.apache.org/job/kafka-trunk-jdk8/835/changes>
Changes:
[me] KAFKA-2894: WorkerSinkTask should rewind offsets on rebalance
------------------------------------------
[...truncated 12131 lines...]
org.apache.kafka.streams.processor.internals.RecordQueueTest > testTimeTracking PASSED
org.apache.kafka.streams.processor.internals.StreamTaskTest > testProcessOrder STARTED
org.apache.kafka.streams.processor.internals.StreamTaskTest > testProcessOrder PASSED
org.apache.kafka.streams.processor.internals.StreamTaskTest > testPauseResume STARTED
org.apache.kafka.streams.processor.internals.StreamTaskTest > testPauseResume PASSED
org.apache.kafka.streams.processor.internals.StreamTaskTest > testMaybePunctuate STARTED
org.apache.kafka.streams.processor.internals.StreamTaskTest > testMaybePunctuate PASSED
org.apache.kafka.streams.processor.internals.StreamThreadTest > testInjectClients STARTED
org.apache.kafka.streams.processor.internals.StreamThreadTest > testInjectClients PASSED
org.apache.kafka.streams.processor.internals.StreamThreadTest > testMaybeCommit STARTED
org.apache.kafka.streams.processor.internals.StreamThreadTest > testMaybeCommit PASSED
org.apache.kafka.streams.processor.internals.StreamThreadTest > testPartitionAssignmentChange STARTED
org.apache.kafka.streams.processor.internals.StreamThreadTest > testPartitionAssignmentChange PASSED
org.apache.kafka.streams.processor.internals.StreamThreadTest > testMaybeClean STARTED
org.apache.kafka.streams.processor.internals.StreamThreadTest > testMaybeClean PASSED
org.apache.kafka.streams.processor.internals.MinTimestampTrackerTest > testTracking STARTED
org.apache.kafka.streams.processor.internals.MinTimestampTrackerTest > testTracking PASSED
org.apache.kafka.streams.processor.internals.StreamPartitionAssignorTest > shouldThrowExceptionIfApplicationServerConfigIsNotHostPortPair STARTED
org.apache.kafka.streams.processor.internals.StreamPartitionAssignorTest > shouldThrowExceptionIfApplicationServerConfigIsNotHostPortPair PASSED
org.apache.kafka.streams.processor.internals.StreamPartitionAssignorTest > shouldMapUserEndPointToTopicPartitions STARTED
org.apache.kafka.streams.processor.internals.StreamPartitionAssignorTest > shouldMapUserEndPointToTopicPartitions PASSED
org.apache.kafka.streams.processor.internals.StreamPartitionAssignorTest > shouldAddUserDefinedEndPointToSubscription STARTED
org.apache.kafka.streams.processor.internals.StreamPartitionAssignorTest > shouldAddUserDefinedEndPointToSubscription PASSED
org.apache.kafka.streams.processor.internals.StreamPartitionAssignorTest > testAssignWithStandbyReplicas STARTED
org.apache.kafka.streams.processor.internals.StreamPartitionAssignorTest > testAssignWithStandbyReplicas PASSED
org.apache.kafka.streams.processor.internals.StreamPartitionAssignorTest > testAssignWithNewTasks STARTED
org.apache.kafka.streams.processor.internals.StreamPartitionAssignorTest > testAssignWithNewTasks PASSED
org.apache.kafka.streams.processor.internals.StreamPartitionAssignorTest > shouldExposeHostStateToTopicPartitionsOnAssignment STARTED
org.apache.kafka.streams.processor.internals.StreamPartitionAssignorTest > shouldExposeHostStateToTopicPartitionsOnAssignment PASSED
org.apache.kafka.streams.processor.internals.StreamPartitionAssignorTest > testAssignWithStates STARTED
org.apache.kafka.streams.processor.internals.StreamPartitionAssignorTest > testAssignWithStates PASSED
org.apache.kafka.streams.processor.internals.StreamPartitionAssignorTest > shouldThrowExceptionIfApplicationServerConfigPortIsNotAnInteger STARTED
org.apache.kafka.streams.processor.internals.StreamPartitionAssignorTest > shouldThrowExceptionIfApplicationServerConfigPortIsNotAnInteger PASSED
org.apache.kafka.streams.processor.internals.StreamPartitionAssignorTest > testAssignBasic STARTED
org.apache.kafka.streams.processor.internals.StreamPartitionAssignorTest > testAssignBasic PASSED
org.apache.kafka.streams.processor.internals.StreamPartitionAssignorTest > testOnAssignment STARTED
org.apache.kafka.streams.processor.internals.StreamPartitionAssignorTest > testOnAssignment PASSED
org.apache.kafka.streams.processor.internals.StreamPartitionAssignorTest > testAssignWithInternalTopicThatsSourceIsAnotherInternalTopic STARTED
org.apache.kafka.streams.processor.internals.StreamPartitionAssignorTest > testAssignWithInternalTopicThatsSourceIsAnotherInternalTopic PASSED
org.apache.kafka.streams.processor.internals.StreamPartitionAssignorTest > testSubscription STARTED
org.apache.kafka.streams.processor.internals.StreamPartitionAssignorTest > testSubscription PASSED
org.apache.kafka.streams.processor.internals.StreamPartitionAssignorTest > testAssignWithInternalTopics STARTED
org.apache.kafka.streams.processor.internals.StreamPartitionAssignorTest > testAssignWithInternalTopics PASSED
org.apache.kafka.streams.processor.TopologyBuilderTest > shouldNotAllowNullProcessorSupplier STARTED
org.apache.kafka.streams.processor.TopologyBuilderTest > shouldNotAllowNullProcessorSupplier PASSED
org.apache.kafka.streams.processor.TopologyBuilderTest > shouldNotSetApplicationIdToNull STARTED
org.apache.kafka.streams.processor.TopologyBuilderTest > shouldNotSetApplicationIdToNull PASSED
org.apache.kafka.streams.processor.TopologyBuilderTest > testSourceTopics STARTED
org.apache.kafka.streams.processor.TopologyBuilderTest > testSourceTopics PASSED
org.apache.kafka.streams.processor.TopologyBuilderTest > shouldNotAllowNullNameWhenAddingSink STARTED
org.apache.kafka.streams.processor.TopologyBuilderTest > shouldNotAllowNullNameWhenAddingSink PASSED
org.apache.kafka.streams.processor.TopologyBuilderTest > testNamedTopicMatchesAlreadyProvidedPattern STARTED
org.apache.kafka.streams.processor.TopologyBuilderTest > testNamedTopicMatchesAlreadyProvidedPattern PASSED
org.apache.kafka.streams.processor.TopologyBuilderTest > testAddSinkWithSameName STARTED
org.apache.kafka.streams.processor.TopologyBuilderTest > testAddSinkWithSameName PASSED
org.apache.kafka.streams.processor.TopologyBuilderTest > testAddSinkWithSelfParent STARTED
org.apache.kafka.streams.processor.TopologyBuilderTest > testAddSinkWithSelfParent PASSED
org.apache.kafka.streams.processor.TopologyBuilderTest > testAddProcessorWithSelfParent STARTED
org.apache.kafka.streams.processor.TopologyBuilderTest > testAddProcessorWithSelfParent PASSED
org.apache.kafka.streams.processor.TopologyBuilderTest > shouldAssociateStateStoreNameWhenStateStoreSupplierIsInternal STARTED
org.apache.kafka.streams.processor.TopologyBuilderTest > shouldAssociateStateStoreNameWhenStateStoreSupplierIsInternal PASSED
org.apache.kafka.streams.processor.TopologyBuilderTest > testAddStateStoreWithSink STARTED
org.apache.kafka.streams.processor.TopologyBuilderTest > testAddStateStoreWithSink PASSED
org.apache.kafka.streams.processor.TopologyBuilderTest > testTopicGroups STARTED
org.apache.kafka.streams.processor.TopologyBuilderTest > testTopicGroups PASSED
org.apache.kafka.streams.processor.TopologyBuilderTest > testBuild STARTED
org.apache.kafka.streams.processor.TopologyBuilderTest > testBuild PASSED
org.apache.kafka.streams.processor.TopologyBuilderTest > shouldNotAddNullStateStoreSupplier STARTED
org.apache.kafka.streams.processor.TopologyBuilderTest > shouldNotAddNullStateStoreSupplier PASSED
org.apache.kafka.streams.processor.TopologyBuilderTest > shouldNotAllowNullNameWhenAddingSource STARTED
org.apache.kafka.streams.processor.TopologyBuilderTest > shouldNotAllowNullNameWhenAddingSource PASSED
org.apache.kafka.streams.processor.TopologyBuilderTest > shouldNotAllowNullTopicWhenAddingSink STARTED
org.apache.kafka.streams.processor.TopologyBuilderTest > shouldNotAllowNullTopicWhenAddingSink PASSED
org.apache.kafka.streams.processor.TopologyBuilderTest > testAddStateStoreWithSource STARTED
org.apache.kafka.streams.processor.TopologyBuilderTest > testAddStateStoreWithSource PASSED
org.apache.kafka.streams.processor.TopologyBuilderTest > shouldNotAllowNullProcessorNameWhenConnectingProcessorAndStateStores STARTED
org.apache.kafka.streams.processor.TopologyBuilderTest > shouldNotAllowNullProcessorNameWhenConnectingProcessorAndStateStores PASSED
org.apache.kafka.streams.processor.TopologyBuilderTest > testAddSourceWithSameName STARTED
org.apache.kafka.streams.processor.TopologyBuilderTest > testAddSourceWithSameName PASSED
org.apache.kafka.streams.processor.TopologyBuilderTest > testAddMoreThanOnePatternSourceNode STARTED
org.apache.kafka.streams.processor.TopologyBuilderTest > testAddMoreThanOnePatternSourceNode PASSED
org.apache.kafka.streams.processor.TopologyBuilderTest > testAddProcessorWithSameName STARTED
org.apache.kafka.streams.processor.TopologyBuilderTest > testAddProcessorWithSameName PASSED
org.apache.kafka.streams.processor.TopologyBuilderTest > testAddSourceWithSameTopic STARTED
org.apache.kafka.streams.processor.TopologyBuilderTest > testAddSourceWithSameTopic PASSED
org.apache.kafka.streams.processor.TopologyBuilderTest > testTopicGroupsByStateStore STARTED
org.apache.kafka.streams.processor.TopologyBuilderTest > testTopicGroupsByStateStore PASSED
org.apache.kafka.streams.processor.TopologyBuilderTest > testAddStateStoreWithDuplicates STARTED
org.apache.kafka.streams.processor.TopologyBuilderTest > testAddStateStoreWithDuplicates PASSED
org.apache.kafka.streams.processor.TopologyBuilderTest > testPatternSourceTopic STARTED
org.apache.kafka.streams.processor.TopologyBuilderTest > testPatternSourceTopic PASSED
org.apache.kafka.streams.processor.TopologyBuilderTest > shouldAssociateStateStoreNameWhenStateStoreSupplierIsExternal STARTED
org.apache.kafka.streams.processor.TopologyBuilderTest > shouldAssociateStateStoreNameWhenStateStoreSupplierIsExternal PASSED
org.apache.kafka.streams.processor.TopologyBuilderTest > testAddSinkWithWrongParent STARTED
org.apache.kafka.streams.processor.TopologyBuilderTest > testAddSinkWithWrongParent PASSED
org.apache.kafka.streams.processor.TopologyBuilderTest > testPatternMatchesAlreadyProvidedTopicSource STARTED
org.apache.kafka.streams.processor.TopologyBuilderTest > testPatternMatchesAlreadyProvidedTopicSource PASSED
org.apache.kafka.streams.processor.TopologyBuilderTest > testAddSinkConnectedWithMultipleParent STARTED
org.apache.kafka.streams.processor.TopologyBuilderTest > testAddSinkConnectedWithMultipleParent PASSED
org.apache.kafka.streams.processor.TopologyBuilderTest > testSubscribeTopicNameAndPattern STARTED
org.apache.kafka.streams.processor.TopologyBuilderTest > testSubscribeTopicNameAndPattern PASSED
org.apache.kafka.streams.processor.TopologyBuilderTest > shouldNotAddNullInternalTopic STARTED
org.apache.kafka.streams.processor.TopologyBuilderTest > shouldNotAddNullInternalTopic PASSED
org.apache.kafka.streams.processor.TopologyBuilderTest > testAddProcessorWithWrongParent STARTED
org.apache.kafka.streams.processor.TopologyBuilderTest > testAddProcessorWithWrongParent PASSED
org.apache.kafka.streams.processor.TopologyBuilderTest > shouldNotAllowNullNameWhenAddingProcessor STARTED
org.apache.kafka.streams.processor.TopologyBuilderTest > shouldNotAllowNullNameWhenAddingProcessor PASSED
org.apache.kafka.streams.processor.TopologyBuilderTest > testAddStateStore STARTED
org.apache.kafka.streams.processor.TopologyBuilderTest > testAddStateStore PASSED
org.apache.kafka.streams.processor.TopologyBuilderTest > testAddSinkConnectedWithParent STARTED
org.apache.kafka.streams.processor.TopologyBuilderTest > testAddSinkConnectedWithParent PASSED
org.apache.kafka.streams.processor.TopologyBuilderTest > testAddStateStoreWithNonExistingProcessor STARTED
org.apache.kafka.streams.processor.TopologyBuilderTest > testAddStateStoreWithNonExistingProcessor PASSED
org.apache.kafka.streams.processor.TopologyBuilderTest > shouldCorrectlyMapStateStoreToInternalTopics STARTED
org.apache.kafka.streams.processor.TopologyBuilderTest > shouldCorrectlyMapStateStoreToInternalTopics PASSED
353 tests completed, 1 failed
:streams:test FAILED
FAILURE: Build failed with an exception.
* What went wrong:
Execution failed for task ':streams:test'.
> There were failing tests. See the report at: file://<https://builds.apache.org/job/kafka-trunk-jdk8/ws/streams/build/reports/tests/index.html>
* Try:
Run with --stacktrace option to get the stack trace. Run with --info or --debug option to get more log output.
BUILD FAILED
Total time: 1 hrs 8 mins 1.182 secs
Build step 'Execute shell' marked build as failure
Recording test results
Setting GRADLE_2_4_RC_2_HOME=/home/jenkins/jenkins-slave/tools/hudson.plugins.gradle.GradleInstallation/Gradle_2.4-rc-2
Setting GRADLE_2_4_RC_2_HOME=/home/jenkins/jenkins-slave/tools/hudson.plugins.gradle.GradleInstallation/Gradle_2.4-rc-2
Build failed in Jenkins: kafka-trunk-jdk8 #834
Posted by Apache Jenkins Server <je...@builds.apache.org>.
See <https://builds.apache.org/job/kafka-trunk-jdk8/834/changes>
Changes:
[ismael] KAFKA-3680; Enable Kafka clients to run in any classloader env
------------------------------------------
Started by an SCM change
[EnvInject] - Loading node environment variables.
Building remotely on ubuntu-us1 (Ubuntu golang-ppa ubuntu-us ubuntu) in workspace <https://builds.apache.org/job/kafka-trunk-jdk8/ws/>
> git rev-parse --is-inside-work-tree # timeout=10
Fetching changes from the remote Git repository
> git config remote.origin.url https://git-wip-us.apache.org/repos/asf/kafka.git # timeout=10
Fetching upstream changes from https://git-wip-us.apache.org/repos/asf/kafka.git
> git --version # timeout=10
> git -c core.askpass=true fetch --tags --progress https://git-wip-us.apache.org/repos/asf/kafka.git +refs/heads/*:refs/remotes/origin/*
> git rev-parse refs/remotes/origin/trunk^{commit} # timeout=10
> git rev-parse refs/remotes/origin/origin/trunk^{commit} # timeout=10
Checking out Revision 313aad423cb19618b8693af6f04b68138059c585 (refs/remotes/origin/trunk)
> git config core.sparsecheckout # timeout=10
> git checkout -f 313aad423cb19618b8693af6f04b68138059c585
> git rev-list a1e0b2240dba0740135621d959441eefa6fd3124 # timeout=10
FATAL: Unable to produce a script file
java.io.IOException: Failed to create a temp file on <https://builds.apache.org/job/kafka-trunk-jdk8/ws/>
at hudson.FilePath.createTextTempFile(FilePath.java:1410)
at hudson.tasks.CommandInterpreter.createScriptFile(CommandInterpreter.java:142)
at hudson.tasks.CommandInterpreter.perform(CommandInterpreter.java:80)
at hudson.tasks.CommandInterpreter.perform(CommandInterpreter.java:64)
at hudson.tasks.BuildStepMonitor$1.perform(BuildStepMonitor.java:20)
at hudson.model.AbstractBuild$AbstractBuildExecution.perform(AbstractBuild.java:779)
at hudson.model.Build$BuildExecution.build(Build.java:205)
at hudson.model.Build$BuildExecution.doRun(Build.java:162)
at hudson.model.AbstractBuild$AbstractBuildExecution.run(AbstractBuild.java:534)
at hudson.model.Run.execute(Run.java:1741)
at hudson.model.FreeStyleBuild.run(FreeStyleBuild.java:43)
at hudson.model.ResourceController.execute(ResourceController.java:98)
at hudson.model.Executor.run(Executor.java:410)
Caused by: java.io.IOException: remote file operation failed: <https://builds.apache.org/job/kafka-trunk-jdk8/ws/> at hudson.remoting.Channel@2cc3b3b:ubuntu-us1: java.io.IOException: No space left on device
at hudson.FilePath.act(FilePath.java:1014)
at hudson.FilePath.act(FilePath.java:996)
at hudson.FilePath.createTextTempFile(FilePath.java:1384)
... 12 more
Caused by: java.io.IOException: No space left on device
at java.io.FileOutputStream.writeBytes(Native Method)
at java.io.FileOutputStream.write(FileOutputStream.java:345)
at sun.nio.cs.StreamEncoder.writeBytes(StreamEncoder.java:221)
at sun.nio.cs.StreamEncoder.implClose(StreamEncoder.java:316)
at sun.nio.cs.StreamEncoder.close(StreamEncoder.java:149)
at java.io.OutputStreamWriter.close(OutputStreamWriter.java:233)
at hudson.FilePath$17.invoke(FilePath.java:1403)
at hudson.FilePath$17.invoke(FilePath.java:1384)
at hudson.FilePath$FileCallableWrapper.call(FilePath.java:2772)
at hudson.remoting.UserRequest.perform(UserRequest.java:153)
at hudson.remoting.UserRequest.perform(UserRequest.java:50)
at hudson.remoting.Request$2.run(Request.java:332)
at hudson.remoting.InterceptingExecutorService$1.call(InterceptingExecutorService.java:68)
at java.util.concurrent.FutureTask.run(FutureTask.java:262)
at java.util.concurrent.ThreadPoolExecutor.runWorker(ThreadPoolExecutor.java:1145)
at java.util.concurrent.ThreadPoolExecutor$Worker.run(ThreadPoolExecutor.java:615)
at java.lang.Thread.run(Thread.java:745)
at ......remote call to ubuntu-us1(Native Method)
at hudson.remoting.Channel.attachCallSiteStackTrace(Channel.java:1416)
at hudson.remoting.UserResponse.retrieve(UserRequest.java:253)
at hudson.remoting.Channel.call(Channel.java:781)
at hudson.FilePath.act(FilePath.java:1007)
... 14 more
Build step 'Execute shell' marked build as failure
Recording test results
Setting GRADLE_2_4_RC_2_HOME=/home/jenkins/jenkins-slave/tools/hudson.plugins.gradle.GradleInstallation/Gradle_2.4-rc-2
ERROR: Step ‘Publish JUnit test result report’ failed: Test reports were found but none of them are new. Did tests run?
For example, <https://builds.apache.org/job/kafka-trunk-jdk8/ws/core/build/test-results/TEST-integration.kafka.api.GroupCoordinatorIntegrationTest.xml> is 12 hr old
Setting GRADLE_2_4_RC_2_HOME=/home/jenkins/jenkins-slave/tools/hudson.plugins.gradle.GradleInstallation/Gradle_2.4-rc-2
Build failed in Jenkins: kafka-trunk-jdk8 #833
Posted by Apache Jenkins Server <je...@builds.apache.org>.
See <https://builds.apache.org/job/kafka-trunk-jdk8/833/changes>
Changes:
[me] MINOR: Refactor TopologyBuilder with ApplicationID Prefix
[junrao] KAFKA-4073; MirrorMaker should handle messages without timestamp
------------------------------------------
[...truncated 7105 lines...]
kafka.log.LogTest > testIndexRebuild STARTED
kafka.log.LogTest > testIndexRebuild PASSED
kafka.log.LogTest > testLogRolls STARTED
kafka.log.LogTest > testLogRolls PASSED
kafka.log.LogTest > testMessageSizeCheck STARTED
kafka.log.LogTest > testMessageSizeCheck PASSED
kafka.log.LogTest > testAsyncDelete STARTED
kafka.log.LogTest > testAsyncDelete PASSED
kafka.log.LogTest > testReadOutOfRange STARTED
kafka.log.LogTest > testReadOutOfRange PASSED
kafka.log.LogTest > testAppendWithOutOfOrderOffsetsThrowsException STARTED
kafka.log.LogTest > testAppendWithOutOfOrderOffsetsThrowsException PASSED
kafka.log.LogTest > testReadAtLogGap STARTED
kafka.log.LogTest > testReadAtLogGap PASSED
kafka.log.LogTest > testTimeBasedLogRoll STARTED
kafka.log.LogTest > testTimeBasedLogRoll PASSED
kafka.log.LogTest > testLoadEmptyLog STARTED
kafka.log.LogTest > testLoadEmptyLog PASSED
kafka.log.LogTest > testMessageSetSizeCheck STARTED
kafka.log.LogTest > testMessageSetSizeCheck PASSED
kafka.log.LogTest > testIndexResizingAtTruncation STARTED
kafka.log.LogTest > testIndexResizingAtTruncation PASSED
kafka.log.LogTest > testCompactedTopicConstraints STARTED
kafka.log.LogTest > testCompactedTopicConstraints PASSED
kafka.log.LogTest > testThatGarbageCollectingSegmentsDoesntChangeOffset STARTED
kafka.log.LogTest > testThatGarbageCollectingSegmentsDoesntChangeOffset PASSED
kafka.log.LogTest > testAppendAndReadWithSequentialOffsets STARTED
kafka.log.LogTest > testAppendAndReadWithSequentialOffsets PASSED
kafka.log.LogTest > testDeleteOldSegmentsMethod STARTED
kafka.log.LogTest > testDeleteOldSegmentsMethod PASSED
kafka.log.LogTest > testParseTopicPartitionNameForNull STARTED
kafka.log.LogTest > testParseTopicPartitionNameForNull PASSED
kafka.log.LogTest > testAppendAndReadWithNonSequentialOffsets STARTED
kafka.log.LogTest > testAppendAndReadWithNonSequentialOffsets PASSED
kafka.log.LogTest > testParseTopicPartitionNameForMissingSeparator STARTED
kafka.log.LogTest > testParseTopicPartitionNameForMissingSeparator PASSED
kafka.log.LogTest > testCorruptIndexRebuild STARTED
kafka.log.LogTest > testCorruptIndexRebuild PASSED
kafka.log.LogTest > testBogusIndexSegmentsAreRemoved STARTED
kafka.log.LogTest > testBogusIndexSegmentsAreRemoved PASSED
kafka.log.LogTest > testCompressedMessages STARTED
kafka.log.LogTest > testCompressedMessages PASSED
kafka.log.LogTest > testAppendMessageWithNullPayload STARTED
kafka.log.LogTest > testAppendMessageWithNullPayload PASSED
kafka.log.LogTest > testCorruptLog STARTED
kafka.log.LogTest > testCorruptLog PASSED
kafka.log.LogTest > testLogRecoversToCorrectOffset STARTED
kafka.log.LogTest > testLogRecoversToCorrectOffset PASSED
kafka.log.LogTest > testReopenThenTruncate STARTED
kafka.log.LogTest > testReopenThenTruncate PASSED
kafka.log.LogTest > testParseTopicPartitionNameForMissingPartition STARTED
kafka.log.LogTest > testParseTopicPartitionNameForMissingPartition PASSED
kafka.log.LogTest > testParseTopicPartitionNameForEmptyName STARTED
kafka.log.LogTest > testParseTopicPartitionNameForEmptyName PASSED
kafka.log.LogTest > testOpenDeletesObsoleteFiles STARTED
kafka.log.LogTest > testOpenDeletesObsoleteFiles PASSED
kafka.log.LogTest > testRebuildTimeIndexForOldMessages STARTED
kafka.log.LogTest > testRebuildTimeIndexForOldMessages PASSED
kafka.log.LogTest > testSizeBasedLogRoll STARTED
kafka.log.LogTest > testSizeBasedLogRoll PASSED
kafka.log.LogTest > testTimeBasedLogRollJitter STARTED
kafka.log.LogTest > testTimeBasedLogRollJitter PASSED
kafka.log.LogTest > testParseTopicPartitionName STARTED
kafka.log.LogTest > testParseTopicPartitionName PASSED
kafka.log.LogTest > testTruncateTo STARTED
kafka.log.LogTest > testTruncateTo PASSED
kafka.log.LogTest > testCleanShutdownFile STARTED
kafka.log.LogTest > testCleanShutdownFile PASSED
kafka.log.LogTest > testBuildTimeIndexWhenNotAssigningOffsets STARTED
kafka.log.LogTest > testBuildTimeIndexWhenNotAssigningOffsets PASSED
kafka.log.LogConfigTest > testFromPropsEmpty STARTED
kafka.log.LogConfigTest > testFromPropsEmpty PASSED
kafka.log.LogConfigTest > testKafkaConfigToProps STARTED
kafka.log.LogConfigTest > testKafkaConfigToProps PASSED
kafka.log.LogConfigTest > testFromPropsInvalid STARTED
kafka.log.LogConfigTest > testFromPropsInvalid PASSED
kafka.log.CleanerTest > testBuildOffsetMap STARTED
kafka.log.CleanerTest > testBuildOffsetMap PASSED
kafka.log.CleanerTest > testBuildOffsetMapFakeLarge STARTED
kafka.log.CleanerTest > testBuildOffsetMapFakeLarge PASSED
kafka.log.CleanerTest > testSegmentGrouping STARTED
kafka.log.CleanerTest > testSegmentGrouping PASSED
kafka.log.CleanerTest > testCleanSegmentsWithAbort STARTED
kafka.log.CleanerTest > testCleanSegmentsWithAbort PASSED
kafka.log.CleanerTest > testSegmentGroupingWithSparseOffsets STARTED
kafka.log.CleanerTest > testSegmentGroupingWithSparseOffsets PASSED
kafka.log.CleanerTest > testRecoveryAfterCrash STARTED
kafka.log.CleanerTest > testRecoveryAfterCrash PASSED
kafka.log.CleanerTest > testLogToClean STARTED
kafka.log.CleanerTest > testLogToClean PASSED
kafka.log.CleanerTest > testCleaningWithDeletes STARTED
kafka.log.CleanerTest > testCleaningWithDeletes PASSED
kafka.log.CleanerTest > testCleanSegments STARTED
kafka.log.CleanerTest > testCleanSegments PASSED
kafka.log.CleanerTest > testBuildPartialOffsetMap STARTED
kafka.log.CleanerTest > testBuildPartialOffsetMap PASSED
kafka.log.CleanerTest > testCleaningWithUnkeyedMessages STARTED
kafka.log.CleanerTest > testCleaningWithUnkeyedMessages PASSED
kafka.log.CleanerTest > testPartialSegmentClean STARTED
kafka.log.CleanerTest > testPartialSegmentClean PASSED
kafka.log.OffsetIndexTest > lookupExtremeCases STARTED
kafka.log.OffsetIndexTest > lookupExtremeCases PASSED
kafka.log.OffsetIndexTest > appendTooMany STARTED
kafka.log.OffsetIndexTest > appendTooMany PASSED
kafka.log.OffsetIndexTest > randomLookupTest STARTED
kafka.log.OffsetIndexTest > randomLookupTest PASSED
kafka.log.OffsetIndexTest > testReopen STARTED
kafka.log.OffsetIndexTest > testReopen PASSED
kafka.log.OffsetIndexTest > appendOutOfOrder STARTED
kafka.log.OffsetIndexTest > appendOutOfOrder PASSED
kafka.log.OffsetIndexTest > truncate STARTED
kafka.log.OffsetIndexTest > truncate PASSED
:test_core_2_11 FAILED
FAILURE: Build failed with an exception.
* What went wrong:
Execution failed for task ':test_core_2_11'.
> Process 'Gradle Compiler Daemon 1' finished with non-zero exit value 137
* Try:
Run with --stacktrace option to get the stack trace. Run with --info or --debug option to get more log output.
BUILD FAILED
Total time: 58 mins 58.334 secs
FAILURE: Build failed with an exception.
* What went wrong:
Process 'Gradle Compiler Daemon 1' finished with non-zero exit value 137
* Try:
Run with --stacktrace option to get the stack trace. Run with --info or --debug option to get more log output.
Build step 'Execute shell' marked build as failure
Recording test results
Setting GRADLE_2_4_RC_2_HOME=/home/jenkins/jenkins-slave/tools/hudson.plugins.gradle.GradleInstallation/Gradle_2.4-rc-2
Setting GRADLE_2_4_RC_2_HOME=/home/jenkins/jenkins-slave/tools/hudson.plugins.gradle.GradleInstallation/Gradle_2.4-rc-2