You are viewing a plain text version of this content. The canonical link for it is here.
Posted to dev@lucene.apache.org by Policeman Jenkins Server <je...@thetaphi.de> on 2016/07/27 00:39:16 UTC
[JENKINS] Lucene-Solr-master-Solaris (64bit/jdk1.8.0) - Build # 742
- Still Unstable!
Build: http://jenkins.thetaphi.de/job/Lucene-Solr-master-Solaris/742/
Java: 64bit/jdk1.8.0 -XX:+UseCompressedOops -XX:+UseG1GC
1 tests failed.
FAILED: org.apache.solr.cloud.AliasIntegrationTest.test
Error Message:
java.util.concurrent.TimeoutException: Could not connect to ZooKeeper 127.0.0.1:47749/solr within 10000 ms
Stack Trace:
org.apache.solr.common.SolrException: java.util.concurrent.TimeoutException: Could not connect to ZooKeeper 127.0.0.1:47749/solr within 10000 ms
at __randomizedtesting.SeedInfo.seed([4F5F7943788FF4A5:C70B4699D673995D]:0)
at org.apache.solr.common.cloud.SolrZkClient.<init>(SolrZkClient.java:181)
at org.apache.solr.common.cloud.SolrZkClient.<init>(SolrZkClient.java:115)
at org.apache.solr.common.cloud.SolrZkClient.<init>(SolrZkClient.java:105)
at org.apache.solr.common.cloud.ZkStateReader.<init>(ZkStateReader.java:227)
at org.apache.solr.client.solrj.impl.CloudSolrClient.connect(CloudSolrClient.java:560)
at org.apache.solr.cloud.AbstractFullDistribZkTestBase.getCommonCloudSolrClient(AbstractFullDistribZkTestBase.java:1737)
at org.apache.solr.cloud.AbstractFullDistribZkTestBase.checkCollectionExpectations(AbstractFullDistribZkTestBase.java:1669)
at org.apache.solr.cloud.AbstractFullDistribZkTestBase.checkForCollection(AbstractFullDistribZkTestBase.java:1710)
at org.apache.solr.cloud.AliasIntegrationTest.test(AliasIntegrationTest.java:76)
at sun.reflect.NativeMethodAccessorImpl.invoke0(Native Method)
at sun.reflect.NativeMethodAccessorImpl.invoke(NativeMethodAccessorImpl.java:62)
at sun.reflect.DelegatingMethodAccessorImpl.invoke(DelegatingMethodAccessorImpl.java:43)
at java.lang.reflect.Method.invoke(Method.java:498)
at com.carrotsearch.randomizedtesting.RandomizedRunner.invoke(RandomizedRunner.java:1764)
at com.carrotsearch.randomizedtesting.RandomizedRunner$8.evaluate(RandomizedRunner.java:871)
at com.carrotsearch.randomizedtesting.RandomizedRunner$9.evaluate(RandomizedRunner.java:907)
at com.carrotsearch.randomizedtesting.RandomizedRunner$10.evaluate(RandomizedRunner.java:921)
at org.apache.solr.BaseDistributedSearchTestCase$ShardsRepeatRule$ShardsFixedStatement.callStatement(BaseDistributedSearchTestCase.java:985)
at org.apache.solr.BaseDistributedSearchTestCase$ShardsRepeatRule$ShardsStatement.evaluate(BaseDistributedSearchTestCase.java:960)
at com.carrotsearch.randomizedtesting.rules.SystemPropertiesRestoreRule$1.evaluate(SystemPropertiesRestoreRule.java:57)
at org.apache.lucene.util.TestRuleSetupTeardownChained$1.evaluate(TestRuleSetupTeardownChained.java:49)
at org.apache.lucene.util.AbstractBeforeAfterRule$1.evaluate(AbstractBeforeAfterRule.java:45)
at org.apache.lucene.util.TestRuleThreadAndTestName$1.evaluate(TestRuleThreadAndTestName.java:48)
at org.apache.lucene.util.TestRuleIgnoreAfterMaxFailures$1.evaluate(TestRuleIgnoreAfterMaxFailures.java:64)
at org.apache.lucene.util.TestRuleMarkFailure$1.evaluate(TestRuleMarkFailure.java:47)
at com.carrotsearch.randomizedtesting.rules.StatementAdapter.evaluate(StatementAdapter.java:36)
at com.carrotsearch.randomizedtesting.ThreadLeakControl$StatementRunner.run(ThreadLeakControl.java:367)
at com.carrotsearch.randomizedtesting.ThreadLeakControl.forkTimeoutingTask(ThreadLeakControl.java:809)
at com.carrotsearch.randomizedtesting.ThreadLeakControl$3.evaluate(ThreadLeakControl.java:460)
at com.carrotsearch.randomizedtesting.RandomizedRunner.runSingleTest(RandomizedRunner.java:880)
at com.carrotsearch.randomizedtesting.RandomizedRunner$5.evaluate(RandomizedRunner.java:781)
at com.carrotsearch.randomizedtesting.RandomizedRunner$6.evaluate(RandomizedRunner.java:816)
at com.carrotsearch.randomizedtesting.RandomizedRunner$7.evaluate(RandomizedRunner.java:827)
at com.carrotsearch.randomizedtesting.rules.StatementAdapter.evaluate(StatementAdapter.java:36)
at com.carrotsearch.randomizedtesting.rules.SystemPropertiesRestoreRule$1.evaluate(SystemPropertiesRestoreRule.java:57)
at org.apache.lucene.util.AbstractBeforeAfterRule$1.evaluate(AbstractBeforeAfterRule.java:45)
at com.carrotsearch.randomizedtesting.rules.StatementAdapter.evaluate(StatementAdapter.java:36)
at org.apache.lucene.util.TestRuleStoreClassName$1.evaluate(TestRuleStoreClassName.java:41)
at com.carrotsearch.randomizedtesting.rules.NoShadowingOrOverridesOnMethodsRule$1.evaluate(NoShadowingOrOverridesOnMethodsRule.java:40)
at com.carrotsearch.randomizedtesting.rules.NoShadowingOrOverridesOnMethodsRule$1.evaluate(NoShadowingOrOverridesOnMethodsRule.java:40)
at com.carrotsearch.randomizedtesting.rules.StatementAdapter.evaluate(StatementAdapter.java:36)
at com.carrotsearch.randomizedtesting.rules.StatementAdapter.evaluate(StatementAdapter.java:36)
at com.carrotsearch.randomizedtesting.rules.StatementAdapter.evaluate(StatementAdapter.java:36)
at org.apache.lucene.util.TestRuleAssertionsRequired$1.evaluate(TestRuleAssertionsRequired.java:53)
at org.apache.lucene.util.TestRuleMarkFailure$1.evaluate(TestRuleMarkFailure.java:47)
at org.apache.lucene.util.TestRuleIgnoreAfterMaxFailures$1.evaluate(TestRuleIgnoreAfterMaxFailures.java:64)
at org.apache.lucene.util.TestRuleIgnoreTestSuites$1.evaluate(TestRuleIgnoreTestSuites.java:54)
at com.carrotsearch.randomizedtesting.rules.StatementAdapter.evaluate(StatementAdapter.java:36)
at com.carrotsearch.randomizedtesting.ThreadLeakControl$StatementRunner.run(ThreadLeakControl.java:367)
at java.lang.Thread.run(Thread.java:745)
Caused by: java.util.concurrent.TimeoutException: Could not connect to ZooKeeper 127.0.0.1:47749/solr within 10000 ms
at org.apache.solr.common.cloud.ConnectionManager.waitForConnected(ConnectionManager.java:235)
at org.apache.solr.common.cloud.SolrZkClient.<init>(SolrZkClient.java:173)
... 49 more
Build Log:
[...truncated 11948 lines...]
[junit4] Suite: org.apache.solr.cloud.AliasIntegrationTest
[junit4] 2> Creating dataDir: /export/home/jenkins/workspace/Lucene-Solr-master-Solaris/solr/build/solr-core/test/J0/temp/solr.cloud.AliasIntegrationTest_4F5F7943788FF4A5-001/init-core-data-001
[junit4] 2> 1887693 INFO (SUITE-AliasIntegrationTest-seed#[4F5F7943788FF4A5]-worker) [ ] o.a.s.SolrTestCaseJ4 Randomized ssl (false) and clientAuth (true) via: @org.apache.solr.util.RandomizeSSL(reason=, value=NaN, ssl=NaN, clientAuth=NaN)
[junit4] 2> 1887693 INFO (SUITE-AliasIntegrationTest-seed#[4F5F7943788FF4A5]-worker) [ ] o.a.s.BaseDistributedSearchTestCase Setting hostContext system property: /
[junit4] 2> 1887695 INFO (TEST-AliasIntegrationTest.test-seed#[4F5F7943788FF4A5]) [ ] o.a.s.c.ZkTestServer STARTING ZK TEST SERVER
[junit4] 2> 1887695 INFO (Thread-6553) [ ] o.a.s.c.ZkTestServer client port:0.0.0.0/0.0.0.0:0
[junit4] 2> 1887695 INFO (Thread-6553) [ ] o.a.s.c.ZkTestServer Starting server
[junit4] 2> 1887795 INFO (TEST-AliasIntegrationTest.test-seed#[4F5F7943788FF4A5]) [ ] o.a.s.c.ZkTestServer start zk server on port:47749
[junit4] 2> 1887796 INFO (TEST-AliasIntegrationTest.test-seed#[4F5F7943788FF4A5]) [ ] o.a.s.c.c.SolrZkClient Using default ZkCredentialsProvider
[junit4] 2> 1887796 INFO (TEST-AliasIntegrationTest.test-seed#[4F5F7943788FF4A5]) [ ] o.a.s.c.c.ConnectionManager Waiting for client to connect to ZooKeeper
[junit4] 2> 1887800 INFO (zkCallback-2653-thread-1) [ ] o.a.s.c.c.ConnectionManager Watcher org.apache.solr.common.cloud.ConnectionManager@743e59f0 name:ZooKeeperConnection Watcher:127.0.0.1:47749 got event WatchedEvent state:SyncConnected type:None path:null path:null type:None
[junit4] 2> 1887801 INFO (TEST-AliasIntegrationTest.test-seed#[4F5F7943788FF4A5]) [ ] o.a.s.c.c.ConnectionManager Client is connected to ZooKeeper
[junit4] 2> 1887801 INFO (TEST-AliasIntegrationTest.test-seed#[4F5F7943788FF4A5]) [ ] o.a.s.c.c.SolrZkClient Using default ZkACLProvider
[junit4] 2> 1887801 INFO (TEST-AliasIntegrationTest.test-seed#[4F5F7943788FF4A5]) [ ] o.a.s.c.c.SolrZkClient makePath: /solr
[junit4] 2> 1887804 INFO (TEST-AliasIntegrationTest.test-seed#[4F5F7943788FF4A5]) [ ] o.a.s.c.c.SolrZkClient Using default ZkCredentialsProvider
[junit4] 2> 1887805 INFO (TEST-AliasIntegrationTest.test-seed#[4F5F7943788FF4A5]) [ ] o.a.s.c.c.ConnectionManager Waiting for client to connect to ZooKeeper
[junit4] 2> 1887807 INFO (zkCallback-2654-thread-1) [ ] o.a.s.c.c.ConnectionManager Watcher org.apache.solr.common.cloud.ConnectionManager@7379e900 name:ZooKeeperConnection Watcher:127.0.0.1:47749/solr got event WatchedEvent state:SyncConnected type:None path:null path:null type:None
[junit4] 2> 1887807 INFO (TEST-AliasIntegrationTest.test-seed#[4F5F7943788FF4A5]) [ ] o.a.s.c.c.ConnectionManager Client is connected to ZooKeeper
[junit4] 2> 1887807 INFO (TEST-AliasIntegrationTest.test-seed#[4F5F7943788FF4A5]) [ ] o.a.s.c.c.SolrZkClient Using default ZkACLProvider
[junit4] 2> 1887807 INFO (TEST-AliasIntegrationTest.test-seed#[4F5F7943788FF4A5]) [ ] o.a.s.c.c.SolrZkClient makePath: /collections/collection1
[junit4] 2> 1887809 INFO (TEST-AliasIntegrationTest.test-seed#[4F5F7943788FF4A5]) [ ] o.a.s.c.c.SolrZkClient makePath: /collections/collection1/shards
[junit4] 2> 1887811 INFO (TEST-AliasIntegrationTest.test-seed#[4F5F7943788FF4A5]) [ ] o.a.s.c.c.SolrZkClient makePath: /collections/control_collection
[junit4] 2> 1887818 INFO (TEST-AliasIntegrationTest.test-seed#[4F5F7943788FF4A5]) [ ] o.a.s.c.c.SolrZkClient makePath: /collections/control_collection/shards
[junit4] 2> 1887820 INFO (TEST-AliasIntegrationTest.test-seed#[4F5F7943788FF4A5]) [ ] o.a.s.c.AbstractZkTestCase put /export/home/jenkins/workspace/Lucene-Solr-master-Solaris/solr/core/src/test-files/solr/collection1/conf/solrconfig-tlog.xml to /configs/conf1/solrconfig.xml
[junit4] 2> 1887820 INFO (TEST-AliasIntegrationTest.test-seed#[4F5F7943788FF4A5]) [ ] o.a.s.c.c.SolrZkClient makePath: /configs/conf1/solrconfig.xml
[junit4] 2> 1887824 INFO (TEST-AliasIntegrationTest.test-seed#[4F5F7943788FF4A5]) [ ] o.a.s.c.AbstractZkTestCase put /export/home/jenkins/workspace/Lucene-Solr-master-Solaris/solr/core/src/test-files/solr/collection1/conf/schema.xml to /configs/conf1/schema.xml
[junit4] 2> 1887824 INFO (TEST-AliasIntegrationTest.test-seed#[4F5F7943788FF4A5]) [ ] o.a.s.c.c.SolrZkClient makePath: /configs/conf1/schema.xml
[junit4] 2> 1887826 INFO (TEST-AliasIntegrationTest.test-seed#[4F5F7943788FF4A5]) [ ] o.a.s.c.AbstractZkTestCase put /export/home/jenkins/workspace/Lucene-Solr-master-Solaris/solr/core/src/test-files/solr/collection1/conf/solrconfig.snippet.randomindexconfig.xml to /configs/conf1/solrconfig.snippet.randomindexconfig.xml
[junit4] 2> 1887826 INFO (TEST-AliasIntegrationTest.test-seed#[4F5F7943788FF4A5]) [ ] o.a.s.c.c.SolrZkClient makePath: /configs/conf1/solrconfig.snippet.randomindexconfig.xml
[junit4] 2> 1887829 INFO (TEST-AliasIntegrationTest.test-seed#[4F5F7943788FF4A5]) [ ] o.a.s.c.AbstractZkTestCase put /export/home/jenkins/workspace/Lucene-Solr-master-Solaris/solr/core/src/test-files/solr/collection1/conf/stopwords.txt to /configs/conf1/stopwords.txt
[junit4] 2> 1887829 INFO (TEST-AliasIntegrationTest.test-seed#[4F5F7943788FF4A5]) [ ] o.a.s.c.c.SolrZkClient makePath: /configs/conf1/stopwords.txt
[junit4] 2> 1887831 INFO (TEST-AliasIntegrationTest.test-seed#[4F5F7943788FF4A5]) [ ] o.a.s.c.AbstractZkTestCase put /export/home/jenkins/workspace/Lucene-Solr-master-Solaris/solr/core/src/test-files/solr/collection1/conf/protwords.txt to /configs/conf1/protwords.txt
[junit4] 2> 1887831 INFO (TEST-AliasIntegrationTest.test-seed#[4F5F7943788FF4A5]) [ ] o.a.s.c.c.SolrZkClient makePath: /configs/conf1/protwords.txt
[junit4] 2> 1887834 INFO (TEST-AliasIntegrationTest.test-seed#[4F5F7943788FF4A5]) [ ] o.a.s.c.AbstractZkTestCase put /export/home/jenkins/workspace/Lucene-Solr-master-Solaris/solr/core/src/test-files/solr/collection1/conf/currency.xml to /configs/conf1/currency.xml
[junit4] 2> 1887834 INFO (TEST-AliasIntegrationTest.test-seed#[4F5F7943788FF4A5]) [ ] o.a.s.c.c.SolrZkClient makePath: /configs/conf1/currency.xml
[junit4] 2> 1887836 INFO (TEST-AliasIntegrationTest.test-seed#[4F5F7943788FF4A5]) [ ] o.a.s.c.AbstractZkTestCase put /export/home/jenkins/workspace/Lucene-Solr-master-Solaris/solr/core/src/test-files/solr/collection1/conf/enumsConfig.xml to /configs/conf1/enumsConfig.xml
[junit4] 2> 1887836 INFO (TEST-AliasIntegrationTest.test-seed#[4F5F7943788FF4A5]) [ ] o.a.s.c.c.SolrZkClient makePath: /configs/conf1/enumsConfig.xml
[junit4] 2> 1887838 INFO (TEST-AliasIntegrationTest.test-seed#[4F5F7943788FF4A5]) [ ] o.a.s.c.AbstractZkTestCase put /export/home/jenkins/workspace/Lucene-Solr-master-Solaris/solr/core/src/test-files/solr/collection1/conf/open-exchange-rates.json to /configs/conf1/open-exchange-rates.json
[junit4] 2> 1887838 INFO (TEST-AliasIntegrationTest.test-seed#[4F5F7943788FF4A5]) [ ] o.a.s.c.c.SolrZkClient makePath: /configs/conf1/open-exchange-rates.json
[junit4] 2> 1887841 INFO (TEST-AliasIntegrationTest.test-seed#[4F5F7943788FF4A5]) [ ] o.a.s.c.AbstractZkTestCase put /export/home/jenkins/workspace/Lucene-Solr-master-Solaris/solr/core/src/test-files/solr/collection1/conf/mapping-ISOLatin1Accent.txt to /configs/conf1/mapping-ISOLatin1Accent.txt
[junit4] 2> 1887841 INFO (TEST-AliasIntegrationTest.test-seed#[4F5F7943788FF4A5]) [ ] o.a.s.c.c.SolrZkClient makePath: /configs/conf1/mapping-ISOLatin1Accent.txt
[junit4] 2> 1887843 INFO (TEST-AliasIntegrationTest.test-seed#[4F5F7943788FF4A5]) [ ] o.a.s.c.AbstractZkTestCase put /export/home/jenkins/workspace/Lucene-Solr-master-Solaris/solr/core/src/test-files/solr/collection1/conf/old_synonyms.txt to /configs/conf1/old_synonyms.txt
[junit4] 2> 1887843 INFO (TEST-AliasIntegrationTest.test-seed#[4F5F7943788FF4A5]) [ ] o.a.s.c.c.SolrZkClient makePath: /configs/conf1/old_synonyms.txt
[junit4] 2> 1887846 INFO (TEST-AliasIntegrationTest.test-seed#[4F5F7943788FF4A5]) [ ] o.a.s.c.AbstractZkTestCase put /export/home/jenkins/workspace/Lucene-Solr-master-Solaris/solr/core/src/test-files/solr/collection1/conf/synonyms.txt to /configs/conf1/synonyms.txt
[junit4] 2> 1887846 INFO (TEST-AliasIntegrationTest.test-seed#[4F5F7943788FF4A5]) [ ] o.a.s.c.c.SolrZkClient makePath: /configs/conf1/synonyms.txt
[junit4] 2> 1888065 INFO (TEST-AliasIntegrationTest.test-seed#[4F5F7943788FF4A5]) [ ] o.a.s.SolrTestCaseJ4 Writing core.properties file to /export/home/jenkins/workspace/Lucene-Solr-master-Solaris/solr/build/solr-core/test/J0/temp/solr.cloud.AliasIntegrationTest_4F5F7943788FF4A5-001/control-001/cores/collection1
[junit4] 2> 1888066 INFO (TEST-AliasIntegrationTest.test-seed#[4F5F7943788FF4A5]) [ ] o.e.j.s.Server jetty-9.3.8.v20160314
[junit4] 2> 1888067 INFO (TEST-AliasIntegrationTest.test-seed#[4F5F7943788FF4A5]) [ ] o.e.j.s.h.ContextHandler Started o.e.j.s.ServletContextHandler@a70e363{/,null,AVAILABLE}
[junit4] 2> 1888068 INFO (TEST-AliasIntegrationTest.test-seed#[4F5F7943788FF4A5]) [ ] o.e.j.s.ServerConnector Started ServerConnector@20aeba11{HTTP/1.1,[http/1.1]}{127.0.0.1:44373}
[junit4] 2> 1888068 INFO (TEST-AliasIntegrationTest.test-seed#[4F5F7943788FF4A5]) [ ] o.e.j.s.Server Started @1892335ms
[junit4] 2> 1888068 INFO (TEST-AliasIntegrationTest.test-seed#[4F5F7943788FF4A5]) [ ] o.a.s.c.s.e.JettySolrRunner Jetty properties: {solr.data.dir=/export/home/jenkins/workspace/Lucene-Solr-master-Solaris/solr/build/solr-core/test/J0/temp/solr.cloud.AliasIntegrationTest_4F5F7943788FF4A5-001/tempDir-001/control/data, hostContext=/, hostPort=44373, coreRootDirectory=/export/home/jenkins/workspace/Lucene-Solr-master-Solaris/solr/build/solr-core/test/J0/../../../../../../../../../../export/home/jenkins/workspace/Lucene-Solr-master-Solaris/solr/build/solr-core/test/J0/temp/solr.cloud.AliasIntegrationTest_4F5F7943788FF4A5-001/control-001/cores}
[junit4] 2> 1888068 INFO (TEST-AliasIntegrationTest.test-seed#[4F5F7943788FF4A5]) [ ] o.a.s.s.SolrDispatchFilter SolrDispatchFilter.init(): sun.misc.Launcher$AppClassLoader@6d06d69c
[junit4] 2> 1888068 INFO (TEST-AliasIntegrationTest.test-seed#[4F5F7943788FF4A5]) [ ] o.a.s.c.SolrResourceLoader new SolrResourceLoader for directory: '/export/home/jenkins/workspace/Lucene-Solr-master-Solaris/solr/build/solr-core/test/J0/temp/solr.cloud.AliasIntegrationTest_4F5F7943788FF4A5-001/control-001'
[junit4] 2> 1888068 INFO (TEST-AliasIntegrationTest.test-seed#[4F5F7943788FF4A5]) [ ] o.a.s.c.SolrResourceLoader JNDI not configured for solr (NoInitialContextEx)
[junit4] 2> 1888069 INFO (TEST-AliasIntegrationTest.test-seed#[4F5F7943788FF4A5]) [ ] o.a.s.c.SolrResourceLoader solr home defaulted to 'solr/' (could not find system property or JNDI)
[junit4] 2> 1888069 INFO (TEST-AliasIntegrationTest.test-seed#[4F5F7943788FF4A5]) [ ] o.a.s.c.c.SolrZkClient Using default ZkCredentialsProvider
[junit4] 2> 1888069 INFO (TEST-AliasIntegrationTest.test-seed#[4F5F7943788FF4A5]) [ ] o.a.s.c.c.ConnectionManager Waiting for client to connect to ZooKeeper
[junit4] 2> 1888071 INFO (zkCallback-2655-thread-1) [ ] o.a.s.c.c.ConnectionManager Watcher org.apache.solr.common.cloud.ConnectionManager@6acd91db name:ZooKeeperConnection Watcher:127.0.0.1:47749/solr got event WatchedEvent state:SyncConnected type:None path:null path:null type:None
[junit4] 2> 1888071 INFO (TEST-AliasIntegrationTest.test-seed#[4F5F7943788FF4A5]) [ ] o.a.s.c.c.ConnectionManager Client is connected to ZooKeeper
[junit4] 2> 1888072 INFO (TEST-AliasIntegrationTest.test-seed#[4F5F7943788FF4A5]) [ ] o.a.s.c.c.SolrZkClient Using default ZkACLProvider
[junit4] 2> 1888073 INFO (TEST-AliasIntegrationTest.test-seed#[4F5F7943788FF4A5]) [ ] o.a.s.s.SolrDispatchFilter Loading solr.xml from SolrHome (not found in ZooKeeper)
[junit4] 2> 1888073 INFO (TEST-AliasIntegrationTest.test-seed#[4F5F7943788FF4A5]) [ ] o.a.s.c.SolrXmlConfig Loading container configuration from /export/home/jenkins/workspace/Lucene-Solr-master-Solaris/solr/build/solr-core/test/J0/temp/solr.cloud.AliasIntegrationTest_4F5F7943788FF4A5-001/control-001/solr.xml
[junit4] 2> 1888078 INFO (TEST-AliasIntegrationTest.test-seed#[4F5F7943788FF4A5]) [ ] o.a.s.c.CorePropertiesLocator Config-defined core root directory: /export/home/jenkins/workspace/Lucene-Solr-master-Solaris/solr/build/solr-core/test/J0/../../../../../../../../../../export/home/jenkins/workspace/Lucene-Solr-master-Solaris/solr/build/solr-core/test/J0/temp/solr.cloud.AliasIntegrationTest_4F5F7943788FF4A5-001/control-001/cores
[junit4] 2> 1888078 INFO (TEST-AliasIntegrationTest.test-seed#[4F5F7943788FF4A5]) [ ] o.a.s.c.CoreContainer New CoreContainer 1842678401
[junit4] 2> 1888078 INFO (TEST-AliasIntegrationTest.test-seed#[4F5F7943788FF4A5]) [ ] o.a.s.c.CoreContainer Loading cores into CoreContainer [instanceDir=/export/home/jenkins/workspace/Lucene-Solr-master-Solaris/solr/build/solr-core/test/J0/temp/solr.cloud.AliasIntegrationTest_4F5F7943788FF4A5-001/control-001]
[junit4] 2> 1888078 WARN (TEST-AliasIntegrationTest.test-seed#[4F5F7943788FF4A5]) [ ] o.a.s.c.CoreContainer Couldn't add files from /export/home/jenkins/workspace/Lucene-Solr-master-Solaris/solr/build/solr-core/test/J0/temp/solr.cloud.AliasIntegrationTest_4F5F7943788FF4A5-001/control-001/lib to classpath: /export/home/jenkins/workspace/Lucene-Solr-master-Solaris/solr/build/solr-core/test/J0/temp/solr.cloud.AliasIntegrationTest_4F5F7943788FF4A5-001/control-001/lib
[junit4] 2> 1888078 INFO (TEST-AliasIntegrationTest.test-seed#[4F5F7943788FF4A5]) [ ] o.a.s.h.c.HttpShardHandlerFactory created with socketTimeout : 90000,urlScheme : ,connTimeout : 15000,maxConnectionsPerHost : 20,maxConnections : 10000,corePoolSize : 0,maximumPoolSize : 2147483647,maxThreadIdleTime : 5,sizeOfQueue : -1,fairnessPolicy : false,
[junit4] 2> 1888080 INFO (TEST-AliasIntegrationTest.test-seed#[4F5F7943788FF4A5]) [ ] o.a.s.u.UpdateShardHandler Created UpdateShardHandler HTTP client with params: socketTimeout=340000&connTimeout=45000&maxConnections=100000&maxConnectionsPerHost=100000
[junit4] 2> 1888080 INFO (TEST-AliasIntegrationTest.test-seed#[4F5F7943788FF4A5]) [ ] o.a.s.l.LogWatcher SLF4J impl is org.slf4j.impl.Log4jLoggerFactory
[junit4] 2> 1888080 INFO (TEST-AliasIntegrationTest.test-seed#[4F5F7943788FF4A5]) [ ] o.a.s.l.LogWatcher Registering Log Listener [Log4j (org.slf4j.impl.Log4jLoggerFactory)]
[junit4] 2> 1888080 INFO (TEST-AliasIntegrationTest.test-seed#[4F5F7943788FF4A5]) [ ] o.a.s.c.ZkContainer Zookeeper client=127.0.0.1:47749/solr
[junit4] 2> 1888080 INFO (TEST-AliasIntegrationTest.test-seed#[4F5F7943788FF4A5]) [ ] o.a.s.c.ZkController zkHost includes chroot
[junit4] 2> 1888080 INFO (TEST-AliasIntegrationTest.test-seed#[4F5F7943788FF4A5]) [ ] o.a.s.c.c.SolrZkClient Using default ZkCredentialsProvider
[junit4] 2> 1888081 INFO (TEST-AliasIntegrationTest.test-seed#[4F5F7943788FF4A5]) [ ] o.a.s.c.c.ConnectionManager Waiting for client to connect to ZooKeeper
[junit4] 2> 1888083 INFO (zkCallback-2658-thread-1) [ ] o.a.s.c.c.ConnectionManager Watcher org.apache.solr.common.cloud.ConnectionManager@2a8ed2bd name:ZooKeeperConnection Watcher:127.0.0.1:47749 got event WatchedEvent state:SyncConnected type:None path:null path:null type:None
[junit4] 2> 1888083 INFO (TEST-AliasIntegrationTest.test-seed#[4F5F7943788FF4A5]) [ ] o.a.s.c.c.ConnectionManager Client is connected to ZooKeeper
[junit4] 2> 1888083 INFO (TEST-AliasIntegrationTest.test-seed#[4F5F7943788FF4A5]) [ ] o.a.s.c.c.SolrZkClient Using default ZkACLProvider
[junit4] 2> 1888085 INFO (TEST-AliasIntegrationTest.test-seed#[4F5F7943788FF4A5]) [n:127.0.0.1:44373_ ] o.a.s.c.ZkController Added new OnReconnect listener org.apache.solr.cloud.ZkController$$Lambda$70/1395103966@6e3e16ce
[junit4] 2> 1888086 INFO (TEST-AliasIntegrationTest.test-seed#[4F5F7943788FF4A5]) [n:127.0.0.1:44373_ ] o.a.s.c.c.ConnectionManager Waiting for client to connect to ZooKeeper
[junit4] 2> 1888087 INFO (zkCallback-2659-thread-1-processing-n:127.0.0.1:44373_) [n:127.0.0.1:44373_ ] o.a.s.c.c.ConnectionManager Watcher org.apache.solr.common.cloud.ConnectionManager@c254d98 name:ZooKeeperConnection Watcher:127.0.0.1:47749/solr got event WatchedEvent state:SyncConnected type:None path:null path:null type:None
[junit4] 2> 1888087 INFO (TEST-AliasIntegrationTest.test-seed#[4F5F7943788FF4A5]) [n:127.0.0.1:44373_ ] o.a.s.c.c.ConnectionManager Client is connected to ZooKeeper
[junit4] 2> 1888089 INFO (TEST-AliasIntegrationTest.test-seed#[4F5F7943788FF4A5]) [n:127.0.0.1:44373_ ] o.a.s.c.c.SolrZkClient makePath: /overseer/queue
[junit4] 2> 1888092 INFO (TEST-AliasIntegrationTest.test-seed#[4F5F7943788FF4A5]) [n:127.0.0.1:44373_ ] o.a.s.c.c.SolrZkClient makePath: /overseer/collection-queue-work
[junit4] 2> 1888097 INFO (TEST-AliasIntegrationTest.test-seed#[4F5F7943788FF4A5]) [n:127.0.0.1:44373_ ] o.a.s.c.c.SolrZkClient makePath: /overseer/collection-map-running
[junit4] 2> 1888100 INFO (TEST-AliasIntegrationTest.test-seed#[4F5F7943788FF4A5]) [n:127.0.0.1:44373_ ] o.a.s.c.c.SolrZkClient makePath: /overseer/collection-map-completed
[junit4] 2> 1888103 INFO (TEST-AliasIntegrationTest.test-seed#[4F5F7943788FF4A5]) [n:127.0.0.1:44373_ ] o.a.s.c.c.SolrZkClient makePath: /overseer/collection-map-failure
[junit4] 2> 1888106 INFO (TEST-AliasIntegrationTest.test-seed#[4F5F7943788FF4A5]) [n:127.0.0.1:44373_ ] o.a.s.c.c.SolrZkClient makePath: /live_nodes
[junit4] 2> 1888109 INFO (TEST-AliasIntegrationTest.test-seed#[4F5F7943788FF4A5]) [n:127.0.0.1:44373_ ] o.a.s.c.c.SolrZkClient makePath: /aliases.json
[junit4] 2> 1888111 INFO (TEST-AliasIntegrationTest.test-seed#[4F5F7943788FF4A5]) [n:127.0.0.1:44373_ ] o.a.s.c.c.SolrZkClient makePath: /clusterstate.json
[junit4] 2> 1888113 INFO (TEST-AliasIntegrationTest.test-seed#[4F5F7943788FF4A5]) [n:127.0.0.1:44373_ ] o.a.s.c.c.SolrZkClient makePath: /security.json
[junit4] 2> 1888114 INFO (TEST-AliasIntegrationTest.test-seed#[4F5F7943788FF4A5]) [n:127.0.0.1:44373_ ] o.a.s.c.c.ZkStateReader Updating cluster state from ZooKeeper...
[junit4] 2> 1888115 INFO (TEST-AliasIntegrationTest.test-seed#[4F5F7943788FF4A5]) [n:127.0.0.1:44373_ ] o.a.s.c.c.ZkStateReader Loaded empty cluster properties
[junit4] 2> 1888116 INFO (TEST-AliasIntegrationTest.test-seed#[4F5F7943788FF4A5]) [n:127.0.0.1:44373_ ] o.a.s.c.c.ZkStateReader Updated live nodes from ZooKeeper... (0) -> (0)
[junit4] 2> 1888121 INFO (TEST-AliasIntegrationTest.test-seed#[4F5F7943788FF4A5]) [n:127.0.0.1:44373_ ] o.a.s.c.c.SolrZkClient makePath: /overseer_elect
[junit4] 2> 1888122 INFO (TEST-AliasIntegrationTest.test-seed#[4F5F7943788FF4A5]) [n:127.0.0.1:44373_ ] o.a.s.c.c.SolrZkClient makePath: /overseer_elect/election
[junit4] 2> 1888124 INFO (TEST-AliasIntegrationTest.test-seed#[4F5F7943788FF4A5]) [n:127.0.0.1:44373_ ] o.a.s.c.Overseer Overseer (id=null) closing
[junit4] 2> 1888125 INFO (TEST-AliasIntegrationTest.test-seed#[4F5F7943788FF4A5]) [n:127.0.0.1:44373_ ] o.a.s.c.LeaderElector Joined leadership election with path: /overseer_elect/election/96310210187362308-127.0.0.1:44373_-n_0000000000
[junit4] 2> 1888125 INFO (TEST-AliasIntegrationTest.test-seed#[4F5F7943788FF4A5]) [n:127.0.0.1:44373_ ] o.a.s.c.OverseerElectionContext I am going to be the leader 127.0.0.1:44373_
[junit4] 2> 1888125 INFO (TEST-AliasIntegrationTest.test-seed#[4F5F7943788FF4A5]) [n:127.0.0.1:44373_ ] o.a.s.c.c.SolrZkClient makePath: /overseer_elect/leader
[junit4] 2> 1888127 INFO (TEST-AliasIntegrationTest.test-seed#[4F5F7943788FF4A5]) [n:127.0.0.1:44373_ ] o.a.s.c.Overseer Overseer (id=96310210187362308-127.0.0.1:44373_-n_0000000000) starting
[junit4] 2> 1888129 INFO (TEST-AliasIntegrationTest.test-seed#[4F5F7943788FF4A5]) [n:127.0.0.1:44373_ ] o.a.s.c.c.SolrZkClient makePath: /overseer/queue-work
[junit4] 2> 1888138 INFO (TEST-AliasIntegrationTest.test-seed#[4F5F7943788FF4A5]) [n:127.0.0.1:44373_ ] o.a.s.c.OverseerAutoReplicaFailoverThread Starting OverseerAutoReplicaFailoverThread autoReplicaFailoverWorkLoopDelay=10000 autoReplicaFailoverWaitAfterExpiration=10000 autoReplicaFailoverBadNodeExpiration=60000
[junit4] 2> 1888138 INFO (OverseerCollectionConfigSetProcessor-96310210187362308-127.0.0.1:44373_-n_0000000000) [n:127.0.0.1:44373_ ] o.a.s.c.OverseerTaskProcessor Process current queue of overseer operations
[junit4] 2> 1888139 INFO (OverseerStateUpdate-96310210187362308-127.0.0.1:44373_-n_0000000000) [n:127.0.0.1:44373_ ] o.a.s.c.Overseer Starting to work on the main queue
[junit4] 2> 1888139 INFO (TEST-AliasIntegrationTest.test-seed#[4F5F7943788FF4A5]) [n:127.0.0.1:44373_ ] o.a.s.c.ZkController Register node as live in ZooKeeper:/live_nodes/127.0.0.1:44373_
[junit4] 2> 1888139 INFO (TEST-AliasIntegrationTest.test-seed#[4F5F7943788FF4A5]) [n:127.0.0.1:44373_ ] o.a.s.c.c.SolrZkClient makePath: /live_nodes/127.0.0.1:44373_
[junit4] 2> 1888142 INFO (OverseerStateUpdate-96310210187362308-127.0.0.1:44373_-n_0000000000) [n:127.0.0.1:44373_ ] o.a.s.c.c.ZkStateReader Updated live nodes from ZooKeeper... (0) -> (0)
[junit4] 2> 1888143 INFO (zkCallback-2659-thread-1-processing-n:127.0.0.1:44373_) [n:127.0.0.1:44373_ ] o.a.s.c.c.ZkStateReader A live node change: [WatchedEvent state:SyncConnected type:NodeChildrenChanged path:/live_nodes], has occurred - updating... (live nodes size: [0])
[junit4] 2> 1888143 INFO (zkCallback-2659-thread-1-processing-n:127.0.0.1:44373_) [n:127.0.0.1:44373_ ] o.a.s.c.c.ZkStateReader Updated live nodes from ZooKeeper... (0) -> (1)
[junit4] 2> 1888189 INFO (TEST-AliasIntegrationTest.test-seed#[4F5F7943788FF4A5]) [n:127.0.0.1:44373_ ] o.a.s.c.CoreContainer Security conf doesn't exist. Skipping setup for authorization module.
[junit4] 2> 1888190 INFO (TEST-AliasIntegrationTest.test-seed#[4F5F7943788FF4A5]) [n:127.0.0.1:44373_ ] o.a.s.c.CoreContainer No authentication plugin used.
[junit4] 2> 1888190 INFO (TEST-AliasIntegrationTest.test-seed#[4F5F7943788FF4A5]) [n:127.0.0.1:44373_ ] o.a.s.c.CorePropertiesLocator Looking for core definitions underneath /export/home/jenkins/workspace/Lucene-Solr-master-Solaris/solr/build/solr-core/test/J0/../../../../../../../../../../export/home/jenkins/workspace/Lucene-Solr-master-Solaris/solr/build/solr-core/test/J0/temp/solr.cloud.AliasIntegrationTest_4F5F7943788FF4A5-001/control-001/cores
[junit4] 2> 1888191 INFO (TEST-AliasIntegrationTest.test-seed#[4F5F7943788FF4A5]) [n:127.0.0.1:44373_ ] o.a.s.c.CoreDescriptor Created CoreDescriptor: {name=collection1, config=solrconfig.xml, transient=false, schema=schema.xml, loadOnStartup=true, configSetProperties=configsetprops.json, collection=control_collection, coreNodeName=, dataDir=data/, shard=}
[junit4] 2> 1888191 INFO (TEST-AliasIntegrationTest.test-seed#[4F5F7943788FF4A5]) [n:127.0.0.1:44373_ ] o.a.s.c.CorePropertiesLocator Found core collection1 in /export/home/jenkins/workspace/Lucene-Solr-master-Solaris/solr/build/solr-core/test/J0/../../../../../../../../../../export/home/jenkins/workspace/Lucene-Solr-master-Solaris/solr/build/solr-core/test/J0/temp/solr.cloud.AliasIntegrationTest_4F5F7943788FF4A5-001/control-001/cores/collection1
[junit4] 2> 1888192 INFO (TEST-AliasIntegrationTest.test-seed#[4F5F7943788FF4A5]) [n:127.0.0.1:44373_ ] o.a.s.c.CorePropertiesLocator Found 1 core definitions
[junit4] 2> 1888193 INFO (coreLoadExecutor-7914-thread-1-processing-n:127.0.0.1:44373_) [n:127.0.0.1:44373_ c:control_collection x:collection1] o.a.s.c.ZkController publishing state=down
[junit4] 2> 1888193 INFO (coreLoadExecutor-7914-thread-1-processing-n:127.0.0.1:44373_) [n:127.0.0.1:44373_ c:control_collection x:collection1] o.a.s.c.ZkController numShards not found on descriptor - reading it from system property
[junit4] 2> 1888193 INFO (TEST-AliasIntegrationTest.test-seed#[4F5F7943788FF4A5]) [n:127.0.0.1:44373_ ] o.a.s.s.SolrDispatchFilter user.dir=/export/home/jenkins/workspace/Lucene-Solr-master-Solaris/solr/build/solr-core/test/J0
[junit4] 2> 1888193 INFO (TEST-AliasIntegrationTest.test-seed#[4F5F7943788FF4A5]) [n:127.0.0.1:44373_ ] o.a.s.s.SolrDispatchFilter SolrDispatchFilter.init() done
[junit4] 2> 1888194 INFO (coreLoadExecutor-7914-thread-1-processing-n:127.0.0.1:44373_) [n:127.0.0.1:44373_ c:control_collection x:collection1] o.a.s.c.ZkController Collection control_collection not visible yet, but flagging it so a watch is registered when it becomes visible
[junit4] 2> 1888195 INFO (OverseerStateUpdate-96310210187362308-127.0.0.1:44373_-n_0000000000) [n:127.0.0.1:44373_ ] o.a.s.c.Overseer processMessage: queueSize: 1, message = {
[junit4] 2> "core":"collection1",
[junit4] 2> "roles":null,
[junit4] 2> "base_url":"http://127.0.0.1:44373",
[junit4] 2> "node_name":"127.0.0.1:44373_",
[junit4] 2> "numShards":"1",
[junit4] 2> "state":"down",
[junit4] 2> "shard":null,
[junit4] 2> "collection":"control_collection",
[junit4] 2> "operation":"state"} current state version: 0
[junit4] 2> 1888195 INFO (OverseerStateUpdate-96310210187362308-127.0.0.1:44373_-n_0000000000) [n:127.0.0.1:44373_ ] o.a.s.c.o.ReplicaMutator Update state numShards=1 message={
[junit4] 2> "core":"collection1",
[junit4] 2> "roles":null,
[junit4] 2> "base_url":"http://127.0.0.1:44373",
[junit4] 2> "node_name":"127.0.0.1:44373_",
[junit4] 2> "numShards":"1",
[junit4] 2> "state":"down",
[junit4] 2> "shard":null,
[junit4] 2> "collection":"control_collection",
[junit4] 2> "operation":"state"}
[junit4] 2> 1888195 INFO (coreLoadExecutor-7914-thread-1-processing-n:127.0.0.1:44373_) [n:127.0.0.1:44373_ c:control_collection x:collection1] o.a.s.c.c.ZkStateReader Deleting data for [control_collection]
[junit4] 2> 1888196 INFO (OverseerStateUpdate-96310210187362308-127.0.0.1:44373_-n_0000000000) [n:127.0.0.1:44373_ ] o.a.s.c.o.ClusterStateMutator building a new cName: control_collection
[junit4] 2> 1888197 INFO (OverseerStateUpdate-96310210187362308-127.0.0.1:44373_-n_0000000000) [n:127.0.0.1:44373_ ] o.a.s.c.o.ReplicaMutator Assigning new node to shard shard=shard1
[junit4] 2> 1888198 INFO (coreLoadExecutor-7914-thread-1-processing-n:127.0.0.1:44373_) [n:127.0.0.1:44373_ c:control_collection x:collection1] o.a.s.c.ZkController look for our core node name
[junit4] 2> 1888199 INFO (zkCallback-2659-thread-1-processing-n:127.0.0.1:44373_) [n:127.0.0.1:44373_ ] o.a.s.c.c.ZkStateReader A cluster state change: [WatchedEvent state:SyncConnected type:NodeDataChanged path:/clusterstate.json], has occurred - updating... (live nodes size: [1])
[junit4] 2> 1889202 INFO (coreLoadExecutor-7914-thread-1-processing-n:127.0.0.1:44373_) [n:127.0.0.1:44373_ c:control_collection x:collection1] o.a.s.c.ZkController waiting to find shard id in clusterstate for collection1
[junit4] 2> 1889202 INFO (coreLoadExecutor-7914-thread-1-processing-n:127.0.0.1:44373_) [n:127.0.0.1:44373_ c:control_collection x:collection1] o.a.s.c.ZkController Check for collection zkNode:control_collection
[junit4] 2> 1889203 INFO (coreLoadExecutor-7914-thread-1-processing-n:127.0.0.1:44373_) [n:127.0.0.1:44373_ c:control_collection x:collection1] o.a.s.c.ZkController Collection zkNode exists
[junit4] 2> 1889203 INFO (coreLoadExecutor-7914-thread-1-processing-n:127.0.0.1:44373_) [n:127.0.0.1:44373_ c:control_collection x:collection1] o.a.s.c.c.ZkStateReader Load collection config from: [/collections/control_collection]
[junit4] 2> 1889204 INFO (coreLoadExecutor-7914-thread-1-processing-n:127.0.0.1:44373_) [n:127.0.0.1:44373_ c:control_collection x:collection1] o.a.s.c.c.ZkStateReader path=[/collections/control_collection] [configName]=[conf1] specified config exists in ZooKeeper
[junit4] 2> 1889205 INFO (coreLoadExecutor-7914-thread-1-processing-n:127.0.0.1:44373_) [n:127.0.0.1:44373_ c:control_collection x:collection1] o.a.s.c.SolrResourceLoader new SolrResourceLoader for directory: '/export/home/jenkins/workspace/Lucene-Solr-master-Solaris/solr/build/solr-core/test/J0/temp/solr.cloud.AliasIntegrationTest_4F5F7943788FF4A5-001/control-001/cores/collection1'
[junit4] 2> 1889205 INFO (coreLoadExecutor-7914-thread-1-processing-n:127.0.0.1:44373_) [n:127.0.0.1:44373_ c:control_collection x:collection1] o.a.s.c.SolrResourceLoader JNDI not configured for solr (NoInitialContextEx)
[junit4] 2> 1889205 INFO (coreLoadExecutor-7914-thread-1-processing-n:127.0.0.1:44373_) [n:127.0.0.1:44373_ c:control_collection x:collection1] o.a.s.c.SolrResourceLoader solr home defaulted to 'solr/' (could not find system property or JNDI)
[junit4] 2> 1889207 INFO (coreLoadExecutor-7914-thread-1-processing-n:127.0.0.1:44373_) [n:127.0.0.1:44373_ c:control_collection x:collection1] o.a.s.c.Config loaded config solrconfig.xml with version 0
[junit4] 2> 1889212 INFO (coreLoadExecutor-7914-thread-1-processing-n:127.0.0.1:44373_) [n:127.0.0.1:44373_ c:control_collection x:collection1] o.a.s.c.SolrConfig current version of requestparams : -1
[junit4] 2> 1889216 INFO (coreLoadExecutor-7914-thread-1-processing-n:127.0.0.1:44373_) [n:127.0.0.1:44373_ c:control_collection x:collection1] o.a.s.c.SolrConfig Using Lucene MatchVersion: 7.0.0
[junit4] 2> 1889223 INFO (coreLoadExecutor-7914-thread-1-processing-n:127.0.0.1:44373_) [n:127.0.0.1:44373_ c:control_collection x:collection1] o.a.s.c.SolrConfig Loaded SolrConfig: solrconfig.xml
[junit4] 2> 1889228 INFO (coreLoadExecutor-7914-thread-1-processing-n:127.0.0.1:44373_) [n:127.0.0.1:44373_ c:control_collection x:collection1] o.a.s.s.IndexSchema [collection1] Schema name=test
[junit4] 2> 1889297 INFO (coreLoadExecutor-7914-thread-1-processing-n:127.0.0.1:44373_) [n:127.0.0.1:44373_ c:control_collection x:collection1] o.a.s.s.OpenExchangeRatesOrgProvider Initialized with rates=open-exchange-rates.json, refreshInterval=1440.
[junit4] 2> 1889303 INFO (coreLoadExecutor-7914-thread-1-processing-n:127.0.0.1:44373_) [n:127.0.0.1:44373_ c:control_collection x:collection1] o.a.s.s.IndexSchema default search field in schema is text
[junit4] 2> 1889304 INFO (coreLoadExecutor-7914-thread-1-processing-n:127.0.0.1:44373_) [n:127.0.0.1:44373_ c:control_collection x:collection1] o.a.s.s.IndexSchema unique key field: id
[junit4] 2> 1889316 INFO (coreLoadExecutor-7914-thread-1-processing-n:127.0.0.1:44373_) [n:127.0.0.1:44373_ c:control_collection x:collection1] o.a.s.s.FileExchangeRateProvider Reloading exchange rates from file currency.xml
[junit4] 2> 1889319 INFO (coreLoadExecutor-7914-thread-1-processing-n:127.0.0.1:44373_) [n:127.0.0.1:44373_ c:control_collection x:collection1] o.a.s.s.FileExchangeRateProvider Reloading exchange rates from file currency.xml
[junit4] 2> 1889321 INFO (coreLoadExecutor-7914-thread-1-processing-n:127.0.0.1:44373_) [n:127.0.0.1:44373_ c:control_collection x:collection1] o.a.s.s.OpenExchangeRatesOrgProvider Reloading exchange rates from open-exchange-rates.json
[junit4] 2> 1889322 INFO (coreLoadExecutor-7914-thread-1-processing-n:127.0.0.1:44373_) [n:127.0.0.1:44373_ c:control_collection x:collection1] o.a.s.s.OpenExchangeRatesOrgProvider Reloading exchange rates from open-exchange-rates.json
[junit4] 2> 1889324 INFO (coreLoadExecutor-7914-thread-1-processing-n:127.0.0.1:44373_) [n:127.0.0.1:44373_ c:control_collection x:collection1] o.a.s.c.ConfigSetProperties Did not find ConfigSet properties, assuming default properties: Can't find resource 'configsetprops.json' in classpath or '/configs/conf1', cwd=/export/home/jenkins/workspace/Lucene-Solr-master-Solaris/solr/build/solr-core/test/J0
[junit4] 2> 1889324 INFO (coreLoadExecutor-7914-thread-1-processing-n:127.0.0.1:44373_) [n:127.0.0.1:44373_ c:control_collection x:collection1] o.a.s.c.CoreContainer Creating SolrCore 'collection1' using configuration from collection control_collection
[junit4] 2> 1889324 INFO (coreLoadExecutor-7914-thread-1-processing-n:127.0.0.1:44373_) [n:127.0.0.1:44373_ c:control_collection s:shard1 r:core_node1 x:collection1] o.a.s.c.SolrCore org.apache.solr.core.MockDirectoryFactory
[junit4] 2> 1889325 INFO (coreLoadExecutor-7914-thread-1-processing-n:127.0.0.1:44373_) [n:127.0.0.1:44373_ c:control_collection s:shard1 r:core_node1 x:collection1] o.a.s.c.SolrCore [[collection1] ] Opening new SolrCore at [/export/home/jenkins/workspace/Lucene-Solr-master-Solaris/solr/build/solr-core/test/J0/temp/solr.cloud.AliasIntegrationTest_4F5F7943788FF4A5-001/control-001/cores/collection1], dataDir=[/export/home/jenkins/workspace/Lucene-Solr-master-Solaris/solr/build/solr-core/test/J0/../../../../../../../../../../export/home/jenkins/workspace/Lucene-Solr-master-Solaris/solr/build/solr-core/test/J0/temp/solr.cloud.AliasIntegrationTest_4F5F7943788FF4A5-001/control-001/cores/collection1/data/]
[junit4] 2> 1889325 INFO (coreLoadExecutor-7914-thread-1-processing-n:127.0.0.1:44373_) [n:127.0.0.1:44373_ c:control_collection s:shard1 r:core_node1 x:collection1] o.a.s.c.JmxMonitoredMap JMX monitoring is enabled. Adding Solr mbeans to JMX Server: com.sun.jmx.mbeanserver.JmxMBeanServer@7bf1a223
[junit4] 2> 1889325 INFO (coreLoadExecutor-7914-thread-1-processing-n:127.0.0.1:44373_) [n:127.0.0.1:44373_ c:control_collection s:shard1 r:core_node1 x:collection1] o.a.s.c.CachingDirectoryFactory return new directory for /export/home/jenkins/workspace/Lucene-Solr-master-Solaris/solr/build/solr-core/test/J0/../../../../../../../../../../export/home/jenkins/workspace/Lucene-Solr-master-Solaris/solr/build/solr-core/test/J0/temp/solr.cloud.AliasIntegrationTest_4F5F7943788FF4A5-001/control-001/cores/collection1/data
[junit4] 2> 1889325 INFO (coreLoadExecutor-7914-thread-1-processing-n:127.0.0.1:44373_) [n:127.0.0.1:44373_ c:control_collection s:shard1 r:core_node1 x:collection1] o.a.s.c.SolrCore New index directory detected: old=null new=/export/home/jenkins/workspace/Lucene-Solr-master-Solaris/solr/build/solr-core/test/J0/../../../../../../../../../../export/home/jenkins/workspace/Lucene-Solr-master-Solaris/solr/build/solr-core/test/J0/temp/solr.cloud.AliasIntegrationTest_4F5F7943788FF4A5-001/control-001/cores/collection1/data/index/
[junit4] 2> 1889325 WARN (coreLoadExecutor-7914-thread-1-processing-n:127.0.0.1:44373_) [n:127.0.0.1:44373_ c:control_collection s:shard1 r:core_node1 x:collection1] o.a.s.c.SolrCore [collection1] Solr index directory '/export/home/jenkins/workspace/Lucene-Solr-master-Solaris/solr/build/solr-core/test/J0/../../../../../../../../../../export/home/jenkins/workspace/Lucene-Solr-master-Solaris/solr/build/solr-core/test/J0/temp/solr.cloud.AliasIntegrationTest_4F5F7943788FF4A5-001/control-001/cores/collection1/data/index' doesn't exist. Creating new index...
[junit4] 2> 1889325 INFO (coreLoadExecutor-7914-thread-1-processing-n:127.0.0.1:44373_) [n:127.0.0.1:44373_ c:control_collection s:shard1 r:core_node1 x:collection1] o.a.s.c.CachingDirectoryFactory return new directory for /export/home/jenkins/workspace/Lucene-Solr-master-Solaris/solr/build/solr-core/test/J0/../../../../../../../../../../export/home/jenkins/workspace/Lucene-Solr-master-Solaris/solr/build/solr-core/test/J0/temp/solr.cloud.AliasIntegrationTest_4F5F7943788FF4A5-001/control-001/cores/collection1/data/index
[junit4] 2> 1889325 INFO (coreLoadExecutor-7914-thread-1-processing-n:127.0.0.1:44373_) [n:127.0.0.1:44373_ c:control_collection s:shard1 r:core_node1 x:collection1] o.a.s.u.RandomMergePolicy RandomMergePolicy wrapping class org.apache.lucene.index.LogDocMergePolicy: [LogDocMergePolicy: minMergeSize=1000, mergeFactor=46, maxMergeSize=9223372036854775807, maxMergeSizeForForcedMerge=9223372036854775807, calibrateSizeByDeletes=false, maxMergeDocs=2147483647, maxCFSSegmentSizeMB=8.796093022207999E12, noCFSRatio=1.0]
[junit4] 2> 1889326 INFO (coreLoadExecutor-7914-thread-1-processing-n:127.0.0.1:44373_) [n:127.0.0.1:44373_ c:control_collection s:shard1 r:core_node1 x:collection1] o.a.s.c.SolrDeletionPolicy SolrDeletionPolicy.onCommit: commits: num=1
[junit4] 2> commit{dir=MockDirectoryWrapper(RAMDirectory@7a911b0b lockFactory=org.apache.lucene.store.SingleInstanceLockFactory@329d8d2f),segFN=segments_1,generation=1}
[junit4] 2> 1889326 INFO (coreLoadExecutor-7914-thread-1-processing-n:127.0.0.1:44373_) [n:127.0.0.1:44373_ c:control_collection s:shard1 r:core_node1 x:collection1] o.a.s.c.SolrDeletionPolicy newest commit generation = 1
[junit4] 2> 1889326 INFO (OldIndexDirectoryCleanupThreadForCore-collection1) [n:127.0.0.1:44373_ c:control_collection s:shard1 r:core_node1 x:collection1] o.a.s.c.SolrCore Looking for old index directories to cleanup for core collection1 in /export/home/jenkins/workspace/Lucene-Solr-master-Solaris/solr/build/solr-core/test/J0/../../../../../../../../../../export/home/jenkins/workspace/Lucene-Solr-master-Solaris/solr/build/solr-core/test/J0/temp/solr.cloud.AliasIntegrationTest_4F5F7943788FF4A5-001/control-001/cores/collection1/data/
[junit4] 2> 1889327 WARN (OldIndexDirectoryCleanupThreadForCore-collection1) [n:127.0.0.1:44373_ c:control_collection s:shard1 r:core_node1 x:collection1] o.a.s.c.DirectoryFactory /export/home/jenkins/workspace/Lucene-Solr-master-Solaris/solr/build/solr-core/test/J0/../../../../../../../../../../export/home/jenkins/workspace/Lucene-Solr-master-Solaris/solr/build/solr-core/test/J0/temp/solr.cloud.AliasIntegrationTest_4F5F7943788FF4A5-001/control-001/cores/collection1/data/ does not point to a valid data directory; skipping clean-up of old index directories.
[junit4] 2> 1889329 INFO (coreLoadExecutor-7914-thread-1-processing-n:127.0.0.1:44373_) [n:127.0.0.1:44373_ c:control_collection s:shard1 r:core_node1 x:collection1] o.a.s.u.p.UpdateRequestProcessorChain creating updateRequestProcessorChain "nodistrib"
[junit4] 2> 1889329 INFO (coreLoadExecutor-7914-thread-1-processing-n:127.0.0.1:44373_) [n:127.0.0.1:44373_ c:control_collection s:shard1 r:core_node1 x:collection1] o.a.s.u.p.UpdateRequestProcessorChain creating updateRequestProcessorChain "dedupe"
[junit4] 2> 1889329 INFO (coreLoadExecutor-7914-thread-1-processing-n:127.0.0.1:44373_) [n:127.0.0.1:44373_ c:control_collection s:shard1 r:core_node1 x:collection1] o.a.s.u.p.UpdateRequestProcessorChain inserting DistributedUpdateProcessorFactory into updateRequestProcessorChain "dedupe"
[junit4] 2> 1889329 INFO (coreLoadExecutor-7914-thread-1-processing-n:127.0.0.1:44373_) [n:127.0.0.1:44373_ c:control_collection s:shard1 r:core_node1 x:collection1] o.a.s.u.p.UpdateRequestProcessorChain creating updateRequestProcessorChain "stored_sig"
[junit4] 2> 1889330 INFO (coreLoadExecutor-7914-thread-1-processing-n:127.0.0.1:44373_) [n:127.0.0.1:44373_ c:control_collection s:shard1 r:core_node1 x:collection1] o.a.s.u.p.UpdateRequestProcessorChain inserting DistributedUpdateProcessorFactory into updateRequestProcessorChain "stored_sig"
[junit4] 2> 1889330 INFO (coreLoadExecutor-7914-thread-1-processing-n:127.0.0.1:44373_) [n:127.0.0.1:44373_ c:control_collection s:shard1 r:core_node1 x:collection1] o.a.s.u.p.UpdateRequestProcessorChain creating updateRequestProcessorChain "distrib-dup-test-chain-explicit"
[junit4] 2> 1889330 INFO (coreLoadExecutor-7914-thread-1-processing-n:127.0.0.1:44373_) [n:127.0.0.1:44373_ c:control_collection s:shard1 r:core_node1 x:collection1] o.a.s.u.p.UpdateRequestProcessorChain creating updateRequestProcessorChain "distrib-dup-test-chain-implicit"
[junit4] 2> 1889330 INFO (coreLoadExecutor-7914-thread-1-processing-n:127.0.0.1:44373_) [n:127.0.0.1:44373_ c:control_collection s:shard1 r:core_node1 x:collection1] o.a.s.u.p.UpdateRequestProcessorChain inserting DistributedUpdateProcessorFactory into updateRequestProcessorChain "distrib-dup-test-chain-implicit"
[junit4] 2> 1889330 INFO (coreLoadExecutor-7914-thread-1-processing-n:127.0.0.1:44373_) [n:127.0.0.1:44373_ c:control_collection s:shard1 r:core_node1 x:collection1] o.a.s.c.SolrCore no updateRequestProcessorChain defined as default, creating implicit default
[junit4] 2> 1889330 WARN (coreLoadExecutor-7914-thread-1-processing-n:127.0.0.1:44373_) [n:127.0.0.1:44373_ c:control_collection s:shard1 r:core_node1 x:collection1] o.a.s.c.RequestHandlers INVALID paramSet a in requestHandler {type = requestHandler,name = /dump,class = DumpRequestHandler,args = {defaults={a=A,b=B}}}
[junit4] 2> 1889331 INFO (coreLoadExecutor-7914-thread-1-processing-n:127.0.0.1:44373_) [n:127.0.0.1:44373_ c:control_collection s:shard1 r:core_node1 x:collection1] o.a.s.h.l.XMLLoader xsltCacheLifetimeSeconds=60
[junit4] 2> 1889333 INFO (coreLoadExecutor-7914-thread-1-processing-n:127.0.0.1:44373_) [n:127.0.0.1:44373_ c:control_collection s:shard1 r:core_node1 x:collection1] o.a.s.h.l.XMLLoader xsltCacheLifetimeSeconds=60
[junit4] 2> 1889334 INFO (coreLoadExecutor-7914-thread-1-processing-n:127.0.0.1:44373_) [n:127.0.0.1:44373_ c:control_collection s:shard1 r:core_node1 x:collection1] o.a.s.h.l.XMLLoader xsltCacheLifetimeSeconds=60
[junit4] 2> 1889334 INFO (coreLoadExecutor-7914-thread-1-processing-n:127.0.0.1:44373_) [n:127.0.0.1:44373_ c:control_collection s:shard1 r:core_node1 x:collection1] o.a.s.h.l.XMLLoader xsltCacheLifetimeSeconds=60
[junit4] 2> 1889338 INFO (coreLoadExecutor-7914-thread-1-processing-n:127.0.0.1:44373_) [n:127.0.0.1:44373_ c:control_collection s:shard1 r:core_node1 x:collection1] o.a.s.c.RequestHandlers Registered paths: /admin/mbeans,standard,/update/json/docs,/admin/luke,/export,/get,/admin/properties,/update/json,/admin/threads,/dump,/update/csv,/sql,/graph,/admin/segments,/admin/system,/replication,/config,/stream,/schema,/admin/plugins,/admin/logging,/admin/ping,/update,/admin/file,/terms
[junit4] 2> 1889338 INFO (coreLoadExecutor-7914-thread-1-processing-n:127.0.0.1:44373_) [n:127.0.0.1:44373_ c:control_collection s:shard1 r:core_node1 x:collection1] o.a.s.c.SolrCore Using default statsCache cache: org.apache.solr.search.stats.LocalStatsCache
[junit4] 2> 1889338 INFO (coreLoadExecutor-7914-thread-1-processing-n:127.0.0.1:44373_) [n:127.0.0.1:44373_ c:control_collection s:shard1 r:core_node1 x:collection1] o.a.s.u.UpdateHandler Using UpdateLog implementation: org.apache.solr.update.UpdateLog
[junit4] 2> 1889338 INFO (coreLoadExecutor-7914-thread-1-processing-n:127.0.0.1:44373_) [n:127.0.0.1:44373_ c:control_collection s:shard1 r:core_node1 x:collection1] o.a.s.u.UpdateLog Initializing UpdateLog: dataDir= defaultSyncLevel=FLUSH numRecordsToKeep=100 maxNumLogsToKeep=10 numVersionBuckets=65536
[junit4] 2> 1889339 INFO (coreLoadExecutor-7914-thread-1-processing-n:127.0.0.1:44373_) [n:127.0.0.1:44373_ c:control_collection s:shard1 r:core_node1 x:collection1] o.a.s.u.CommitTracker Hard AutoCommit: disabled
[junit4] 2> 1889339 INFO (coreLoadExecutor-7914-thread-1-processing-n:127.0.0.1:44373_) [n:127.0.0.1:44373_ c:control_collection s:shard1 r:core_node1 x:collection1] o.a.s.u.CommitTracker Soft AutoCommit: disabled
[junit4] 2> 1889339 INFO (coreLoadExecutor-7914-thread-1-processing-n:127.0.0.1:44373_) [n:127.0.0.1:44373_ c:control_collection s:shard1 r:core_node1 x:collection1] o.a.s.u.RandomMergePolicy RandomMergePolicy wrapping class org.apache.lucene.index.TieredMergePolicy: [TieredMergePolicy: maxMergeAtOnce=37, maxMergeAtOnceExplicit=15, maxMergedSegmentMB=60.26171875, floorSegmentMB=1.6708984375, forceMergeDeletesPctAllowed=27.489529398658885, segmentsPerTier=41.0, maxCFSSegmentSizeMB=8.796093022207999E12, noCFSRatio=0.0
[junit4] 2> 1889339 INFO (coreLoadExecutor-7914-thread-1-processing-n:127.0.0.1:44373_) [n:127.0.0.1:44373_ c:control_collection s:shard1 r:core_node1 x:collection1] o.a.s.c.SolrDeletionPolicy SolrDeletionPolicy.onInit: commits: num=1
[junit4] 2> commit{dir=MockDirectoryWrapper(RAMDirectory@7a911b0b lockFactory=org.apache.lucene.store.SingleInstanceLockFactory@329d8d2f),segFN=segments_1,generation=1}
[junit4] 2> 1889339 INFO (coreLoadExecutor-7914-thread-1-processing-n:127.0.0.1:44373_) [n:127.0.0.1:44373_ c:control_collection s:shard1 r:core_node1 x:collection1] o.a.s.c.SolrDeletionPolicy newest commit generation = 1
[junit4] 2> 1889339 INFO (coreLoadExecutor-7914-thread-1-processing-n:127.0.0.1:44373_) [n:127.0.0.1:44373_ c:control_collection s:shard1 r:core_node1 x:collection1] o.a.s.s.SolrIndexSearcher Opening [Searcher@6dcd013d[collection1] main]
[junit4] 2> 1889340 INFO (coreLoadExecutor-7914-thread-1-processing-n:127.0.0.1:44373_) [n:127.0.0.1:44373_ c:control_collection s:shard1 r:core_node1 x:collection1] o.a.s.c.c.ZkStateReader Load collection config from: [/collections/control_collection]
[junit4] 2> 1889341 INFO (coreLoadExecutor-7914-thread-1-processing-n:127.0.0.1:44373_) [n:127.0.0.1:44373_ c:control_collection s:shard1 r:core_node1 x:collection1] o.a.s.c.c.ZkStateReader path=[/collections/control_collection] [configName]=[conf1] specified config exists in ZooKeeper
[junit4] 2> 1889341 INFO (coreLoadExecutor-7914-thread-1-processing-n:127.0.0.1:44373_) [n:127.0.0.1:44373_ c:control_collection s:shard1 r:core_node1 x:collection1] o.a.s.r.ManagedResourceStorage Setting up ZooKeeper-based storage for the RestManager with znodeBase: /configs/conf1
[junit4] 2> 1889342 INFO (coreLoadExecutor-7914-thread-1-processing-n:127.0.0.1:44373_) [n:127.0.0.1:44373_ c:control_collection s:shard1 r:core_node1 x:collection1] o.a.s.r.ManagedResourceStorage Configured ZooKeeperStorageIO with znodeBase: /configs/conf1
[junit4] 2> 1889342 INFO (coreLoadExecutor-7914-thread-1-processing-n:127.0.0.1:44373_) [n:127.0.0.1:44373_ c:control_collection s:shard1 r:core_node1 x:collection1] o.a.s.r.RestManager Initializing RestManager with initArgs: {}
[junit4] 2> 1889342 INFO (coreLoadExecutor-7914-thread-1-processing-n:127.0.0.1:44373_) [n:127.0.0.1:44373_ c:control_collection s:shard1 r:core_node1 x:collection1] o.a.s.r.ManagedResourceStorage Reading _rest_managed.json using ZooKeeperStorageIO:path=/configs/conf1
[junit4] 2> 1889342 INFO (coreLoadExecutor-7914-thread-1-processing-n:127.0.0.1:44373_) [n:127.0.0.1:44373_ c:control_collection s:shard1 r:core_node1 x:collection1] o.a.s.r.ManagedResourceStorage No data found for znode /configs/conf1/_rest_managed.json
[junit4] 2> 1889342 INFO (coreLoadExecutor-7914-thread-1-processing-n:127.0.0.1:44373_) [n:127.0.0.1:44373_ c:control_collection s:shard1 r:core_node1 x:collection1] o.a.s.r.ManagedResourceStorage Loaded null at path _rest_managed.json using ZooKeeperStorageIO:path=/configs/conf1
[junit4] 2> 1889342 INFO (coreLoadExecutor-7914-thread-1-processing-n:127.0.0.1:44373_) [n:127.0.0.1:44373_ c:control_collection s:shard1 r:core_node1 x:collection1] o.a.s.r.RestManager Initializing 0 registered ManagedResources
[junit4] 2> 1889342 INFO (coreLoadExecutor-7914-thread-1-processing-n:127.0.0.1:44373_) [n:127.0.0.1:44373_ c:control_collection s:shard1 r:core_node1 x:collection1] o.a.s.h.ReplicationHandler Commits will be reserved for 10000
[junit4] 2> 1889343 INFO (searcherExecutor-7915-thread-1-processing-n:127.0.0.1:44373_ x:collection1 s:shard1 c:control_collection r:core_node1) [n:127.0.0.1:44373_ c:control_collection s:shard1 r:core_node1 x:collection1] o.a.s.c.SolrCore [collection1] Registered new searcher Searcher@6dcd013d[collection1] main{ExitableDirectoryReader(UninvertingDirectoryReader())}
[junit4] 2> 1889343 INFO (coreLoadExecutor-7914-thread-1-processing-n:127.0.0.1:44373_) [n:127.0.0.1:44373_ c:control_collection s:shard1 r:core_node1 x:collection1] o.a.s.u.UpdateLog Looking up max value of version field to seed version buckets
[junit4] 2> 1889343 INFO (coreLoadExecutor-7914-thread-1-processing-n:127.0.0.1:44373_) [n:127.0.0.1:44373_ c:control_collection s:shard1 r:core_node1 x:collection1] o.a.s.u.VersionInfo Refreshing highest value of _version_ for 65536 version buckets from index
[junit4] 2> 1889343 INFO (coreLoadExecutor-7914-thread-1-processing-n:127.0.0.1:44373_) [n:127.0.0.1:44373_ c:control_collection s:shard1 r:core_node1 x:collection1] o.a.s.u.VersionInfo No terms found for _version_, cannot seed version bucket highest value from index
[junit4] 2> 1889343 INFO (coreLoadExecutor-7914-thread-1-processing-n:127.0.0.1:44373_) [n:127.0.0.1:44373_ c:control_collection s:shard1 r:core_node1 x:collection1] o.a.s.u.UpdateLog Could not find max version in index or recent updates, using new clock 1540963364724801536
[junit4] 2> 1889345 INFO (coreLoadExecutor-7914-thread-1-processing-n:127.0.0.1:44373_) [n:127.0.0.1:44373_ c:control_collection s:shard1 r:core_node1 x:collection1] o.a.s.u.UpdateLog Took 2.0ms to seed version buckets with highest version 1540963364724801536
[junit4] 2> 1889345 INFO (coreLoadExecutor-7914-thread-1-processing-n:127.0.0.1:44373_) [n:127.0.0.1:44373_ c:control_collection s:shard1 r:core_node1 x:collection1] o.a.s.c.ZkController watch zkdir /configs/conf1
[junit4] 2> 1889346 INFO (coreLoadExecutor-7914-thread-1-processing-n:127.0.0.1:44373_) [n:127.0.0.1:44373_ c:control_collection s:shard1 r:core_node1 x:collection1] o.a.s.c.CoreContainer registering core: collection1
[junit4] 2> 1889347 INFO (coreZkRegister-7908-thread-1-processing-n:127.0.0.1:44373_ x:collection1 s:shard1 c:control_collection r:core_node1) [n:127.0.0.1:44373_ c:control_collection s:shard1 r:core_node1 x:collection1] o.a.s.c.ZkController Register replica - core:collection1 address:http://127.0.0.1:44373 collection:control_collection shard:shard1
[junit4] 2> 1889348 INFO (coreZkRegister-7908-thread-1-processing-n:127.0.0.1:44373_ x:collection1 s:shard1 c:control_collection r:core_node1) [n:127.0.0.1:44373_ c:control_collection s:shard1 r:core_node1 x:collection1] o.a.s.c.c.SolrZkClient makePath: /collections/control_collection/leader_elect/shard1/election
[junit4] 2> 1889354 INFO (coreZkRegister-7908-thread-1-processing-n:127.0.0.1:44373_ x:collection1 s:shard1 c:control_collection r:core_node1) [n:127.0.0.1:44373_ c:control_collection s:shard1 r:core_node1 x:collection1] o.a.s.c.LeaderElector Joined leadership election with path: /collections/control_collection/leader_elect/shard1/election/96310210187362308-core_node1-n_0000000000
[junit4] 2> 1889354 INFO (coreZkRegister-7908-thread-1-processing-n:127.0.0.1:44373_ x:collection1 s:shard1 c:control_collection r:core_node1) [n:127.0.0.1:44373_ c:control_collection s:shard1 r:core_node1 x:collection1] o.a.s.c.ShardLeaderElectionContext Running the leader process for shard=shard1 and weAreReplacement=false and leaderVoteWait=10000
[junit4] 2> 1889357 INFO (coreZkRegister-7908-thread-1-processing-n:127.0.0.1:44373_ x:collection1 s:shard1 c:control_collection r:core_node1) [n:127.0.0.1:44373_ c:control_collection s:shard1 r:core_node1 x:collection1] o.a.s.c.ShardLeaderElectionContext Enough replicas found to continue.
[junit4] 2> 1889357 INFO (coreZkRegister-7908-thread-1-processing-n:127.0.0.1:44373_ x:collection1 s:shard1 c:control_collection r:core_node1) [n:127.0.0.1:44373_ c:control_collection s:shard1 r:core_node1 x:collection1] o.a.s.c.ShardLeaderElectionContext I may be the new leader - try and sync
[junit4] 2> 1889357 INFO (coreZkRegister-7908-thread-1-processing-n:127.0.0.1:44373_ x:collection1 s:shard1 c:control_collection r:core_node1) [n:127.0.0.1:44373_ c:control_collection s:shard1 r:core_node1 x:collection1] o.a.s.c.SyncStrategy Sync replicas to http://127.0.0.1:44373/collection1/
[junit4] 2> 1889358 INFO (OverseerStateUpdate-96310210187362308-127.0.0.1:44373_-n_0000000000) [n:127.0.0.1:44373_ ] o.a.s.c.Overseer processMessage: queueSize: 1, message = {
[junit4] 2> "operation":"leader",
[junit4] 2> "shard":"shard1",
[junit4] 2> "collection":"control_collection"} current state version: 1
[junit4] 2> 1889358 INFO (coreZkRegister-7908-thread-1-processing-n:127.0.0.1:44373_ x:collection1 s:shard1 c:control_collection r:core_node1) [n:127.0.0.1:44373_ c:control_collection s:shard1 r:core_node1 x:collection1] o.a.s.c.SyncStrategy Sync Success - now sync replicas to me
[junit4] 2> 1889358 INFO (coreZkRegister-7908-thread-1-processing-n:127.0.0.1:44373_ x:collection1 s:shard1 c:control_collection r:core_node1) [n:127.0.0.1:44373_ c:control_collection s:shard1 r:core_node1 x:collection1] o.a.s.c.SyncStrategy http://127.0.0.1:44373/collection1/ has no replicas
[junit4] 2> 1889359 INFO (coreZkRegister-7908-thread-1-processing-n:127.0.0.1:44373_ x:collection1 s:shard1 c:control_collection r:core_node1) [n:127.0.0.1:44373_ c:control_collection s:shard1 r:core_node1 x:collection1] o.a.s.c.c.SolrZkClient makePath: /collections/control_collection/leaders/shard1
[junit4] 2> 1889363 INFO (coreZkRegister-7908-thread-1-processing-n:127.0.0.1:44373_ x:collection1 s:shard1 c:control_collection r:core_node1) [n:127.0.0.1:44373_ c:control_collection s:shard1 r:core_node1 x:collection1] o.a.s.c.ShardLeaderElectionContextBase Creating leader registration node /collections/control_collection/leaders/shard1/leader after winning as /collections/control_collection/leader_elect/shard1/election/96310210187362308-core_node1-n_0000000000
[junit4] 2> 1889365 INFO (coreZkRegister-7908-thread-1-processing-n:127.0.0.1:44373_ x:collection1 s:shard1 c:control_collection r:core_node1) [n:127.0.0.1:44373_ c:control_collection s:shard1 r:core_node1 x:collection1] o.a.s.c.ShardLeaderElectionContext I am the new leader: http://127.0.0.1:44373/collection1/ shard1
[junit4] 2> 1889366 INFO (OverseerStateUpdate-96310210187362308-127.0.0.1:44373_-n_0000000000) [n:127.0.0.1:44373_ ] o.a.s.c.Overseer processMessage: queueSize: 1, message = {
[junit4] 2> "operation":"leader",
[junit4] 2> "shard":"shard1",
[junit4] 2> "collection":"control_collection",
[junit4] 2> "base_url":"http://127.0.0.1:44373",
[junit4] 2> "core":"collection1",
[junit4] 2> "state":"active"} current state version: 1
[junit4] 2> 1889470 INFO (zkCallback-2659-thread-1-processing-n:127.0.0.1:44373_) [n:127.0.0.1:44373_ ] o.a.s.c.c.ZkStateReader A cluster state change: [WatchedEvent state:SyncConnected type:NodeDataChanged path:/clusterstate.json], has occurred - updating... (live nodes size: [1])
[junit4] 2> 1889517 INFO (coreZkRegister-7908-thread-1-processing-n:127.0.0.1:44373_ x:collection1 s:shard1 c:control_collection r:core_node1) [n:127.0.0.1:44373_ c:control_collection s:shard1 r:core_node1 x:collection1] o.a.s.c.ZkController We are http://127.0.0.1:44373/collection1/ and leader is http://127.0.0.1:44373/collection1/
[junit4] 2> 1889517 INFO (coreZkRegister-7908-thread-1-processing-n:127.0.0.1:44373_ x:collection1 s:shard1 c:control_collection r:core_node1) [n:127.0.0.1:44373_ c:control_collection s:shard1 r:core_node1 x:collection1] o.a.s.c.ZkController No LogReplay needed for core=collection1 baseURL=http://127.0.0.1:44373
[junit4] 2> 1889517 INFO (coreZkRegister-7908-thread-1-processing-n:127.0.0.1:44373_ x:collection1 s:shard1 c:control_collection r:core_node1) [n:127.0.0.1:44373_ c:control_collection s:shard1 r:core_node1 x:collection1] o.a.s.c.ZkController I am the leader, no recovery necessary
[junit4] 2> 1889517 INFO (coreZkRegister-7908-thread-1-processing-n:127.0.0.1:44373_ x:collection1 s:shard1 c:control_collection r:core_node1) [n:127.0.0.1:44373_ c:control_collection s:shard1 r:core_node1 x:collection1] o.a.s.c.ZkController publishing state=active
[junit4] 2> 1889517 INFO (coreZkRegister-7908-thread-1-processing-n:127.0.0.1:44373_ x:collection1 s:shard1 c:control_collection r:core_node1) [n:127.0.0.1:44373_ c:control_collection s:shard1 r:core_node1 x:collection1] o.a.s.c.ZkController numShards not found on descriptor - reading it from system property
[junit4] 2> 1889519 INFO (coreZkRegister-7908-thread-1-processing-n:127.0.0.1:44373_ x:collection1 s:shard1 c:control_collection r:core_node1) [n:127.0.0.1:44373_ c:control_collection s:shard1 r:core_node1 x:collection1] o.a.s.c.c.ZkStateReader Checking legacy cluster state for collection control_collection
[junit4] 2> 1889520 INFO (OverseerStateUpdate-96310210187362308-127.0.0.1:44373_-n_0000000000) [n:127.0.0.1:44373_ ] o.a.s.c.Overseer processMessage: queueSize: 1, message = {
[junit4] 2> "core":"collection1",
[junit4] 2> "core_node_name":"core_node1",
[junit4] 2> "roles":null,
[junit4] 2> "base_url":"http://127.0.0.1:44373",
[junit4] 2> "node_name":"127.0.0.1:44373_",
[junit4] 2> "numShards":"1",
[junit4] 2> "state":"active",
[junit4] 2> "shard":"shard1",
[junit4] 2> "collection":"control_collection",
[junit4] 2> "operation":"state"} current state version: 2
[junit4] 2> 1889521 INFO (OverseerStateUpdate-96310210187362308-127.0.0.1:44373_-n_0000000000) [n:127.0.0.1:44373_ ] o.a.s.c.o.ReplicaMutator Update state numShards=1 message={
[junit4] 2> "core":"collection1",
[junit4] 2> "core_node_name":"core_node1",
[junit4] 2> "roles":null,
[junit4] 2> "base_url":"http://127.0.0.1:44373",
[junit4] 2> "node_name":"127.0.0.1:44373_",
[junit4] 2> "numShards":"1",
[junit4] 2> "state":"active",
[junit4] 2> "shard":"shard1",
[junit4] 2> "collection":"control_collection",
[junit4] 2> "operation":"state"}
[junit4] 2> 1889624 INFO (zkCallback-2659-thread-3-processing-n:127.0.0.1:44373_) [n:127.0.0.1:44373_ ] o.a.s.c.c.ZkStateReader A cluster state change: [WatchedEvent state:SyncConnected type:NodeDataChanged path:/clusterstate.json], has occurred - updating... (live nodes size: [1])
[junit4] 2> 1889698 INFO (TEST-AliasIntegrationTest.test-seed#[4F5F7943788FF4A5]) [ ] o.a.s.c.c.SolrZkClient Using default ZkCredentialsProvider
[junit4] 2> 1889698 INFO (TEST-AliasIntegrationTest.test-seed#[4F5F7943788FF4A5]) [ ] o.a.s.c.c.ConnectionManager Waiting for client to connect to ZooKeeper
[junit4] 2> 1889700 INFO (zkCallback-2663-thread-1) [ ] o.a.s.c.c.ConnectionManager Watcher org.apache.solr.common.cloud.ConnectionManager@74475a6e name:ZooKeeperConnection Watcher:127.0.0.1:47749/solr got event WatchedEvent state:SyncConnected type:None path:null path:null type:None
[junit4] 2> 1889700 INFO (TEST-AliasIntegrationTest.test-seed#[4F5F7943788FF4A5]) [ ] o.a.s.c.c.ConnectionManager Client is connected to ZooKeeper
[junit4] 2> 1889701 INFO (TEST-AliasIntegrationTest.test-seed#[4F5F7943788FF4A5]) [ ] o.a.s.c.c.SolrZkClient Using default ZkACLProvider
[junit4] 2> 1889701 INFO (TEST-AliasIntegrationTest.test-seed#[4F5F7943788FF4A5]) [ ] o.a.s.c.c.ZkStateReader Updating cluster state from ZooKeeper...
[junit4] 2> 1889702 INFO (TEST-AliasIntegrationTest.test-seed#[4F5F7943788FF4A5]) [ ] o.a.s.c.c.ZkStateReader Loaded empty cluster properties
[junit4] 2> 1889703 INFO (TEST-AliasIntegrationTest.test-seed#[4F5F7943788FF4A5]) [ ] o.a.s.c.c.ZkStateReader Updated live nodes from ZooKeeper... (0) -> (1)
[junit4] 2> 1889704 INFO (TEST-AliasIntegrationTest.test-seed#[4F5F7943788FF4A5]) [ ] o.a.s.c.ChaosMonkey monkey: init - expire sessions:false cause connection loss:false
[junit4] 2> 1889705 INFO (TEST-AliasIntegrationTest.test-seed#[4F5F7943788FF4A5]) [ ] o.a.s.c.AbstractFullDistribZkTestBase Creating collection1 with stateFormat=2
[junit4] 2> 1889705 INFO (TEST-AliasIntegrationTest.test-seed#[4F5F7943788FF4A5]) [ ] o.a.s.c.c.SolrZkClient Using default ZkCredentialsProvider
[junit4] 2> 1889705 INFO (TEST-AliasIntegrationTest.test-seed#[4F5F7943788FF4A5]) [ ] o.a.s.c.c.ConnectionManager Waiting for client to connect to ZooKeeper
[junit4] 2> 1889706 INFO (zkCallback-2664-thread-1) [ ] o.a.s.c.c.ConnectionManager Watcher org.apache.solr.common.cloud.ConnectionManager@478a5ae7 name:ZooKeeperConnection Watcher:127.0.0.1:47749/solr got event WatchedEvent state:SyncConnected type:None path:null path:null type:None
[junit4] 2> 1889706 INFO (TEST-AliasIntegrationTest.test-seed#[4F5F7943788FF4A5]) [ ] o.a.s.c.c.ConnectionManager Client is connected to ZooKeeper
[junit4] 2> 1889707 INFO (TEST-AliasIntegrationTest.test-seed#[4F5F7943788FF4A5]) [ ] o.a.s.c.c.SolrZkClient Using default ZkACLProvider
[junit4] 2> 1889709 WARN (NIOServerCxn.Factory:0.0.0.0/0.0.0.0:0) [ ] o.a.z.s.NIOServerCnxn caught end of stream exception
[junit4] 2> EndOfStreamException: Unable to read additional data from client sessionid 0x15629a03a760006, likely client has closed socket
[junit4] 2> at org.apache.zookeeper.server.NIOServerCnxn.doIO(NIOServerCnxn.java:228)
[junit4] 2> at org.apache.zookeeper.server.NIOServerCnxnFactory.run(NIOServerCnxnFactory.java:208)
[junit4] 2> at java.lang.Thread.run(Thread.java:745)
[junit4] 2> 1889710 INFO (OverseerStateUpdate-96310210187362308-127.0.0.1:44373_-n_0000000000) [n:127.0.0.1:44373_ ] o.a.s.c.Overseer processMessage: queueSize: 1, message = {
[junit4] 2> "operation":"create",
[junit4] 2> "name":"collection1",
[junit4] 2> "numShards":"1",
[junit4] 2> "stateFormat":"2"} current state version: 3
[junit4] 2> 1889710 INFO (OverseerStateUpdate-96310210187362308-127.0.0.1:44373_-n_0000000000) [n:127.0.0.1:44373_ ] o.a.s.c.o.ClusterStateMutator building a new cName: collection1
[junit4] 2> 1889815 INFO (OverseerStateUpdate-96310210187362308-127.0.0.1:44373_-n_0000000000) [n:127.0.0.1:44373_ ] o.a.s.c.o.ZkStateWriter going to create_collection /collections/collection1/state.json
[junit4] 2> 1889843 INFO (TEST-AliasIntegrationTest.test-seed#[4F5F7943788FF4A5]) [ ] o.a.s.SolrTestCaseJ4 Writing core.properties file to /export/home/jenkins/workspace/Lucene-Solr-master-Solaris/solr/build/solr-core/test/J0/temp/solr.cloud.AliasIntegrationTest_4F5F7943788FF4A5-001/shard-1-001/cores/collection1
[junit4] 2> 1889843 INFO (TEST-AliasIntegrationTest.test-seed#[4F5F7943788FF4A5]) [ ] o.a.s.c.AbstractFullDistribZkTestBase create jetty 1 in directory /export/home/jenkins/workspace/Lucene-Solr-master-Solaris/solr/build/solr-core/test/J0/temp/solr.cloud.AliasIntegrationTest_4F5F7943788FF4A5-001/shard-1-001
[junit4] 2> 1889844 INFO (TEST-AliasIntegrationTest.test-seed#[4F5F7943788FF4A5]) [ ] o.e.j.s.Server jetty-9.3.8.v20160314
[junit4] 2> 1889845 INFO (TEST-AliasIntegrationTest.test-seed#[4F5F7943788FF4A5]) [ ] o.e.j.s.h.ContextHandler Started o.e.j.s.ServletContextHandler@db69354{/,null,AVAILABLE}
[junit4] 2> 1889846 INFO (TEST-AliasIntegrationTest.test-seed#[4F5F7943788FF4A5]) [ ] o.e.j.s.ServerConnector Started ServerConnector@161ab01{HTTP/1.1,[http/1.1]}{127.0.0.1:40088}
[junit4] 2> 1889846 INFO (TEST-AliasIntegrationTest.test-seed#[4F5F7943788FF4A5]) [ ] o.e.j.s.Server Started @1894113ms
[junit4] 2> 1889846 INFO (TEST-AliasIntegrationTest.test-seed#[4F5F7943788FF4A5]) [ ] o.a.s.c.s.e.JettySolrRunner Jetty properties: {solr.data.dir=/export/home/jenkins/workspace/Lucene-Solr-master-Solaris/solr/build/solr-core/test/J0/temp/solr.cloud.AliasIntegrationTest_4F5F7943788FF4A5-001/tempDir-001/jetty1, solrconfig=solrconfig.xml, hostContext=/, hostPort=40088, coreRootDirectory=/export/home/jenkins/workspace/Lucene-Solr-master-Solaris/solr/build/solr-core/test/J0/temp/solr.cloud.AliasIntegrationTest_4F5F7943788FF4A5-001/shard-1-001/cores}
[junit4] 2> 1889846 INFO (TEST-AliasIntegrationTest.test-seed#[4F5F7943788FF4A5]) [ ] o.a.s.s.SolrDispatchFilter SolrDispatchFilter.init(): sun.misc.Launcher$AppClassLoader@6d06d69c
[junit4] 2> 1889846 INFO (TEST-AliasIntegrationTest.test-seed#[4F5F7943788FF4A5]) [ ] o.a.s.c.SolrResourceLoader new SolrResourceLoader for directory: '/export/home/jenkins/workspace/Lucene-Solr-master-Solaris/solr/build/solr-core/test/J0/temp/solr.cloud.AliasIntegrationTest_4F5F7943788FF4A5-001/shard-1-001'
[junit4] 2> 1889846 INFO (TEST-AliasIntegrationTest.test-seed#[4F5F7943788FF4A5]) [ ] o.a.s.c.SolrResourceLoader JNDI not configured for solr (NoInitialContextEx)
[junit4] 2> 1889846 INFO (TEST-AliasIntegrationTest.test-seed#[4F5F7943788FF4A5]) [ ] o.a.s.c.SolrResourceLoader solr home defaulted to 'solr/' (could not find system property or JNDI)
[junit4] 2> 1889846 INFO (TEST-AliasIntegrationTest.test-seed#[4F5F7943788FF4A5]) [ ] o.a.s.c.c.SolrZkClient Using default ZkCredentialsProvider
[junit4] 2> 1889848 INFO (TEST-AliasIntegrationTest.test-seed#[4F5F7943788FF4A5]) [ ] o.a.s.c.c.ConnectionManager Waiting for client to connect to ZooKeeper
[junit4] 2> 1889849 INFO (zkCallback-2665-thread-1) [ ] o.a.s.c.c.ConnectionManager Watcher org.apache.solr.common.cloud.ConnectionManager@1797bc30 name:ZooKeeperConnection Watcher:127.0.0.1:47749/solr got event WatchedEvent state:SyncConnected type:None path:null path:null type:None
[junit4] 2> 1889849 INFO (TEST-AliasIntegrationTest.test-seed#[4F5F7943788FF4A5]) [ ] o.a.s.c.c.ConnectionManager Client is connected to ZooKeeper
[junit4] 2> 1889850 INFO (TEST-AliasIntegrationTest.test-seed#[4F5F7943788FF4A5]) [ ] o.a.s.c.c.SolrZkClient Using default ZkACLProvider
[junit4] 2> 1889851 INFO (TEST-AliasIntegrationTest.test-seed#[4F5F7943788FF4A5]) [ ] o.a.s.s.SolrDispatchFilter Loading solr.xml from SolrHome (not found in ZooKeeper)
[junit4] 2> 1889851 INFO (TEST-AliasIntegrationTest.test-seed#[4F5F7943788FF4A5]) [ ] o.a.s.c.SolrXmlConfig Loading container configuration from /export/home/jenkins/workspace/Lucene-Solr-master-Solaris/solr/build/solr-core/test/J0/temp/solr.cloud.AliasIntegrationTest_4F5F7943788FF4A5-001/shard-1-001/solr.xml
[junit4] 2> 1889855 INFO (TEST-AliasIntegrationTest.test-seed#[4F5F7943788FF4A5]) [ ] o.a.s.c.CorePropertiesLocator Config-defined core root directory: /export/home/jenkins/workspace/Lucene-Solr-master-Solaris/solr/build/solr-core/test/J0/temp/solr.cloud.AliasIntegrationTest_4F5F7943788FF4A5-001/shard-1-001/cores
[junit4] 2> 1889855 INFO (TEST-AliasIntegrationTest.test-seed#[4F5F7943788FF4A5]) [ ] o.a.s.c.CoreContainer New CoreContainer 882871035
[junit4] 2> 1889855 INFO (TEST-AliasIntegrationTest.test-seed#[4F5F7943788FF4A5]) [ ] o.a.s.c.CoreContainer Loading cores into CoreContainer [instanceDir=/export/home/jenkins/workspace/Lucene-Solr-master-Solaris/solr/build/solr-core/test/J0/temp/solr.cloud.AliasIntegrationTest_4F5F7943788FF4A5-001/shard-1-001]
[junit4] 2> 1889856 WARN (TEST-AliasIntegrationTest.test-seed#[4F5F7943788FF4A5]) [ ] o.a.s.c.CoreContainer Couldn't add files from /export/home/jenkins/workspace/Lucene-Solr-master-Solaris/solr/build/solr-core/test/J0/temp/solr.cloud.AliasIntegrationTest_4F5F7943788FF4A5-001/shard-1-001/lib to classpath: /export/home/jenkins/workspace/Lucene-Solr-master-Solaris/solr/build/solr-core/test/J0/temp/solr.cloud.AliasIntegrationTest_4F5F7943788FF4A5-001/shard-1-001/lib
[junit4] 2> 1889856 INFO (TEST-AliasIntegrationTest.test-seed#[4F5F7943788FF4A5]) [ ] o.a.s.h.c.HttpShardHandlerFactory created with socketTimeout : 90000,urlScheme : ,connTimeout : 15000,maxConnectionsPerHost : 20,maxConnections : 10000,corePoolSize : 0,maximumPoolSize : 2147483647,maxThreadIdleTime : 5,sizeOfQueue : -1,fairnessPolicy : false,
[junit4] 2> 1889858 INFO (TEST-AliasIntegrationTest.test-seed#[4F5F7943788FF4A5]) [ ] o.a.s.u.UpdateShardHandler Created UpdateShardHandler HTTP client with params: socketTimeout=340000&connTimeout=45000&maxConnections=100000&maxConnectionsPerHost=100000
[junit4] 2> 1889858 INFO (TEST-AliasIntegrationTest.test-seed#[4F5F7943788FF4A5]) [ ] o.a.s.l.LogWatcher SLF4J impl is org.slf4j.impl.Log4jLoggerFactory
[junit4] 2> 1889858 INFO (TEST-AliasIntegrationTest.test-seed#[4F5F7943788FF4A5]) [ ] o.a.s.l.LogWatcher Registering Log Listener [Log4j (org.slf4j.impl.Log4jLoggerFactory)]
[junit4] 2> 1889858 INFO (TEST-AliasIntegrationTest.test-seed#[4F5F7943788FF4A5]) [ ] o.a.s.c.ZkContainer Zookeeper client=127.0.0.1:47749/solr
[junit4] 2> 1889858 INFO (TEST-AliasIntegrationTest.test-seed#[4F5F7943788FF4A5]) [ ] o.a.s.c.ZkController zkHost includes chroot
[junit4] 2> 1889858 INFO (TEST-AliasIntegrationTest.test-seed#[4F5F7943788FF4A5]) [ ] o.a.s.c.c.SolrZkClient Using default ZkCredentialsProvider
[junit4] 2> 1889859 INFO (TEST-AliasIntegrationTest.test-seed#[4F5F7943788FF4A5]) [ ] o.a.s.c.c.ConnectionManager Waiting for client to connect to ZooKeeper
[junit4] 2> 1889860 INFO (zkCallback-2668-thread-1) [ ] o.a.s.c.c.ConnectionManager Watcher org.apache.solr.common.cloud.ConnectionManager@101a7569 name:ZooKeeperConnection Watcher:127.0.0.1:47749 got event WatchedEvent state:SyncConnected type:None path:null path:null type:None
[junit4] 2> 1889860 INFO (TEST-AliasIntegrationTest.test-seed#[4F5F7943788FF4A5]) [ ] o.a.s.c.c.ConnectionManager Client is connected to ZooKeeper
[junit4] 2> 1889861 INFO (TEST-AliasIntegrationTest.test-seed#[4F5F7943788FF4A5]) [ ] o.a.s.c.c.SolrZkClient Using default ZkACLProvider
[junit4] 2> 1889863 INFO (TEST-AliasIntegrationTest.test-seed#[4F5F7943788FF4A5]) [n:127.0.0.1:40088_ ] o.a.s.c.ZkController Added new OnReconnect listener org.apache.solr.cloud.ZkController$$Lambda$70/1395103966@167a9e19
[junit4] 2> 1889863 INFO (TEST-AliasIntegrationTest.test-seed#[4F5F7943788FF4A5]) [n:127.0.0.1:40088_ ] o.a.s.c.c.ConnectionManager Waiting for client to connect to ZooKeeper
[junit4] 2> 1889864 INFO (zkCallback-2669-thread-1-processing-n:127.0.0.1:40088_) [n:127.0.0.1:40088_ ] o.a.s.c.c.ConnectionManager Watcher org.apache.solr.common.cloud.ConnectionManager@25c2ddd1 name:ZooKeeperConnection Watcher:127.0.0.1:47749/solr got event WatchedEvent state:SyncConnected type:None path:null path:null type:None
[junit4] 2> 1889864 INFO (TEST-AliasIntegrationTest.test-seed#[4F5F7943788FF4A5]) [n:127.0.0.1:40088_ ] o.a.s.c.c.ConnectionManager Client is connected to ZooKeeper
[junit4] 2> 1889874 INFO (TEST-AliasIntegrationTest.test-seed#[4F5F7943788FF4A5]) [n:127.0.0.1:40088_ ] o.a.s.c.c.ZkStateReader Updating cluster state from ZooKeeper...
[junit4] 2> 1889875 INFO (TEST-AliasIntegrationTest.test-seed#[4F5F7943788FF4A5]) [n:127.0.0.1:40088_ ] o.a.s.c.c.ZkStateReader Loaded empty cluster properties
[junit4] 2> 1889876 INFO (TEST-AliasIntegrationTest.test-seed#[4F5F7943788FF4A5]) [n:127.0.0.1:40088_ ] o.a.s.c.c.ZkStateReader Updated live nodes from ZooKeeper... (0) -> (1)
[junit4] 2> 1889881 INFO (TEST-AliasIntegrationTest.test-seed#[4F5F7943788FF4A5]) [n:127.0.0.1:40088_ ] o.a.s.c.Overseer Overseer (id=null) closing
[junit4] 2> 1889882 INFO (TEST-AliasIntegrationTest.test-seed#[4F5F7943788FF4A5]) [n:127.0.0.1:40088_ ] o.a.s.c.LeaderElector Joined leadership election with path: /overseer_elect/election/96310210187362313-127.0.0.1:40088_-n_0000000001
[junit4] 2> 1889883 INFO (TEST-AliasIntegrationTest.test-seed#[4F5F7943788FF4A5]) [n:127.0.0.1:40088_ ] o.a.s.c.LeaderElector Watching path /overseer_elect/election/96310210187362308-127.0.0.1:44373_-n_0000000000 to know if I could be the leader
[junit4] 2> 1889883 INFO (TEST-AliasIntegrationTest.test-seed#[4F5F7943788FF4A5]) [n:127.0.0.1:40088_ ] o.a.s.c.ZkController Publish node=127.0.0.1:40088_ as DOWN
[junit4] 2> 1889885 INFO (TEST-AliasIntegrationTest.test-seed#[4F5F7943788FF4A5]) [n:127.0.0.1:40088_ ] o.a.s.c.ZkController Register node as live in ZooKeeper:/live_nodes/127.0.0.1:40088_
[junit4] 2> 1889885 INFO (TEST-AliasIntegrationTest.test-seed#[4F5F7943788FF4A5]) [n:127.0.0.1:40088_ ] o.a.s.c.c.SolrZkClient makePath: /live_nodes/127.0.0.1:40088_
[junit4] 2> 1889886 INFO (OverseerStateUpdate-96310210187362308-127.0.0.1:44373_-n_0000000000) [n:127.0.0.1:44373_ ] o.a.s.c.Overseer processMessage: queueSize: 1, message = {
[junit4] 2> "operation":"downnode",
[junit4] 2> "node_name":"127.0.0.1:40088_"} current state version: 3
[junit4] 2> 1889886 INFO (OverseerStateUpdate-96310210187362308-127.0.0.1:44373_-n_0000000000) [n:127.0.0.1:44373_ ] o.a.s.c.o.NodeMutator DownNode state invoked for node: 127.0.0.1:40088_
[junit4] 2> 1889888 INFO (zkCallback-2663-thread-1) [ ] o.a.s.c.c.ZkStateReader A live node change: [WatchedEvent state:SyncConnected type:NodeChildrenChanged path:/live_nodes], has occurred - updating... (live nodes size: [1])
[junit4] 2> 1889888 INFO (zkCallback-2659-thread-3-processing-n:127.0.0.1:44373_) [n:127.0.0.1:44373_ ] o.a.s.c.c.ZkStateReader A live node change: [WatchedEvent state:SyncConnected type:NodeChildrenChanged path:/live_nodes], has occurred - updating... (live nodes size: [1])
[junit4] 2> 1889888 INFO (zkCallback-2669-thread-1-processing-n:127.0.0.1:40088_) [n:127.0.0.1:40088_ ] o.a.s.c.c.ZkStateReader A live node change: [WatchedEvent state:SyncConnected type:NodeChildrenChanged path:/live_nodes], has occurred - updating... (live nodes size: [1])
[junit4] 2> 1889889 INFO (zkCallback-2659-thread-2-processing-n:127.0.0.1:44373_) [n:127.0.0.1:44373_ ] o.a.s.c.c.ZkStateReader A cluster state change: [WatchedEvent state:SyncConnected type:NodeDataChanged path:/clusterstate.json], has occurred - updating... (live nodes size: [1])
[junit4] 2> 1889889 INFO (zkCallback-2663-thread-2) [ ] o.a.s.c.c.ZkStateReader A cluster state change: [WatchedEvent state:SyncConnected type:NodeDataChanged path:/clusterstate.json], has occurred - updating... (live nodes size: [1])
[junit4] 2> 1889889 INFO (zkCallback-2659-thread-3-processing-n:127.0.0.1:44373_) [n:127.0.0.1:44373_ ] o.a.s.c.c.ZkStateReader Updated live nodes from ZooKeeper... (1) -> (2)
[junit4] 2> 1889889 INFO (zkCallback-2663-thread-1) [ ] o.a.s.c.c.ZkStateReader Updated live nodes from ZooKeeper... (1) -> (2)
[junit4] 2> 1889890 INFO (zkCallback-2669-thread-1-processing-n:127.0.0.1:40088_) [n:127.0.0.1:40088_ ] o.a.s.c.c.ZkStateReader Updated live nodes from ZooKeeper... (1) -> (2)
[junit4] 2> 1889891 INFO (zkCallback-2669-thread-2-processing-n:127.0.0.1:40088_) [n:127.0.0.1:40088_ ] o.a.s.c.c.ZkStateReader A cluster state change: [WatchedEvent state:SyncConnected type:NodeDataChanged path:/clusterstate.json], has occurred - updating... (live nodes size: [2])
[junit4] 2> 1889914 INFO (TEST-AliasIntegrationTest.test-seed#[4F5F7943788FF4A5]) [n:127.0.0.1:40088_ ] o.a.s.c.CoreContainer Security conf doesn't exist. Skipping setup for authorization module.
[junit4] 2> 1889914 INFO (TEST-AliasIntegrationTest.test-seed#[4F5F7943788FF4A5]) [n:127.0.0.1:40088_ ] o.a.s.c.CoreContainer No authentication plugin used.
[junit4] 2> 1889914 INFO (TEST-AliasIntegrationTest.test-seed#[4F5F7943788FF4A5]) [n:127.0.0.1:40088_ ] o.a.s.c.CorePropertiesLocator Looking for core definitions underneath /export/home/jenkins/workspace/Lucene-Solr-master-Solaris/solr/build/solr-core/test/J0/temp/solr.cloud.AliasIntegrationTest_4F5F7943788FF4A5-001/shard-1-001/cores
[junit4] 2> 1889915 INFO (TEST-AliasIntegrationTest.test-seed#[4F5F7943788FF4A5]) [n:127.0.0.1:40088_ ] o.a.s.c.CoreDescriptor Created CoreDescriptor: {name=collection1, config=solrconfig.xml, transient=false, schema=schema.xml, loadOnStartup=true, configSetProperties=configsetprops.json, collection=collection1, coreNodeName=, dataDir=data/, shard=}
[junit4] 2> 1889915 INFO (TEST-AliasIntegrationTest.test-seed#[4F5F7943788FF4A5]) [n:127.0.0.1:40088_ ] o.a.s.c.CorePropertiesLocator Found core collection1 in /export/home/jenkins/workspace/Lucene-Solr-master-Solaris/solr/build/solr-core/test/J0/temp/solr.cloud.AliasIntegrationTest_4F5F7943788FF4A5-001/shard-1-001/cores/collection1
[junit4] 2> 1889915 INFO (TEST-AliasIntegrationTest.test-seed#[4F5F7943788FF4A5]) [n:127.0.0.1:40088_ ] o.a.s.c.CorePropertiesLocator Found 1 core definitions
[junit4] 2> 1889917 INFO (TEST-AliasIntegrationTest.test-seed#[4F5F7943788FF4A5]) [n:127.0.0.1:40088_ ] o.a.s.s.SolrDispatchFilter user.dir=/export/home/jenkins/workspace/Lucene-Solr-master-Solaris/solr/build/solr-core/test/J0
[junit4] 2> 1889917 INFO (TEST-AliasIntegrationTest.test-seed#[4F5F7943788FF4A5]) [n:127.0.0.1:40088_ ] o.a.s.s.SolrDispatchFilter SolrDispatchFilter.init() done
[junit4] 2> 1889918 INFO (coreLoadExecutor-7925-thread-1-processing-n:127.0.0.1:40088_) [n:127.0.0.1:40088_ c:collection1 x:collection1] o.a.s.c.ZkController publishing state=down
[junit4] 2> 1889918 INFO (coreLoadExecutor-7925-thread-1-processing-n:127.0.0.1:40088_) [n:127.0.0.1:40088_ c:collection1 x:collection1] o.a.s.c.ZkController numShards not found on descriptor - reading it from system property
[junit4] 2> 1889920 INFO (OverseerStateUpdate-96310210187362308-127.0.0.1:44373_-n_0000000000) [n:127.0.0.1:44373_ ] o.a.s.c.Overseer processMessage: queueSize: 1, message = {
[junit4] 2> "core":"collection1",
[junit4] 2> "roles":null,
[junit4] 2> "base_url":"http://127.0.0.1:40088",
[junit4] 2> "node_name":"127.0.0.1:40088_",
[junit4] 2> "numShards":"1",
[junit4] 2> "state":"down",
[junit4] 2> "shard":null,
[junit4] 2> "collection":"collection1",
[junit4] 2> "operation":"state"} current state version: 4
[junit4] 2> 1889920 INFO (coreLoadExecutor-7925-thread-1-processing-n:127.0.0.1:40088_) [n:127.0.0.1:40088_ c:collection1 x:collection1] o.a.s.c.ZkController Registering watch for collection collection1
[junit4] 2> 1889921 INFO (OverseerStateUpdate-96310210187362308-127.0.0.1:44373_-n_0000000000) [n:127.0.0.1:44373_ ] o.a.s.c.o.ReplicaMutator Update state numShards=1 message={
[junit4] 2> "core":"collection1",
[junit4] 2> "roles":null,
[junit4] 2> "base_url":"http://127.0.0.1:40088",
[junit4] 2> "node_name":"127.0.0.1:40088_",
[junit4] 2> "numShards":"1",
[junit4] 2> "state":"down",
[junit4] 2> "shard":null,
[junit4] 2> "collection":"collection1",
[junit4] 2> "operation":"state"}
[junit4] 2> 1889921 INFO (OverseerStateUpdate-96310210187362308-127.0.0.1:44373_-n_0000000000) [n:127.0.0.1:44373_ ] o.a.s.c.o.ReplicaMutator Collection already exists with numShards=1
[junit4] 2> 1889921 INFO (OverseerStateUpdate-96310210187362308-127.0.0.1:44373_-n_0000000000) [n:127.0.0.1:44373_ ] o.a.s.c.o.ReplicaMutator Assigning new node to shard shard=shard1
[junit4] 2> 1889921 INFO (coreLoadExecutor-7925-thread-1-processing-n:127.0.0.1:40088_) [n:127.0.0.1:40088_ c:collection1 x:collection1] o.a.s.c.c.ZkStateReader Add data for [collection1] ver [0]
[junit4] 2> 1889922 INFO (coreLoadExecutor-7925-thread-1-processing-n:127.0.0.1:40088_) [n:127.0.0.1:40088_ c:collection1 x:collection1] o.a.s.c.ZkController look for our core node name
[junit4] 2> 1890024 INFO (OverseerStateUpdate-96310210187362308-127.0.0.1:44373_-n_0000000000) [n:127.0.0.1:44373_ ] o.a.s.c.o.ZkStateWriter going to update_collection /collections/collection1/state.json version: 0
[junit4] 2> 1890025 INFO (zkCallback-2669-thread-2-processing-n:127.0.0.1:40088_) [n:127.0.0.1:40088_ ] o.a.s.c.c.ZkStateReader A cluster state change: [WatchedEvent state:SyncConnected type:NodeDataChanged path:/collections/collection1/state.json] for collection [collection1] has occurred - updating... (live nodes size: [2])
[junit4] 2> 1890026 INFO (zkCallback-2669-thread-2-processing-n:127.0.0.1:40088_) [n:127.0.0.1:40088_ ] o.a.s.c.c.ZkStateReader Updating data for [collection1] from [0] to [1]
[junit4] 2> 1890923 INFO (coreLoadExecutor-7925-thread-1-processing-n:127.0.0.1:40088_) [n:127.0.0.1:40088_ c:collection1 x:collection1] o.a.s.c.ZkController waiting to find shard id in clusterstate for collection1
[junit4] 2> 1890923 INFO (coreLoadExecutor-7925-thread-1-processing-n:127.0.0.1:40088_) [n:127.0.0.1:40088_ c:collection1 x:collection1] o.a.s.c.ZkController Check for collection zkNode:collection1
[junit4] 2> 1890925 INFO (coreLoadExecutor-7925-thread-1-processing-n:127.0.0.1:40088_) [n:127.0.0.1:40088_ c:collection1 x:collection1] o.a.s.c.ZkController Collection zkNode exists
[junit4] 2> 1890925 INFO (coreLoadExecutor-7925-thread-1-processing-n:127.0.0.1:40088_) [n:127.0.0.1:40088_ c:collection1 x:collection1] o.a.s.c.c.ZkStateReader Load collection config from: [/collections/collection1]
[junit4] 2> 1890926 INFO (coreLoadExecutor-7925-thread-1-processing-n:127.0.0.1:40088_) [n:127.0.0.1:40088_ c:collection1 x:collection1] o.a.s.c.c.ZkStateReader path=[/collections/collection1] [configName]=[conf1] specified config exists in ZooKeeper
[junit4] 2> 1890926 INFO (coreLoadExecutor-7925-thread-1-processing-n:127.0.0.1:40088_) [n:127.0.0.1:40088_ c:collection1 x:collection1] o.a.s.c.SolrResourceLoader new SolrResourceLoader for directory: '/export/home/jenkins/workspace/Lucene-Solr-master-Solaris/solr/build/solr-core/test/J0/temp/solr.cloud.AliasIntegrationTest_4F5F7943788FF4A5-001/shard-1-001/cores/collection1'
[junit4] 2> 1890926 INFO (coreLoadExecutor-7925-thread-1-processing-n:127.0.0.1:40088_) [n:127.0.0.1:40088_ c:collection1 x:collection1] o.a.s.c.SolrResourceLoader JNDI not configured for solr (NoInitialContextEx)
[junit4] 2> 1890926 INFO (coreLoadExecutor-7925-thread-1-processing-n:127.0.0.1:40088_) [n:127.0.0.1:40088_ c:collection1 x:collection1] o.a.s.c.SolrResourceLoader solr home defaulted to 'solr/' (could not find system property or JNDI)
[junit4] 2> 1890929 INFO (coreLoadExecutor-7925-thread-1-processing-n:127.0.0.1:40088_) [n:127.0.0.1:40088_ c:collection1 x:collection1] o.a.s.c.Config loaded config solrconfig.xml with version 0
[junit4] 2> 1890934 INFO (coreLoadExecutor-7925-thread-1-processing-n:127.0.0.1:40088_) [n:127.0.0.1:40088_ c:collection1 x:collection1] o.a.s.c.SolrConfig current version of requestparams : -1
[junit4] 2> 1890937 INFO (coreLoadExecutor-7925-thread-1-processing-n:127.0.0.1:40088_) [n:127.0.0.1:40088_ c:collection1 x:collection1] o.a.s.c.SolrConfig Using Lucene MatchVersion: 7.0.0
[junit4] 2> 1890944 INFO (coreLoadExecutor-7925-thread-1-processing-n:127.0.0.1:40088_) [n:127.0.0.1:40088_ c:collection1 x:collection1] o.a.s.c.SolrConfig Loaded SolrConfig: solrconfig.xml
[junit4] 2> 1890949 INFO (coreLoadExecutor-7925-thread-1-processing-n:127.0.0.1:40088_) [n:127.0.0.1:40088_ c:collection1 x:collection1] o.a.s.s.IndexSchema [collection1] Schema name=test
[junit4] 2> 1891082 INFO (coreLoadExecutor-7925-thread-1-processing-n:127.0.0.1:40088_) [n:127.0.0.1:40088_ c:collection1 x:collection1] o.a.s.s.OpenExchangeRatesOrgProvider Initialized with rates=open-exchange-rates.json, refreshInterval=1440.
[...truncated too long message...]
-core/test/J0/temp/solr.cloud.AliasIntegrationTest_4F5F7943788FF4A5-001/shard-3-001/cores/collection1/data
[junit4] 2> 1922236 WARN (zkCallback-2682-thread-7-processing-n:127.0.0.1:40272_) [n:127.0.0.1:40272_ ] o.a.s.c.c.ZkStateReader ZooKeeper watch triggered, but Solr cannot talk to ZK: [KeeperErrorCode = Session expired for /live_nodes]
[junit4] 2> 1922238 INFO (TEST-AliasIntegrationTest.test-seed#[4F5F7943788FF4A5]) [ ] o.e.j.s.ServerConnector Stopped ServerConnector@63e26d5d{HTTP/1.1,[http/1.1]}{127.0.0.1:0}
[junit4] 2> 1922238 INFO (TEST-AliasIntegrationTest.test-seed#[4F5F7943788FF4A5]) [ ] o.e.j.s.h.ContextHandler Stopped o.e.j.s.ServletContextHandler@8284e84{/,null,UNAVAILABLE}
[junit4] 2> 1922243 INFO (TEST-AliasIntegrationTest.test-seed#[4F5F7943788FF4A5]) [ ] o.a.s.c.ZkTestServer connecting to 127.0.0.1:47749 47749
[junit4] 2> 1922395 INFO (Thread-6553) [ ] o.a.s.c.ZkTestServer connecting to 127.0.0.1:47749 47749
[junit4] 2> 1922395 WARN (Thread-6553) [ ] o.a.s.c.ZkTestServer Watch limit violations:
[junit4] 2> Maximum concurrent create/delete watches above limit:
[junit4] 2>
[junit4] 2> 5 /solr/aliases.json
[junit4] 2> 5 /solr/clusterprops.json
[junit4] 2> 4 /solr/security.json
[junit4] 2> 4 /solr/configs/conf1
[junit4] 2>
[junit4] 2> Maximum concurrent data watches above limit:
[junit4] 2>
[junit4] 2> 5 /solr/clusterstate.json
[junit4] 2> 3 /solr/collections/collection1/state.json
[junit4] 2> 2 /solr/collections/collection2/state.json
[junit4] 2>
[junit4] 2> Maximum concurrent children watches above limit:
[junit4] 2>
[junit4] 2> 35 /solr/overseer/queue
[junit4] 2> 32 /solr/overseer/collection-queue-work
[junit4] 2> 14 /solr/overseer/queue-work
[junit4] 2> 5 /solr/live_nodes
[junit4] 2> 5 /solr/collections
[junit4] 2>
[junit4] 2> NOTE: reproduce with: ant test -Dtestcase=AliasIntegrationTest -Dtests.method=test -Dtests.seed=4F5F7943788FF4A5 -Dtests.slow=true -Dtests.locale=el -Dtests.timezone=NZ-CHAT -Dtests.asserts=true -Dtests.file.encoding=UTF-8
[junit4] ERROR 34.7s J0 | AliasIntegrationTest.test <<<
[junit4] > Throwable #1: org.apache.solr.common.SolrException: java.util.concurrent.TimeoutException: Could not connect to ZooKeeper 127.0.0.1:47749/solr within 10000 ms
[junit4] > at __randomizedtesting.SeedInfo.seed([4F5F7943788FF4A5:C70B4699D673995D]:0)
[junit4] > at org.apache.solr.common.cloud.SolrZkClient.<init>(SolrZkClient.java:181)
[junit4] > at org.apache.solr.common.cloud.SolrZkClient.<init>(SolrZkClient.java:115)
[junit4] > at org.apache.solr.common.cloud.SolrZkClient.<init>(SolrZkClient.java:105)
[junit4] > at org.apache.solr.common.cloud.ZkStateReader.<init>(ZkStateReader.java:227)
[junit4] > at org.apache.solr.client.solrj.impl.CloudSolrClient.connect(CloudSolrClient.java:560)
[junit4] > at org.apache.solr.cloud.AbstractFullDistribZkTestBase.getCommonCloudSolrClient(AbstractFullDistribZkTestBase.java:1737)
[junit4] > at org.apache.solr.cloud.AbstractFullDistribZkTestBase.checkCollectionExpectations(AbstractFullDistribZkTestBase.java:1669)
[junit4] > at org.apache.solr.cloud.AbstractFullDistribZkTestBase.checkForCollection(AbstractFullDistribZkTestBase.java:1710)
[junit4] > at org.apache.solr.cloud.AliasIntegrationTest.test(AliasIntegrationTest.java:76)
[junit4] > at org.apache.solr.BaseDistributedSearchTestCase$ShardsRepeatRule$ShardsFixedStatement.callStatement(BaseDistributedSearchTestCase.java:985)
[junit4] > at org.apache.solr.BaseDistributedSearchTestCase$ShardsRepeatRule$ShardsStatement.evaluate(BaseDistributedSearchTestCase.java:960)
[junit4] > at java.lang.Thread.run(Thread.java:745)
[junit4] > Caused by: java.util.concurrent.TimeoutException: Could not connect to ZooKeeper 127.0.0.1:47749/solr within 10000 ms
[junit4] > at org.apache.solr.common.cloud.ConnectionManager.waitForConnected(ConnectionManager.java:235)
[junit4] > at org.apache.solr.common.cloud.SolrZkClient.<init>(SolrZkClient.java:173)
[junit4] > ... 49 more
[junit4] 2> 1922403 INFO (SUITE-AliasIntegrationTest-seed#[4F5F7943788FF4A5]-worker) [ ] o.a.s.SolrTestCaseJ4 ###deleteCore
[junit4] 2> NOTE: leaving temporary files on disk at: /export/home/jenkins/workspace/Lucene-Solr-master-Solaris/solr/build/solr-core/test/J0/temp/solr.cloud.AliasIntegrationTest_4F5F7943788FF4A5-001
[junit4] 2> Jul 26, 2016 11:53:36 PM com.carrotsearch.randomizedtesting.ThreadLeakControl checkThreadLeaks
[junit4] 2> WARNING: Will linger awaiting termination of 1 leaked thread(s).
[junit4] 2> NOTE: test params are: codec=CheapBastard, sim=RandomSimilarity(queryNorm=true): {}, locale=el, timezone=NZ-CHAT
[junit4] 2> NOTE: SunOS 5.11 amd64/Oracle Corporation 1.8.0_92 (64-bit)/cpus=3,threads=1,free=366273488,total=536870912
[junit4] 2> NOTE: All tests run in this JVM: [TimeZoneUtilsTest, TestFilteredDocIdSet, ExternalFileFieldSortTest, OverseerTest, TestSubQueryTransformerCrossCore, TestInitParams, TestConfig, TestSolrConfigHandlerConcurrent, TestDocBasedVersionConstraints, CdcrUpdateLogTest, TestMacros, BlockDirectoryTest, TestGeoJSONResponseWriter, RestartWhileUpdatingTest, TestSearchPerf, CustomCollectionTest, ScriptEngineTest, PathHierarchyTokenizerFactoryTest, TestFieldCacheReopen, DistribJoinFromCollectionTest, CursorPagingTest, DocExpirationUpdateProcessorFactoryTest, DistributedFacetPivotLongTailTest, MoreLikeThisHandlerTest, WrapperMergePolicyFactoryTest, PrimUtilsTest, TestManagedSchemaAPI, TestSizeLimitedDistributedMap, SolrTestCaseJ4Test, HdfsRecoveryZkTest, HdfsDirectoryFactoryTest, RankQueryTest, VMParamsZkACLAndCredentialsProvidersTest, CollectionStateFormat2Test, IndexSchemaTest, TestBlobHandler, AnalysisAfterCoreReloadTest, ConcurrentDeleteAndCreateCollectionTest, TestSchemaVersionResource, TestRandomDVFaceting, TestRequestForwarding, SharedFSAutoReplicaFailoverUtilsTest, TestNoOpRegenerator, SolrRequestParserTest, DocumentAnalysisRequestHandlerTest, JSONWriterTest, BasicDistributedZkTest, URLClassifyProcessorTest, TestPartialUpdateDeduplication, TestSolrFieldCacheMBean, TestCollationFieldDocValues, TestObjectReleaseTracker, PingRequestHandlerTest, TestMaxScoreQueryParser, SolrCoreTest, CoreAdminRequestStatusTest, DeleteShardTest, TestExactStatsCache, TestStressVersions, TestConfigSetImmutable, AddBlockUpdateTest, SolrCLIZkUtilsTest, SystemInfoHandlerTest, TestRebalanceLeaders, UnloadDistributedZkTest, AlternateDirectoryTest, ClassificationUpdateProcessorFactoryTest, TestDownShardTolerantSearch, SpatialHeatmapFacetsTest, TestReloadAndDeleteDocs, TestLazyCores, OverseerTaskQueueTest, TestJmxIntegration, TestRandomFlRTGCloud, TestHdfsCloudBackupRestore, TestImplicitCoreProperties, DateRangeFieldTest, StandardRequestHandlerTest, TestCoreContainer, TestRawResponseWriter, TestCollectionAPI, TestFileDictionaryLookup, SSLMigrationTest, BooleanFieldTest, DisMaxRequestHandlerTest, TestAnalyzedSuggestions, StatelessScriptUpdateProcessorFactoryTest, SpatialFilterTest, TestUpdate, DistributedFacetPivotSmallTest, BlobRepositoryCloudTest, DirectoryFactoryTest, ChaosMonkeyNothingIsSafeTest, TestLRUCache, TestHighlightDedupGrouping, AnalyticsMergeStrategyTest, XmlUpdateRequestHandlerTest, EnumFieldTest, TestSweetSpotSimilarityFactory, PreAnalyzedFieldTest, ZkStateWriterTest, TestChildDocTransformer, SchemaVersionSpecificBehaviorTest, ShardRoutingTest, TestHighFrequencyDictionaryFactory, TestEmbeddedSolrServerConstructors, TestCryptoKeys, TestSSLRandomization, SOLR749Test, TestManagedSynonymFilterFactory, TestDynamicFieldResource, TestFaceting, UUIDUpdateProcessorFallbackTest, TestNonDefinedSimilarityFactory, BJQParserTest, DeleteLastCustomShardedReplicaTest, ReturnFieldsTest, TestManagedResource, ZkCLITest, BadComponentTest, TestDistributedSearch, TestFieldTypeResource, TestScoreJoinQPScore, DistributedVersionInfoTest, TestCustomSort, DistributedQueryComponentCustomSortTest, SimplePostToolTest, TestExpandComponent, TestRestManager, SimpleFacetsTest, TestFieldCacheSort, AssignTest, ZkControllerTest, TestSearcherReuse, PolyFieldTest, DistributedSuggestComponentTest, XsltUpdateRequestHandlerTest, InfoHandlerTest, TestRecoveryHdfs, TestStressLucene, ClusterStateUpdateTest, TestHdfsBackupRestoreCore, SuggestComponentTest, HdfsChaosMonkeySafeLeaderTest, TermsComponentTest, ResponseHeaderTest, OverseerCollectionConfigSetProcessorTest, RuleEngineTest, TestSort, ChaosMonkeySafeLeaderTest, CollectionsAPIDistributedZkTest, SyncSliceTest, TestReplicationHandler, ShardRoutingCustomTest, TestRecovery, TestHashPartitioner, TestRealTimeGet, TestJoin, HardAutoCommitTest, SpellCheckComponentTest, TestGroupingSearch, PeerSyncTest, DirectUpdateHandlerTest, HighlighterTest, CurrencyFieldOpenExchangeTest, DistributedQueryElevationComponentTest, CurrencyFieldXmlFileTest, SolrIndexSplitterTest, TestExtendedDismaxParser, SpellCheckCollatorTest, SuggesterWFSTTest, TestCSVLoader, NoCacheHeaderTest, TestPseudoReturnFields, TestAtomicUpdateErrorCases, TestWordDelimiterFilterFactory, QueryEqualityTest, DefaultValueUpdateProcessorTest, TestRemoteStreaming, DocValuesMultiTest, TestSolrDeletionPolicy1, SolrInfoMBeanTest, DebugComponentTest, IndexBasedSpellCheckerTest, TestSurroundQueryParser, LukeRequestHandlerTest, DirectSolrSpellCheckerTest, FileBasedSpellCheckerTest, TestValueSourceCache, FieldAnalysisRequestHandlerTest, FastVectorHighlighterTest, RegexBoostProcessorTest, TestCollationField, QueryParsingTest, TestPHPSerializedResponseWriter, CSVRequestHandlerTest, TestLFUCache, TestRTGBase, TestCrossCoreJoin, TestCursorMarkWithoutUniqueKey, TestDistributedMissingSort, TestTolerantSearch, AliasIntegrationTest]
[junit4] Completed [450/623 (1!)] on J0 in 35.27s, 1 test, 1 error <<< FAILURES!
[...truncated 60631 lines...]