You are viewing a plain text version of this content. The canonical link for it is here.
Posted to dev@poi.apache.org by Apache Jenkins Server <je...@builds.apache.org> on 2016/05/20 22:19:13 UTC
Build failed in Jenkins: POI-JDK8 #989
See <https://builds.apache.org/job/POI-JDK8/989/changes>
Changes:
[kiwiwings] findbugs fixes
[kiwiwings] fix javadocs
------------------------------------------
Started by an SCM change
[EnvInject] - Loading node environment variables.
Building remotely on ubuntu3 (Ubuntu ubuntu legacy-ubuntu) in workspace <https://builds.apache.org/job/POI-JDK8/ws/>
Updating http://svn.apache.org/repos/asf/poi/trunk at revision '2016-05-20T22:17:50.816 +0000'
AU test-data/slideshow/bug54570.pptx
AU test-data/slideshow/bug58144-headers-footers-2003.ppt
AU test-data/slideshow/bug58144-headers-footers-2007.ppt
AU test-data/slideshow/bug58144-headers-footers-2007.pptx
U src/java/org/apache/poi/ss/formula/Formula.java
U src/java/org/apache/poi/ss/formula/CollaboratingWorkbooksEnvironment.java
U src/java/org/apache/poi/ss/formula/eval/forked/ForkedEvaluationWorkbook.java
U src/java/org/apache/poi/ss/formula/ptg/AreaErrPtg.java
U src/java/org/apache/poi/ss/formula/ptg/RefErrorPtg.java
U src/java/org/apache/poi/ss/formula/ptg/ErrPtg.java
U src/java/org/apache/poi/ss/formula/ptg/DeletedRef3DPtg.java
U src/java/org/apache/poi/ss/formula/ptg/Deleted3DPxg.java
U src/java/org/apache/poi/ss/formula/ptg/DeletedArea3DPtg.java
U src/java/org/apache/poi/ss/formula/ParseNode.java
U src/java/org/apache/poi/ss/formula/constant/ErrorConstant.java
U src/java/org/apache/poi/ss/formula/FormulaCellCacheEntry.java
U src/java/org/apache/poi/ss/formula/FormulaParser.java
U src/java/org/apache/poi/ss/formula/functions/Errortype.java
U src/java/org/apache/poi/ss/util/CellAddress.java
D src/java/org/apache/poi/ss/usermodel/ErrorConstants.java
U src/java/org/apache/poi/ss/usermodel/Comment.java
U src/java/org/apache/poi/hssf/dev/BiffViewer.java
U src/java/org/apache/poi/hssf/record/BoolErrRecord.java
D src/java/org/apache/poi/hssf/usermodel/HSSFErrorConstants.java
U src/java/org/apache/poi/hssf/usermodel/HSSFComment.java
U src/java/org/apache/poi/sl/draw/DrawSimpleShape.java
U src/java/org/apache/poi/sl/draw/DrawPaint.java
U src/java/org/apache/poi/sl/draw/BitmapImageRenderer.java
U src/java/org/apache/poi/sl/draw/ImageRenderer.java
U src/java/org/apache/poi/sl/usermodel/TextParagraph.java
U src/java/org/apache/poi/poifs/crypt/standard/StandardEncryptor.java
U src/java/org/apache/poi/poifs/crypt/ChunkedCipherOutputStream.java
U src/java/org/apache/poi/poifs/storage/HeaderBlock.java
U src/integrationtest/org/apache/poi/TestAllFiles.java
U src/integrationtest/org/apache/poi/stress/XSSFFileHandler.java
A src/integrationtest/commons-logging.properties
A src/integrationtest/log4j.properties
U src/scratchpad/testcases/org/apache/poi/hwpf/model/TestDocumentProperties.java
U src/scratchpad/testcases/org/apache/poi/hwpf/model/TestFileInformationBlock.java
U src/scratchpad/testcases/org/apache/poi/hslf/model/TestHeadersFooters.java
U src/scratchpad/src/org/apache/poi/hslf/record/RecordContainer.java
U src/scratchpad/src/org/apache/poi/hslf/usermodel/HSLFTextParagraph.java
U src/scratchpad/src/org/apache/poi/hslf/usermodel/HSLFSlide.java
U src/scratchpad/src/org/apache/poi/hslf/usermodel/HSLFSlideShow.java
U src/scratchpad/src/org/apache/poi/hslf/model/HeadersFooters.java
U src/scratchpad/src/org/apache/poi/hwmf/draw/HwmfSLImageRenderer.java
U src/scratchpad/src/org/apache/poi/hwpf/model/ListLevel.java
U src/examples/src/org/apache/poi/xssf/usermodel/examples/CellComments.java
U src/examples/src/org/apache/poi/xssf/eventusermodel/examples/FromHowTo.java
U src/examples/src/org/apache/poi/ss/examples/SSPerformanceTest.java
U src/ooxml/testcases/org/apache/poi/xslf/extractor/TestXSLFPowerPointExtractor.java
U src/ooxml/testcases/org/apache/poi/xslf/TestXSLFBugs.java
A src/ooxml/testcases/org/apache/poi/sl/TestHeadersFooters.java
U src/ooxml/testcases/org/apache/poi/poifs/crypt/TestSignatureInfo.java
U src/ooxml/testcases/org/apache/poi/xssf/usermodel/TestXSSFWorkbook.java
U src/ooxml/testcases/org/apache/poi/xssf/usermodel/TestXSSFBugs.java
U src/ooxml/testcases/org/apache/poi/xssf/usermodel/TestXSSFPivotTable.java
A src/ooxml/testcases/org/apache/poi/ss/util
A src/ooxml/testcases/org/apache/poi/ss/util/TestXSSFCellUtil.java
A src/ooxml/testcases/org/apache/poi/ss/util/TestSXSSFCellUtil.java
U src/ooxml/testcases/org/apache/poi/ss/usermodel/BaseTestXCell.java
U src/ooxml/java/org/apache/poi/util/XmlSort.java
U src/ooxml/java/org/apache/poi/util/OOXMLLite.java
U src/ooxml/java/org/apache/poi/POIXMLDocumentPart.java
U src/ooxml/java/org/apache/poi/poifs/crypt/dsig/facets/KeyInfoSignatureFacet.java
U src/ooxml/java/org/apache/poi/poifs/crypt/dsig/KeyInfoKeySelector.java
U src/ooxml/java/org/apache/poi/poifs/crypt/dsig/services/TSPTimeStampService.java
U src/ooxml/java/org/apache/poi/POIXMLTypeLoader.java
U src/ooxml/java/org/apache/poi/xssf/usermodel/XSSFCell.java
U src/ooxml/java/org/apache/poi/xssf/usermodel/XSSFRichTextString.java
U src/ooxml/java/org/apache/poi/xssf/usermodel/XSSFDrawing.java
U src/ooxml/java/org/apache/poi/xssf/usermodel/XSSFComment.java
U src/ooxml/java/org/apache/poi/xssf/usermodel/XSSFPivotTable.java
U src/ooxml/java/org/apache/poi/xssf/streaming/SXSSFRow.java
U src/ooxml/java/org/apache/poi/xssf/streaming/SheetDataWriter.java
U src/ooxml/java/org/apache/poi/xwpf/usermodel/XWPFDocument.java
U src/ooxml/java/org/apache/poi/xwpf/usermodel/XWPFTableRow.java
U src/ooxml/java/org/apache/poi/xwpf/usermodel/XWPFSDTContentCell.java
U src/ooxml/java/org/apache/poi/xwpf/usermodel/XWPFFootnote.java
U src/ooxml/java/org/apache/poi/xwpf/usermodel/XWPFParagraph.java
U src/ooxml/java/org/apache/poi/xwpf/usermodel/XWPFHeaderFooter.java
U src/ooxml/java/org/apache/poi/xwpf/usermodel/XWPFSDTContent.java
U src/ooxml/java/org/apache/poi/xwpf/usermodel/XWPFTableCell.java
U src/ooxml/java/org/apache/poi/POIXMLDocument.java
U src/ooxml/java/org/apache/poi/xslf/util/PPTX2PNG.java
U src/ooxml/java/org/apache/poi/xslf/usermodel/XSLFTextParagraph.java
U src/ooxml/java/org/apache/poi/xslf/usermodel/XSLFSlideShow.java
U src/ooxml/java/org/apache/poi/xslf/usermodel/XMLSlideShow.java
U src/testcases/org/apache/poi/poifs/macros/TestVBAMacroReader.java
U src/testcases/org/apache/poi/POITestCase.java
U src/testcases/org/apache/poi/hssf/record/TestFormulaRecord.java
D src/testcases/org/apache/poi/hssf/usermodel/TestComment.java
U src/testcases/org/apache/poi/hssf/usermodel/AllUserModelTests.java
U src/testcases/org/apache/poi/hssf/usermodel/TestHSSFFormulaEvaluator.java
U src/testcases/org/apache/poi/hssf/usermodel/TestHSSFComment.java
U src/testcases/org/apache/poi/hssf/model/TestFormulaParser.java
U src/testcases/org/apache/poi/ss/usermodel/BaseTestFormulaEvaluator.java
U src/testcases/org/apache/poi/ss/usermodel/BaseTestCellComment.java
U src/testcases/org/apache/poi/ss/usermodel/BaseTestBugzillaIssues.java
U src/testcases/org/apache/poi/ss/formula/functions/TestEOMonth.java
U src/testcases/org/apache/poi/ss/formula/functions/TestFind.java
U src/testcases/org/apache/poi/ss/formula/functions/TestNper.java
U src/testcases/org/apache/poi/ss/formula/functions/TestEDate.java
U src/testcases/org/apache/poi/ss/formula/functions/TestFixed.java
U src/testcases/org/apache/poi/ss/formula/functions/TestPmt.java
U src/testcases/org/apache/poi/ss/formula/eval/forked/TestForkedEvaluator.java
U src/testcases/org/apache/poi/ss/formula/constant/TestConstantValueParser.java
D src/testcases/org/apache/poi/ss/util/TestCellUtil.java
A src/testcases/org/apache/poi/ss/util/BaseTestCellUtil.java
A src/testcases/org/apache/poi/ss/util/TestHSSFCellUtil.java
U build.xml
Fetching 'https://svn.apache.org/repos/asf/poi/site/forrest.properties' at -1 into '/x1/jenkins/jenkins-slave/workspace/POI-JDK8/forrest.properties'
At revision 1744804
Fetching 'https://svn.apache.org/repos/asf/poi/site/src/documentation' at -1 into '/x1/jenkins/jenkins-slave/workspace/POI-JDK8/src/documentation'
U src/documentation/content/xdocs/status.xml
At revision 1744804
At revision 1744804
no change for http://svn.apache.org/repos/asf/poi/site/forrest.properties since the previous build
no change for https://svn.apache.org/repos/asf/poi/site/src/documentation since the previous build
[EnvInject] - Executing scripts and injecting environment variables after the SCM step.
[EnvInject] - Injecting as environment variables the properties content
LANG=en_US.UTF-8
[EnvInject] - Variables injected successfully.
[POI-JDK8] $ /bin/bash -xe /tmp/hudson6985926507674991310.sh
+ svn status
X forrest.properties
X src/documentation
Performing status on external item at 'src/documentation':
+ exit 0
[POI-JDK8] $ /home/jenkins/tools/ant/latest/bin/ant -Dcoverage.enabled=true clean jenkins
Buildfile: /x1/jenkins/jenkins-slave/workspace/POI-JDK8/build.xml
clean:
[delete] Deleting directory /x1/jenkins/jenkins-slave/workspace/POI-JDK8/build
check-jars:
[delete] Deleting /x1/jenkins/jenkins-slave/workspace/POI-JDK8/lib/findbugs-noUpdateChecks-2.0.3.zip
fetch-jars:
check-ooxml-jars:
fetch-ooxml-jars:
init:
[mkdir] Created dir: /x1/jenkins/jenkins-slave/workspace/POI-JDK8/build
[mkdir] Created dir: /x1/jenkins/jenkins-slave/workspace/POI-JDK8/build/classes
[mkdir] Created dir: /x1/jenkins/jenkins-slave/workspace/POI-JDK8/build/test-classes
[mkdir] Created dir: /x1/jenkins/jenkins-slave/workspace/POI-JDK8/build/test-results
[mkdir] Created dir: /x1/jenkins/jenkins-slave/workspace/POI-JDK8/build/scratchpad-classes
[mkdir] Created dir: /x1/jenkins/jenkins-slave/workspace/POI-JDK8/build/scratchpad-test-classes
[mkdir] Created dir: /x1/jenkins/jenkins-slave/workspace/POI-JDK8/build/scratchpad-test-results
[mkdir] Created dir: /x1/jenkins/jenkins-slave/workspace/POI-JDK8/build/geometry-java
[mkdir] Created dir: /x1/jenkins/jenkins-slave/workspace/POI-JDK8/build/ooxml-classes
[mkdir] Created dir: /x1/jenkins/jenkins-slave/workspace/POI-JDK8/build/ooxml-test-classes
[mkdir] Created dir: /x1/jenkins/jenkins-slave/workspace/POI-JDK8/build/ooxml-test-results
[mkdir] Created dir: /x1/jenkins/jenkins-slave/workspace/POI-JDK8/build/excelant-classes
[mkdir] Created dir: /x1/jenkins/jenkins-slave/workspace/POI-JDK8/build/excelant-test-classes
[mkdir] Created dir: /x1/jenkins/jenkins-slave/workspace/POI-JDK8/build/excelant-test-results
[mkdir] Created dir: /x1/jenkins/jenkins-slave/workspace/POI-JDK8/build/examples-classes
[mkdir] Created dir: /x1/jenkins/jenkins-slave/workspace/POI-JDK8/build/integration-test-classes
[mkdir] Created dir: /x1/jenkins/jenkins-slave/workspace/POI-JDK8/build/integration-test-results
[mkdir] Created dir: /x1/jenkins/jenkins-slave/workspace/POI-JDK8/build/dist
[mkdir] Created dir: /x1/jenkins/jenkins-slave/workspace/POI-JDK8/build/tmp/site/build/site
[echo] Using Java: 1.8.0/1.8.0-b132/25.0-b70/Java HotSpot(TM) 64-Bit Server VM from Oracle Corporation on Linux: 3.2.0-101-generic
compile-main:
[javac] Compiling 1192 source files to /x1/jenkins/jenkins-slave/workspace/POI-JDK8/build/classes
[javac] warning: [options] bootstrap class path not set in conjunction with -source 1.6
[javac] Note: Some input files use or override a deprecated API.
[javac] Note: Recompile with -Xlint:deprecation for details.
[javac] Note: /x1/jenkins/jenkins-slave/workspace/POI-JDK8/src/java/org/apache/poi/hpsf/CustomProperties.java uses unchecked or unsafe operations.
[javac] Note: Recompile with -Xlint:unchecked for details.
[javac] 1 warning
[javac] Compiling 523 source files to /x1/jenkins/jenkins-slave/workspace/POI-JDK8/build/test-classes
[javac] warning: [options] bootstrap class path not set in conjunction with -source 1.6
[javac] /x1/jenkins/jenkins-slave/workspace/POI-JDK8/src/testcases/org/apache/poi/ss/formula/AllSSFormulaTests.java:35: error: incompatible types: Class<TestForkedEvaluator> cannot be converted to Class<? extends TestCase>
[javac] result.addTestSuite(TestForkedEvaluator.class);
[javac] ^
[javac] Note: Some input files use or override a deprecated API.
[javac] Note: Recompile with -Xlint:deprecation for details.
[javac] Note: Some input files use unchecked or unsafe operations.
[javac] Note: Recompile with -Xlint:unchecked for details.
[javac] Note: Some messages have been simplified; recompile with -Xdiags:verbose to get full output
[javac] 1 error
[javac] 1 warning
BUILD FAILED
/x1/jenkins/jenkins-slave/workspace/POI-JDK8/build.xml:861: Compile failed; see the compiler error output for details.
Total time: 23 seconds
Build step 'Invoke Ant' marked build as failure
[FINDBUGS] Skipping publisher since build result is FAILURE
[WARNINGS] Skipping publisher since build result is FAILURE
Archiving artifacts
Recording test results
ERROR: Step ?Publish JUnit test result report? failed: No test report files were found. Configuration error?
---------------------------------------------------------------------
To unsubscribe, e-mail: dev-unsubscribe@poi.apache.org
For additional commands, e-mail: dev-help@poi.apache.org
Jenkins build is back to normal : POI-JDK8 #990
Posted by Apache Jenkins Server <je...@builds.apache.org>.
See <https://builds.apache.org/job/POI-JDK8/990/changes>
---------------------------------------------------------------------
To unsubscribe, e-mail: dev-unsubscribe@poi.apache.org
For additional commands, e-mail: dev-help@poi.apache.org