You are viewing a plain text version of this content. The canonical link for it is here.
Posted to notifications@jclouds.apache.org by Apache Jenkins Server <je...@builds.apache.org> on 2024/12/07 18:10:34 UTC
Build failed in Jenkins: JClouds » jclouds-with-credentials » jclouds-compute-delete-all #107
See <https://ci-builds.apache.org/job/JClouds/job/jclouds-with-credentials/job/jclouds-compute-delete-all/107/display/redirect>
Changes:
------------------------------------------
Started by upstream project "JClouds/jclouds-with-credentials/jclouds-packet-live-tests" build number 225
originally caused by:
Started by timer
Running as SYSTEM
No JDK named ‘JDK 1.8.0_144 (unlimited security)’ found
[EnvInject] - Loading node environment variables.
Building remotely on builds48 (tmp-22 ubuntu) in workspace <https://ci-builds.apache.org/job/JClouds/job/jclouds-with-credentials/job/jclouds-compute-delete-all/ws/>
No JDK named ‘JDK 1.8.0_144 (unlimited security)’ found
The recommended git tool is: NONE
No credentials specified
No JDK named ‘JDK 1.8.0_144 (unlimited security)’ found
> git rev-parse --resolve-git-dir <https://ci-builds.apache.org/job/JClouds/job/jclouds-with-credentials/job/jclouds-compute-delete-all/ws/.git> # timeout=10
Fetching changes from the remote Git repository
> git config remote.origin.url https://gitbox.apache.org/repos/asf/karaf-jclouds-cli.git # timeout=10
Fetching upstream changes from https://gitbox.apache.org/repos/asf/karaf-jclouds-cli.git
> git --version # timeout=10
> git --version # 'git version 2.34.1'
> git fetch --tags --force --progress -- https://gitbox.apache.org/repos/asf/karaf-jclouds-cli.git +refs/heads/*:refs/remotes/origin/* # timeout=10
> git rev-parse refs/remotes/origin/master^{commit} # timeout=10
No JDK named ‘JDK 1.8.0_144 (unlimited security)’ found
Checking out Revision fdc566154e25a0d44f8dab5a65ee01da1e78b9be (refs/remotes/origin/master)
> git config core.sparsecheckout # timeout=10
> git checkout -f fdc566154e25a0d44f8dab5a65ee01da1e78b9be # timeout=10
Commit message: "fix typo in project.version"
> git rev-list --no-walk fdc566154e25a0d44f8dab5a65ee01da1e78b9be # timeout=10
No JDK named ‘JDK 1.8.0_144 (unlimited security)’ found
No JDK named ‘JDK 1.8.0_144 (unlimited security)’ found
[EnvInject] - Mask passwords that will be passed as build parameters.
No JDK named ‘JDK 1.8.0_144 (unlimited security)’ found
[jclouds-compute-delete-all] $ mvn clean package
FATAL: command execution failed
java.io.IOException: error=2, No such file or directory
at java.base/java.lang.ProcessImpl.forkAndExec(Native Method)
at java.base/java.lang.ProcessImpl.<init>(ProcessImpl.java:314)
at java.base/java.lang.ProcessImpl.start(ProcessImpl.java:244)
at java.base/java.lang.ProcessBuilder.start(ProcessBuilder.java:1110)
Also: hudson.remoting.Channel$CallSiteStackTrace: Remote call to builds48
at hudson.remoting.Channel.attachCallSiteStackTrace(Channel.java:1923)
at hudson.remoting.UserRequest$ExceptionResponse.retrieve(UserRequest.java:384)
at hudson.remoting.Channel.call(Channel.java:1112)
at hudson.Launcher$RemoteLauncher.launch(Launcher.java:1121)
at hudson.Launcher$ProcStarter.start(Launcher.java:506)
at hudson.Launcher$ProcStarter.join(Launcher.java:517)
at hudson.tasks.Maven.perform(Maven.java:368)
at hudson.tasks.BuildStepMonitor$1.perform(BuildStepMonitor.java:20)
at hudson.model.AbstractBuild$AbstractBuildExecution.perform(AbstractBuild.java:818)
at hudson.model.Build$BuildExecution.build(Build.java:199)
at hudson.model.Build$BuildExecution.doRun(Build.java:164)
at hudson.model.AbstractBuild$AbstractBuildExecution.run(AbstractBuild.java:527)
at hudson.model.Run.execute(Run.java:1833)
at hudson.model.FreeStyleBuild.run(FreeStyleBuild.java:44)
at hudson.model.ResourceController.execute(ResourceController.java:101)
at hudson.model.Executor.run(Executor.java:446)
Caused: java.io.IOException: Cannot run program "mvn" (in directory "<https://ci-builds.apache.org/job/JClouds/job/jclouds-with-credentials/job/jclouds-compute-delete-all/ws/")>: error=2, No such file or directory
at java.base/java.lang.ProcessBuilder.start(ProcessBuilder.java:1143)
at java.base/java.lang.ProcessBuilder.start(ProcessBuilder.java:1073)
at hudson.Proc$LocalProc.<init>(Proc.java:252)
at hudson.Proc$LocalProc.<init>(Proc.java:221)
at hudson.Launcher$LocalLauncher.launch(Launcher.java:994)
at hudson.Launcher$ProcStarter.start(Launcher.java:506)
at hudson.Launcher$RemoteLaunchCallable.call(Launcher.java:1395)
at hudson.Launcher$RemoteLaunchCallable.call(Launcher.java:1337)
at hudson.remoting.UserRequest.perform(UserRequest.java:225)
at hudson.remoting.UserRequest.perform(UserRequest.java:50)
at hudson.remoting.Request$2.run(Request.java:391)
at hudson.remoting.InterceptingExecutorService.lambda$wrap$0(InterceptingExecutorService.java:81)
at java.base/java.util.concurrent.FutureTask.run(FutureTask.java:264)
at java.base/java.util.concurrent.ThreadPoolExecutor.runWorker(ThreadPoolExecutor.java:1136)
at java.base/java.util.concurrent.ThreadPoolExecutor$Worker.run(ThreadPoolExecutor.java:635)
at java.base/java.lang.Thread.run(Thread.java:840)
Build step 'Invoke top-level Maven targets' marked build as failure
No JDK named ‘JDK 1.8.0_144 (unlimited security)’ found
Build failed in Jenkins: JClouds » jclouds-with-credentials » jclouds-compute-delete-all #115
Posted by Apache Jenkins Server <je...@builds.apache.org>.
See <https://ci-builds.apache.org/job/JClouds/job/jclouds-with-credentials/job/jclouds-compute-delete-all/115/display/redirect>
Changes:
------------------------------------------
Started by upstream project "JClouds/jclouds-with-credentials/jclouds-packet-live-tests" build number 233
originally caused by:
Started by timer
Running as SYSTEM
No JDK named ‘JDK 1.8.0_144 (unlimited security)’ found
[EnvInject] - Loading node environment variables.
Building remotely on builds48 (tmp-22 ubuntu) in workspace <https://ci-builds.apache.org/job/JClouds/job/jclouds-with-credentials/job/jclouds-compute-delete-all/ws/>
No JDK named ‘JDK 1.8.0_144 (unlimited security)’ found
The recommended git tool is: NONE
No credentials specified
No JDK named ‘JDK 1.8.0_144 (unlimited security)’ found
> git rev-parse --resolve-git-dir <https://ci-builds.apache.org/job/JClouds/job/jclouds-with-credentials/job/jclouds-compute-delete-all/ws/.git> # timeout=10
Fetching changes from the remote Git repository
> git config remote.origin.url https://gitbox.apache.org/repos/asf/karaf-jclouds-cli.git # timeout=10
Fetching upstream changes from https://gitbox.apache.org/repos/asf/karaf-jclouds-cli.git
> git --version # timeout=10
> git --version # 'git version 2.34.1'
> git fetch --tags --force --progress -- https://gitbox.apache.org/repos/asf/karaf-jclouds-cli.git +refs/heads/*:refs/remotes/origin/* # timeout=10
> git rev-parse refs/remotes/origin/master^{commit} # timeout=10
No JDK named ‘JDK 1.8.0_144 (unlimited security)’ found
Checking out Revision fdc566154e25a0d44f8dab5a65ee01da1e78b9be (refs/remotes/origin/master)
> git config core.sparsecheckout # timeout=10
> git checkout -f fdc566154e25a0d44f8dab5a65ee01da1e78b9be # timeout=10
Commit message: "fix typo in project.version"
> git rev-list --no-walk fdc566154e25a0d44f8dab5a65ee01da1e78b9be # timeout=10
No JDK named ‘JDK 1.8.0_144 (unlimited security)’ found
No JDK named ‘JDK 1.8.0_144 (unlimited security)’ found
[EnvInject] - Mask passwords that will be passed as build parameters.
No JDK named ‘JDK 1.8.0_144 (unlimited security)’ found
[jclouds-compute-delete-all] $ mvn clean package
FATAL: command execution failed
java.io.IOException: error=2, No such file or directory
at java.base/java.lang.ProcessImpl.forkAndExec(Native Method)
at java.base/java.lang.ProcessImpl.<init>(ProcessImpl.java:314)
at java.base/java.lang.ProcessImpl.start(ProcessImpl.java:244)
at java.base/java.lang.ProcessBuilder.start(ProcessBuilder.java:1110)
Also: hudson.remoting.Channel$CallSiteStackTrace: Remote call to builds48
at hudson.remoting.Channel.attachCallSiteStackTrace(Channel.java:1923)
at hudson.remoting.UserRequest$ExceptionResponse.retrieve(UserRequest.java:384)
at hudson.remoting.Channel.call(Channel.java:1112)
at hudson.Launcher$RemoteLauncher.launch(Launcher.java:1121)
at hudson.Launcher$ProcStarter.start(Launcher.java:506)
at hudson.Launcher$ProcStarter.join(Launcher.java:517)
at hudson.tasks.Maven.perform(Maven.java:368)
at hudson.tasks.BuildStepMonitor$1.perform(BuildStepMonitor.java:20)
at hudson.model.AbstractBuild$AbstractBuildExecution.perform(AbstractBuild.java:818)
at hudson.model.Build$BuildExecution.build(Build.java:199)
at hudson.model.Build$BuildExecution.doRun(Build.java:164)
at hudson.model.AbstractBuild$AbstractBuildExecution.run(AbstractBuild.java:527)
at hudson.model.Run.execute(Run.java:1833)
at hudson.model.FreeStyleBuild.run(FreeStyleBuild.java:44)
at hudson.model.ResourceController.execute(ResourceController.java:101)
at hudson.model.Executor.run(Executor.java:446)
Caused: java.io.IOException: Cannot run program "mvn" (in directory "<https://ci-builds.apache.org/job/JClouds/job/jclouds-with-credentials/job/jclouds-compute-delete-all/ws/")>: error=2, No such file or directory
at java.base/java.lang.ProcessBuilder.start(ProcessBuilder.java:1143)
at java.base/java.lang.ProcessBuilder.start(ProcessBuilder.java:1073)
at hudson.Proc$LocalProc.<init>(Proc.java:252)
at hudson.Proc$LocalProc.<init>(Proc.java:221)
at hudson.Launcher$LocalLauncher.launch(Launcher.java:994)
at hudson.Launcher$ProcStarter.start(Launcher.java:506)
at hudson.Launcher$RemoteLaunchCallable.call(Launcher.java:1395)
at hudson.Launcher$RemoteLaunchCallable.call(Launcher.java:1337)
at hudson.remoting.UserRequest.perform(UserRequest.java:225)
at hudson.remoting.UserRequest.perform(UserRequest.java:50)
at hudson.remoting.Request$2.run(Request.java:391)
at hudson.remoting.InterceptingExecutorService.lambda$wrap$0(InterceptingExecutorService.java:81)
at java.base/java.util.concurrent.FutureTask.run(FutureTask.java:264)
at java.base/java.util.concurrent.ThreadPoolExecutor.runWorker(ThreadPoolExecutor.java:1136)
at java.base/java.util.concurrent.ThreadPoolExecutor$Worker.run(ThreadPoolExecutor.java:635)
at java.base/java.lang.Thread.run(Thread.java:840)
Build step 'Invoke top-level Maven targets' marked build as failure
No JDK named ‘JDK 1.8.0_144 (unlimited security)’ found
Build failed in Jenkins: JClouds » jclouds-with-credentials » jclouds-compute-delete-all #114
Posted by Apache Jenkins Server <je...@builds.apache.org>.
See <https://ci-builds.apache.org/job/JClouds/job/jclouds-with-credentials/job/jclouds-compute-delete-all/114/display/redirect>
Changes:
------------------------------------------
Started by upstream project "JClouds/jclouds-with-credentials/jclouds-packet-live-tests" build number 232
originally caused by:
Started by timer
Running as SYSTEM
No JDK named ‘JDK 1.8.0_144 (unlimited security)’ found
[EnvInject] - Loading node environment variables.
Building remotely on builds48 (tmp-22 ubuntu) in workspace <https://ci-builds.apache.org/job/JClouds/job/jclouds-with-credentials/job/jclouds-compute-delete-all/ws/>
No JDK named ‘JDK 1.8.0_144 (unlimited security)’ found
The recommended git tool is: NONE
No credentials specified
No JDK named ‘JDK 1.8.0_144 (unlimited security)’ found
> git rev-parse --resolve-git-dir <https://ci-builds.apache.org/job/JClouds/job/jclouds-with-credentials/job/jclouds-compute-delete-all/ws/.git> # timeout=10
Fetching changes from the remote Git repository
> git config remote.origin.url https://gitbox.apache.org/repos/asf/karaf-jclouds-cli.git # timeout=10
Fetching upstream changes from https://gitbox.apache.org/repos/asf/karaf-jclouds-cli.git
> git --version # timeout=10
> git --version # 'git version 2.34.1'
> git fetch --tags --force --progress -- https://gitbox.apache.org/repos/asf/karaf-jclouds-cli.git +refs/heads/*:refs/remotes/origin/* # timeout=10
> git rev-parse refs/remotes/origin/master^{commit} # timeout=10
No JDK named ‘JDK 1.8.0_144 (unlimited security)’ found
Checking out Revision fdc566154e25a0d44f8dab5a65ee01da1e78b9be (refs/remotes/origin/master)
> git config core.sparsecheckout # timeout=10
> git checkout -f fdc566154e25a0d44f8dab5a65ee01da1e78b9be # timeout=10
Commit message: "fix typo in project.version"
> git rev-list --no-walk fdc566154e25a0d44f8dab5a65ee01da1e78b9be # timeout=10
No JDK named ‘JDK 1.8.0_144 (unlimited security)’ found
No JDK named ‘JDK 1.8.0_144 (unlimited security)’ found
[EnvInject] - Mask passwords that will be passed as build parameters.
No JDK named ‘JDK 1.8.0_144 (unlimited security)’ found
[jclouds-compute-delete-all] $ mvn clean package
FATAL: command execution failed
java.io.IOException: error=2, No such file or directory
at java.base/java.lang.ProcessImpl.forkAndExec(Native Method)
at java.base/java.lang.ProcessImpl.<init>(ProcessImpl.java:314)
at java.base/java.lang.ProcessImpl.start(ProcessImpl.java:244)
at java.base/java.lang.ProcessBuilder.start(ProcessBuilder.java:1110)
Also: hudson.remoting.Channel$CallSiteStackTrace: Remote call to builds48
at hudson.remoting.Channel.attachCallSiteStackTrace(Channel.java:1923)
at hudson.remoting.UserRequest$ExceptionResponse.retrieve(UserRequest.java:384)
at hudson.remoting.Channel.call(Channel.java:1112)
at hudson.Launcher$RemoteLauncher.launch(Launcher.java:1121)
at hudson.Launcher$ProcStarter.start(Launcher.java:506)
at hudson.Launcher$ProcStarter.join(Launcher.java:517)
at hudson.tasks.Maven.perform(Maven.java:368)
at hudson.tasks.BuildStepMonitor$1.perform(BuildStepMonitor.java:20)
at hudson.model.AbstractBuild$AbstractBuildExecution.perform(AbstractBuild.java:818)
at hudson.model.Build$BuildExecution.build(Build.java:199)
at hudson.model.Build$BuildExecution.doRun(Build.java:164)
at hudson.model.AbstractBuild$AbstractBuildExecution.run(AbstractBuild.java:527)
at hudson.model.Run.execute(Run.java:1833)
at hudson.model.FreeStyleBuild.run(FreeStyleBuild.java:44)
at hudson.model.ResourceController.execute(ResourceController.java:101)
at hudson.model.Executor.run(Executor.java:446)
Caused: java.io.IOException: Cannot run program "mvn" (in directory "<https://ci-builds.apache.org/job/JClouds/job/jclouds-with-credentials/job/jclouds-compute-delete-all/ws/")>: error=2, No such file or directory
at java.base/java.lang.ProcessBuilder.start(ProcessBuilder.java:1143)
at java.base/java.lang.ProcessBuilder.start(ProcessBuilder.java:1073)
at hudson.Proc$LocalProc.<init>(Proc.java:252)
at hudson.Proc$LocalProc.<init>(Proc.java:221)
at hudson.Launcher$LocalLauncher.launch(Launcher.java:994)
at hudson.Launcher$ProcStarter.start(Launcher.java:506)
at hudson.Launcher$RemoteLaunchCallable.call(Launcher.java:1395)
at hudson.Launcher$RemoteLaunchCallable.call(Launcher.java:1337)
at hudson.remoting.UserRequest.perform(UserRequest.java:225)
at hudson.remoting.UserRequest.perform(UserRequest.java:50)
at hudson.remoting.Request$2.run(Request.java:391)
at hudson.remoting.InterceptingExecutorService.lambda$wrap$0(InterceptingExecutorService.java:81)
at java.base/java.util.concurrent.FutureTask.run(FutureTask.java:264)
at java.base/java.util.concurrent.ThreadPoolExecutor.runWorker(ThreadPoolExecutor.java:1136)
at java.base/java.util.concurrent.ThreadPoolExecutor$Worker.run(ThreadPoolExecutor.java:635)
at java.base/java.lang.Thread.run(Thread.java:840)
Build step 'Invoke top-level Maven targets' marked build as failure
No JDK named ‘JDK 1.8.0_144 (unlimited security)’ found
Build failed in Jenkins: JClouds » jclouds-with-credentials » jclouds-compute-delete-all #113
Posted by Apache Jenkins Server <je...@builds.apache.org>.
See <https://ci-builds.apache.org/job/JClouds/job/jclouds-with-credentials/job/jclouds-compute-delete-all/113/display/redirect>
Changes:
------------------------------------------
Started by upstream project "JClouds/jclouds-with-credentials/jclouds-packet-live-tests" build number 231
originally caused by:
Started by timer
Running as SYSTEM
No JDK named ‘JDK 1.8.0_144 (unlimited security)’ found
[EnvInject] - Loading node environment variables.
Building remotely on builds48 (tmp-22 ubuntu) in workspace <https://ci-builds.apache.org/job/JClouds/job/jclouds-with-credentials/job/jclouds-compute-delete-all/ws/>
No JDK named ‘JDK 1.8.0_144 (unlimited security)’ found
The recommended git tool is: NONE
No credentials specified
No JDK named ‘JDK 1.8.0_144 (unlimited security)’ found
> git rev-parse --resolve-git-dir <https://ci-builds.apache.org/job/JClouds/job/jclouds-with-credentials/job/jclouds-compute-delete-all/ws/.git> # timeout=10
Fetching changes from the remote Git repository
> git config remote.origin.url https://gitbox.apache.org/repos/asf/karaf-jclouds-cli.git # timeout=10
Fetching upstream changes from https://gitbox.apache.org/repos/asf/karaf-jclouds-cli.git
> git --version # timeout=10
> git --version # 'git version 2.34.1'
> git fetch --tags --force --progress -- https://gitbox.apache.org/repos/asf/karaf-jclouds-cli.git +refs/heads/*:refs/remotes/origin/* # timeout=10
> git rev-parse refs/remotes/origin/master^{commit} # timeout=10
No JDK named ‘JDK 1.8.0_144 (unlimited security)’ found
Checking out Revision fdc566154e25a0d44f8dab5a65ee01da1e78b9be (refs/remotes/origin/master)
> git config core.sparsecheckout # timeout=10
> git checkout -f fdc566154e25a0d44f8dab5a65ee01da1e78b9be # timeout=10
Commit message: "fix typo in project.version"
> git rev-list --no-walk fdc566154e25a0d44f8dab5a65ee01da1e78b9be # timeout=10
No JDK named ‘JDK 1.8.0_144 (unlimited security)’ found
No JDK named ‘JDK 1.8.0_144 (unlimited security)’ found
[EnvInject] - Mask passwords that will be passed as build parameters.
No JDK named ‘JDK 1.8.0_144 (unlimited security)’ found
[jclouds-compute-delete-all] $ mvn clean package
FATAL: command execution failed
java.io.IOException: error=2, No such file or directory
at java.base/java.lang.ProcessImpl.forkAndExec(Native Method)
at java.base/java.lang.ProcessImpl.<init>(ProcessImpl.java:314)
at java.base/java.lang.ProcessImpl.start(ProcessImpl.java:244)
at java.base/java.lang.ProcessBuilder.start(ProcessBuilder.java:1110)
Also: hudson.remoting.Channel$CallSiteStackTrace: Remote call to builds48
at hudson.remoting.Channel.attachCallSiteStackTrace(Channel.java:1923)
at hudson.remoting.UserRequest$ExceptionResponse.retrieve(UserRequest.java:384)
at hudson.remoting.Channel.call(Channel.java:1112)
at hudson.Launcher$RemoteLauncher.launch(Launcher.java:1121)
at hudson.Launcher$ProcStarter.start(Launcher.java:506)
at hudson.Launcher$ProcStarter.join(Launcher.java:517)
at hudson.tasks.Maven.perform(Maven.java:368)
at hudson.tasks.BuildStepMonitor$1.perform(BuildStepMonitor.java:20)
at hudson.model.AbstractBuild$AbstractBuildExecution.perform(AbstractBuild.java:818)
at hudson.model.Build$BuildExecution.build(Build.java:199)
at hudson.model.Build$BuildExecution.doRun(Build.java:164)
at hudson.model.AbstractBuild$AbstractBuildExecution.run(AbstractBuild.java:527)
at hudson.model.Run.execute(Run.java:1833)
at hudson.model.FreeStyleBuild.run(FreeStyleBuild.java:44)
at hudson.model.ResourceController.execute(ResourceController.java:101)
at hudson.model.Executor.run(Executor.java:446)
Caused: java.io.IOException: Cannot run program "mvn" (in directory "<https://ci-builds.apache.org/job/JClouds/job/jclouds-with-credentials/job/jclouds-compute-delete-all/ws/")>: error=2, No such file or directory
at java.base/java.lang.ProcessBuilder.start(ProcessBuilder.java:1143)
at java.base/java.lang.ProcessBuilder.start(ProcessBuilder.java:1073)
at hudson.Proc$LocalProc.<init>(Proc.java:252)
at hudson.Proc$LocalProc.<init>(Proc.java:221)
at hudson.Launcher$LocalLauncher.launch(Launcher.java:994)
at hudson.Launcher$ProcStarter.start(Launcher.java:506)
at hudson.Launcher$RemoteLaunchCallable.call(Launcher.java:1395)
at hudson.Launcher$RemoteLaunchCallable.call(Launcher.java:1337)
at hudson.remoting.UserRequest.perform(UserRequest.java:225)
at hudson.remoting.UserRequest.perform(UserRequest.java:50)
at hudson.remoting.Request$2.run(Request.java:391)
at hudson.remoting.InterceptingExecutorService.lambda$wrap$0(InterceptingExecutorService.java:81)
at java.base/java.util.concurrent.FutureTask.run(FutureTask.java:264)
at java.base/java.util.concurrent.ThreadPoolExecutor.runWorker(ThreadPoolExecutor.java:1136)
at java.base/java.util.concurrent.ThreadPoolExecutor$Worker.run(ThreadPoolExecutor.java:635)
at java.base/java.lang.Thread.run(Thread.java:840)
Build step 'Invoke top-level Maven targets' marked build as failure
No JDK named ‘JDK 1.8.0_144 (unlimited security)’ found
Build failed in Jenkins: JClouds » jclouds-with-credentials » jclouds-compute-delete-all #112
Posted by Apache Jenkins Server <je...@builds.apache.org>.
See <https://ci-builds.apache.org/job/JClouds/job/jclouds-with-credentials/job/jclouds-compute-delete-all/112/display/redirect>
Changes:
------------------------------------------
Started by upstream project "JClouds/jclouds-with-credentials/jclouds-packet-live-tests" build number 230
originally caused by:
Started by timer
Running as SYSTEM
No JDK named ‘JDK 1.8.0_144 (unlimited security)’ found
[EnvInject] - Loading node environment variables.
Building remotely on builds48 (tmp-22 ubuntu) in workspace <https://ci-builds.apache.org/job/JClouds/job/jclouds-with-credentials/job/jclouds-compute-delete-all/ws/>
No JDK named ‘JDK 1.8.0_144 (unlimited security)’ found
The recommended git tool is: NONE
No credentials specified
No JDK named ‘JDK 1.8.0_144 (unlimited security)’ found
> git rev-parse --resolve-git-dir <https://ci-builds.apache.org/job/JClouds/job/jclouds-with-credentials/job/jclouds-compute-delete-all/ws/.git> # timeout=10
Fetching changes from the remote Git repository
> git config remote.origin.url https://gitbox.apache.org/repos/asf/karaf-jclouds-cli.git # timeout=10
Fetching upstream changes from https://gitbox.apache.org/repos/asf/karaf-jclouds-cli.git
> git --version # timeout=10
> git --version # 'git version 2.34.1'
> git fetch --tags --force --progress -- https://gitbox.apache.org/repos/asf/karaf-jclouds-cli.git +refs/heads/*:refs/remotes/origin/* # timeout=10
> git rev-parse refs/remotes/origin/master^{commit} # timeout=10
No JDK named ‘JDK 1.8.0_144 (unlimited security)’ found
Checking out Revision fdc566154e25a0d44f8dab5a65ee01da1e78b9be (refs/remotes/origin/master)
> git config core.sparsecheckout # timeout=10
> git checkout -f fdc566154e25a0d44f8dab5a65ee01da1e78b9be # timeout=10
Commit message: "fix typo in project.version"
> git rev-list --no-walk fdc566154e25a0d44f8dab5a65ee01da1e78b9be # timeout=10
No JDK named ‘JDK 1.8.0_144 (unlimited security)’ found
No JDK named ‘JDK 1.8.0_144 (unlimited security)’ found
[EnvInject] - Mask passwords that will be passed as build parameters.
No JDK named ‘JDK 1.8.0_144 (unlimited security)’ found
[jclouds-compute-delete-all] $ mvn clean package
FATAL: command execution failed
java.io.IOException: error=2, No such file or directory
at java.base/java.lang.ProcessImpl.forkAndExec(Native Method)
at java.base/java.lang.ProcessImpl.<init>(ProcessImpl.java:314)
at java.base/java.lang.ProcessImpl.start(ProcessImpl.java:244)
at java.base/java.lang.ProcessBuilder.start(ProcessBuilder.java:1110)
Also: hudson.remoting.Channel$CallSiteStackTrace: Remote call to builds48
at hudson.remoting.Channel.attachCallSiteStackTrace(Channel.java:1923)
at hudson.remoting.UserRequest$ExceptionResponse.retrieve(UserRequest.java:384)
at hudson.remoting.Channel.call(Channel.java:1112)
at hudson.Launcher$RemoteLauncher.launch(Launcher.java:1121)
at hudson.Launcher$ProcStarter.start(Launcher.java:506)
at hudson.Launcher$ProcStarter.join(Launcher.java:517)
at hudson.tasks.Maven.perform(Maven.java:368)
at hudson.tasks.BuildStepMonitor$1.perform(BuildStepMonitor.java:20)
at hudson.model.AbstractBuild$AbstractBuildExecution.perform(AbstractBuild.java:818)
at hudson.model.Build$BuildExecution.build(Build.java:199)
at hudson.model.Build$BuildExecution.doRun(Build.java:164)
at hudson.model.AbstractBuild$AbstractBuildExecution.run(AbstractBuild.java:527)
at hudson.model.Run.execute(Run.java:1833)
at hudson.model.FreeStyleBuild.run(FreeStyleBuild.java:44)
at hudson.model.ResourceController.execute(ResourceController.java:101)
at hudson.model.Executor.run(Executor.java:446)
Caused: java.io.IOException: Cannot run program "mvn" (in directory "<https://ci-builds.apache.org/job/JClouds/job/jclouds-with-credentials/job/jclouds-compute-delete-all/ws/")>: error=2, No such file or directory
at java.base/java.lang.ProcessBuilder.start(ProcessBuilder.java:1143)
at java.base/java.lang.ProcessBuilder.start(ProcessBuilder.java:1073)
at hudson.Proc$LocalProc.<init>(Proc.java:252)
at hudson.Proc$LocalProc.<init>(Proc.java:221)
at hudson.Launcher$LocalLauncher.launch(Launcher.java:994)
at hudson.Launcher$ProcStarter.start(Launcher.java:506)
at hudson.Launcher$RemoteLaunchCallable.call(Launcher.java:1395)
at hudson.Launcher$RemoteLaunchCallable.call(Launcher.java:1337)
at hudson.remoting.UserRequest.perform(UserRequest.java:225)
at hudson.remoting.UserRequest.perform(UserRequest.java:50)
at hudson.remoting.Request$2.run(Request.java:391)
at hudson.remoting.InterceptingExecutorService.lambda$wrap$0(InterceptingExecutorService.java:81)
at java.base/java.util.concurrent.FutureTask.run(FutureTask.java:264)
at java.base/java.util.concurrent.ThreadPoolExecutor.runWorker(ThreadPoolExecutor.java:1136)
at java.base/java.util.concurrent.ThreadPoolExecutor$Worker.run(ThreadPoolExecutor.java:635)
at java.base/java.lang.Thread.run(Thread.java:840)
Build step 'Invoke top-level Maven targets' marked build as failure
No JDK named ‘JDK 1.8.0_144 (unlimited security)’ found
Build failed in Jenkins: JClouds » jclouds-with-credentials » jclouds-compute-delete-all #111
Posted by Apache Jenkins Server <je...@builds.apache.org>.
See <https://ci-builds.apache.org/job/JClouds/job/jclouds-with-credentials/job/jclouds-compute-delete-all/111/display/redirect>
Changes:
------------------------------------------
Started by upstream project "JClouds/jclouds-with-credentials/jclouds-packet-live-tests" build number 229
originally caused by:
Started by timer
Running as SYSTEM
No JDK named ‘JDK 1.8.0_144 (unlimited security)’ found
[EnvInject] - Loading node environment variables.
Building remotely on builds48 (tmp-22 ubuntu) in workspace <https://ci-builds.apache.org/job/JClouds/job/jclouds-with-credentials/job/jclouds-compute-delete-all/ws/>
No JDK named ‘JDK 1.8.0_144 (unlimited security)’ found
The recommended git tool is: NONE
No credentials specified
No JDK named ‘JDK 1.8.0_144 (unlimited security)’ found
Cloning the remote Git repository
Cloning repository https://gitbox.apache.org/repos/asf/karaf-jclouds-cli.git
> git init <https://ci-builds.apache.org/job/JClouds/job/jclouds-with-credentials/job/jclouds-compute-delete-all/ws/> # timeout=10
Fetching upstream changes from https://gitbox.apache.org/repos/asf/karaf-jclouds-cli.git
> git --version # timeout=10
> git --version # 'git version 2.34.1'
> git fetch --tags --force --progress -- https://gitbox.apache.org/repos/asf/karaf-jclouds-cli.git +refs/heads/*:refs/remotes/origin/* # timeout=10
> git config remote.origin.url https://gitbox.apache.org/repos/asf/karaf-jclouds-cli.git # timeout=10
> git config --add remote.origin.fetch +refs/heads/*:refs/remotes/origin/* # timeout=10
Avoid second fetch
> git rev-parse refs/remotes/origin/master^{commit} # timeout=10
No JDK named ‘JDK 1.8.0_144 (unlimited security)’ found
Checking out Revision fdc566154e25a0d44f8dab5a65ee01da1e78b9be (refs/remotes/origin/master)
> git config core.sparsecheckout # timeout=10
> git checkout -f fdc566154e25a0d44f8dab5a65ee01da1e78b9be # timeout=10
Commit message: "fix typo in project.version"
> git rev-list --no-walk fdc566154e25a0d44f8dab5a65ee01da1e78b9be # timeout=10
No JDK named ‘JDK 1.8.0_144 (unlimited security)’ found
No JDK named ‘JDK 1.8.0_144 (unlimited security)’ found
[EnvInject] - Mask passwords that will be passed as build parameters.
No JDK named ‘JDK 1.8.0_144 (unlimited security)’ found
[jclouds-compute-delete-all] $ mvn clean package
FATAL: command execution failed
java.io.IOException: error=2, No such file or directory
at java.base/java.lang.ProcessImpl.forkAndExec(Native Method)
at java.base/java.lang.ProcessImpl.<init>(ProcessImpl.java:314)
at java.base/java.lang.ProcessImpl.start(ProcessImpl.java:244)
at java.base/java.lang.ProcessBuilder.start(ProcessBuilder.java:1110)
Also: hudson.remoting.Channel$CallSiteStackTrace: Remote call to builds48
at hudson.remoting.Channel.attachCallSiteStackTrace(Channel.java:1923)
at hudson.remoting.UserRequest$ExceptionResponse.retrieve(UserRequest.java:384)
at hudson.remoting.Channel.call(Channel.java:1112)
at hudson.Launcher$RemoteLauncher.launch(Launcher.java:1121)
at hudson.Launcher$ProcStarter.start(Launcher.java:506)
at hudson.Launcher$ProcStarter.join(Launcher.java:517)
at hudson.tasks.Maven.perform(Maven.java:368)
at hudson.tasks.BuildStepMonitor$1.perform(BuildStepMonitor.java:20)
at hudson.model.AbstractBuild$AbstractBuildExecution.perform(AbstractBuild.java:818)
at hudson.model.Build$BuildExecution.build(Build.java:199)
at hudson.model.Build$BuildExecution.doRun(Build.java:164)
at hudson.model.AbstractBuild$AbstractBuildExecution.run(AbstractBuild.java:527)
at hudson.model.Run.execute(Run.java:1833)
at hudson.model.FreeStyleBuild.run(FreeStyleBuild.java:44)
at hudson.model.ResourceController.execute(ResourceController.java:101)
at hudson.model.Executor.run(Executor.java:446)
Caused: java.io.IOException: Cannot run program "mvn" (in directory "<https://ci-builds.apache.org/job/JClouds/job/jclouds-with-credentials/job/jclouds-compute-delete-all/ws/")>: error=2, No such file or directory
at java.base/java.lang.ProcessBuilder.start(ProcessBuilder.java:1143)
at java.base/java.lang.ProcessBuilder.start(ProcessBuilder.java:1073)
at hudson.Proc$LocalProc.<init>(Proc.java:252)
at hudson.Proc$LocalProc.<init>(Proc.java:221)
at hudson.Launcher$LocalLauncher.launch(Launcher.java:994)
at hudson.Launcher$ProcStarter.start(Launcher.java:506)
at hudson.Launcher$RemoteLaunchCallable.call(Launcher.java:1395)
at hudson.Launcher$RemoteLaunchCallable.call(Launcher.java:1337)
at hudson.remoting.UserRequest.perform(UserRequest.java:225)
at hudson.remoting.UserRequest.perform(UserRequest.java:50)
at hudson.remoting.Request$2.run(Request.java:391)
at hudson.remoting.InterceptingExecutorService.lambda$wrap$0(InterceptingExecutorService.java:81)
at java.base/java.util.concurrent.FutureTask.run(FutureTask.java:264)
at java.base/java.util.concurrent.ThreadPoolExecutor.runWorker(ThreadPoolExecutor.java:1136)
at java.base/java.util.concurrent.ThreadPoolExecutor$Worker.run(ThreadPoolExecutor.java:635)
at java.base/java.lang.Thread.run(Thread.java:840)
Build step 'Invoke top-level Maven targets' marked build as failure
No JDK named ‘JDK 1.8.0_144 (unlimited security)’ found
Build failed in Jenkins: JClouds » jclouds-with-credentials » jclouds-compute-delete-all #110
Posted by Apache Jenkins Server <je...@builds.apache.org>.
See <https://ci-builds.apache.org/job/JClouds/job/jclouds-with-credentials/job/jclouds-compute-delete-all/110/display/redirect>
Changes:
------------------------------------------
Started by upstream project "JClouds/jclouds-with-credentials/jclouds-packet-live-tests" build number 228
originally caused by:
Started by timer
Running as SYSTEM
No JDK named ‘JDK 1.8.0_144 (unlimited security)’ found
[EnvInject] - Loading node environment variables.
Building remotely on builds32 (ubuntu) in workspace <https://ci-builds.apache.org/job/JClouds/job/jclouds-with-credentials/job/jclouds-compute-delete-all/ws/>
No JDK named ‘JDK 1.8.0_144 (unlimited security)’ found
The recommended git tool is: NONE
No credentials specified
No JDK named ‘JDK 1.8.0_144 (unlimited security)’ found
Cloning the remote Git repository
Cloning repository https://gitbox.apache.org/repos/asf/karaf-jclouds-cli.git
> git init <https://ci-builds.apache.org/job/JClouds/job/jclouds-with-credentials/job/jclouds-compute-delete-all/ws/> # timeout=10
Fetching upstream changes from https://gitbox.apache.org/repos/asf/karaf-jclouds-cli.git
> git --version # timeout=10
> git --version # 'git version 2.34.1'
> git fetch --tags --force --progress -- https://gitbox.apache.org/repos/asf/karaf-jclouds-cli.git +refs/heads/*:refs/remotes/origin/* # timeout=10
> git config remote.origin.url https://gitbox.apache.org/repos/asf/karaf-jclouds-cli.git # timeout=10
> git config --add remote.origin.fetch +refs/heads/*:refs/remotes/origin/* # timeout=10
Avoid second fetch
> git rev-parse refs/remotes/origin/master^{commit} # timeout=10
No JDK named ‘JDK 1.8.0_144 (unlimited security)’ found
Checking out Revision fdc566154e25a0d44f8dab5a65ee01da1e78b9be (refs/remotes/origin/master)
> git config core.sparsecheckout # timeout=10
> git checkout -f fdc566154e25a0d44f8dab5a65ee01da1e78b9be # timeout=10
Commit message: "fix typo in project.version"
> git rev-list --no-walk fdc566154e25a0d44f8dab5a65ee01da1e78b9be # timeout=10
No JDK named ‘JDK 1.8.0_144 (unlimited security)’ found
No JDK named ‘JDK 1.8.0_144 (unlimited security)’ found
[EnvInject] - Mask passwords that will be passed as build parameters.
No JDK named ‘JDK 1.8.0_144 (unlimited security)’ found
[jclouds-compute-delete-all] $ mvn clean package
FATAL: command execution failed
java.io.IOException: error=2, No such file or directory
at java.base/java.lang.ProcessImpl.forkAndExec(Native Method)
at java.base/java.lang.ProcessImpl.<init>(ProcessImpl.java:314)
at java.base/java.lang.ProcessImpl.start(ProcessImpl.java:244)
at java.base/java.lang.ProcessBuilder.start(ProcessBuilder.java:1110)
Also: hudson.remoting.Channel$CallSiteStackTrace: Remote call to builds32
at hudson.remoting.Channel.attachCallSiteStackTrace(Channel.java:1923)
at hudson.remoting.UserRequest$ExceptionResponse.retrieve(UserRequest.java:384)
at hudson.remoting.Channel.call(Channel.java:1112)
at hudson.Launcher$RemoteLauncher.launch(Launcher.java:1121)
at hudson.Launcher$ProcStarter.start(Launcher.java:506)
at hudson.Launcher$ProcStarter.join(Launcher.java:517)
at hudson.tasks.Maven.perform(Maven.java:368)
at hudson.tasks.BuildStepMonitor$1.perform(BuildStepMonitor.java:20)
at hudson.model.AbstractBuild$AbstractBuildExecution.perform(AbstractBuild.java:818)
at hudson.model.Build$BuildExecution.build(Build.java:199)
at hudson.model.Build$BuildExecution.doRun(Build.java:164)
at hudson.model.AbstractBuild$AbstractBuildExecution.run(AbstractBuild.java:527)
at hudson.model.Run.execute(Run.java:1833)
at hudson.model.FreeStyleBuild.run(FreeStyleBuild.java:44)
at hudson.model.ResourceController.execute(ResourceController.java:101)
at hudson.model.Executor.run(Executor.java:446)
Caused: java.io.IOException: Cannot run program "mvn" (in directory "<https://ci-builds.apache.org/job/JClouds/job/jclouds-with-credentials/job/jclouds-compute-delete-all/ws/")>: error=2, No such file or directory
at java.base/java.lang.ProcessBuilder.start(ProcessBuilder.java:1143)
at java.base/java.lang.ProcessBuilder.start(ProcessBuilder.java:1073)
at hudson.Proc$LocalProc.<init>(Proc.java:252)
at hudson.Proc$LocalProc.<init>(Proc.java:221)
at hudson.Launcher$LocalLauncher.launch(Launcher.java:994)
at hudson.Launcher$ProcStarter.start(Launcher.java:506)
at hudson.Launcher$RemoteLaunchCallable.call(Launcher.java:1395)
at hudson.Launcher$RemoteLaunchCallable.call(Launcher.java:1337)
at hudson.remoting.UserRequest.perform(UserRequest.java:225)
at hudson.remoting.UserRequest.perform(UserRequest.java:50)
at hudson.remoting.Request$2.run(Request.java:391)
at hudson.remoting.InterceptingExecutorService.lambda$wrap$0(InterceptingExecutorService.java:81)
at java.base/java.util.concurrent.FutureTask.run(FutureTask.java:264)
at java.base/java.util.concurrent.ThreadPoolExecutor.runWorker(ThreadPoolExecutor.java:1136)
at java.base/java.util.concurrent.ThreadPoolExecutor$Worker.run(ThreadPoolExecutor.java:635)
at java.base/java.lang.Thread.run(Thread.java:840)
Build step 'Invoke top-level Maven targets' marked build as failure
No JDK named ‘JDK 1.8.0_144 (unlimited security)’ found
Build failed in Jenkins: JClouds » jclouds-with-credentials » jclouds-compute-delete-all #109
Posted by Apache Jenkins Server <je...@builds.apache.org>.
See <https://ci-builds.apache.org/job/JClouds/job/jclouds-with-credentials/job/jclouds-compute-delete-all/109/display/redirect>
Changes:
------------------------------------------
Started by upstream project "JClouds/jclouds-with-credentials/jclouds-packet-live-tests" build number 227
originally caused by:
Started by timer
Running as SYSTEM
No JDK named ‘JDK 1.8.0_144 (unlimited security)’ found
[EnvInject] - Loading node environment variables.
Building remotely on builds48 (tmp-22 ubuntu) in workspace <https://ci-builds.apache.org/job/JClouds/job/jclouds-with-credentials/job/jclouds-compute-delete-all/ws/>
No JDK named ‘JDK 1.8.0_144 (unlimited security)’ found
The recommended git tool is: NONE
No credentials specified
No JDK named ‘JDK 1.8.0_144 (unlimited security)’ found
> git rev-parse --resolve-git-dir <https://ci-builds.apache.org/job/JClouds/job/jclouds-with-credentials/job/jclouds-compute-delete-all/ws/.git> # timeout=10
Fetching changes from the remote Git repository
> git config remote.origin.url https://gitbox.apache.org/repos/asf/karaf-jclouds-cli.git # timeout=10
Fetching upstream changes from https://gitbox.apache.org/repos/asf/karaf-jclouds-cli.git
> git --version # timeout=10
> git --version # 'git version 2.34.1'
> git fetch --tags --force --progress -- https://gitbox.apache.org/repos/asf/karaf-jclouds-cli.git +refs/heads/*:refs/remotes/origin/* # timeout=10
> git rev-parse refs/remotes/origin/master^{commit} # timeout=10
No JDK named ‘JDK 1.8.0_144 (unlimited security)’ found
Checking out Revision fdc566154e25a0d44f8dab5a65ee01da1e78b9be (refs/remotes/origin/master)
> git config core.sparsecheckout # timeout=10
> git checkout -f fdc566154e25a0d44f8dab5a65ee01da1e78b9be # timeout=10
Commit message: "fix typo in project.version"
> git rev-list --no-walk fdc566154e25a0d44f8dab5a65ee01da1e78b9be # timeout=10
No JDK named ‘JDK 1.8.0_144 (unlimited security)’ found
No JDK named ‘JDK 1.8.0_144 (unlimited security)’ found
[EnvInject] - Mask passwords that will be passed as build parameters.
No JDK named ‘JDK 1.8.0_144 (unlimited security)’ found
[jclouds-compute-delete-all] $ mvn clean package
FATAL: command execution failed
java.io.IOException: error=2, No such file or directory
at java.base/java.lang.ProcessImpl.forkAndExec(Native Method)
at java.base/java.lang.ProcessImpl.<init>(ProcessImpl.java:314)
at java.base/java.lang.ProcessImpl.start(ProcessImpl.java:244)
at java.base/java.lang.ProcessBuilder.start(ProcessBuilder.java:1110)
Also: hudson.remoting.Channel$CallSiteStackTrace: Remote call to builds48
at hudson.remoting.Channel.attachCallSiteStackTrace(Channel.java:1923)
at hudson.remoting.UserRequest$ExceptionResponse.retrieve(UserRequest.java:384)
at hudson.remoting.Channel.call(Channel.java:1112)
at hudson.Launcher$RemoteLauncher.launch(Launcher.java:1121)
at hudson.Launcher$ProcStarter.start(Launcher.java:506)
at hudson.Launcher$ProcStarter.join(Launcher.java:517)
at hudson.tasks.Maven.perform(Maven.java:368)
at hudson.tasks.BuildStepMonitor$1.perform(BuildStepMonitor.java:20)
at hudson.model.AbstractBuild$AbstractBuildExecution.perform(AbstractBuild.java:818)
at hudson.model.Build$BuildExecution.build(Build.java:199)
at hudson.model.Build$BuildExecution.doRun(Build.java:164)
at hudson.model.AbstractBuild$AbstractBuildExecution.run(AbstractBuild.java:527)
at hudson.model.Run.execute(Run.java:1833)
at hudson.model.FreeStyleBuild.run(FreeStyleBuild.java:44)
at hudson.model.ResourceController.execute(ResourceController.java:101)
at hudson.model.Executor.run(Executor.java:446)
Caused: java.io.IOException: Cannot run program "mvn" (in directory "<https://ci-builds.apache.org/job/JClouds/job/jclouds-with-credentials/job/jclouds-compute-delete-all/ws/")>: error=2, No such file or directory
at java.base/java.lang.ProcessBuilder.start(ProcessBuilder.java:1143)
at java.base/java.lang.ProcessBuilder.start(ProcessBuilder.java:1073)
at hudson.Proc$LocalProc.<init>(Proc.java:252)
at hudson.Proc$LocalProc.<init>(Proc.java:221)
at hudson.Launcher$LocalLauncher.launch(Launcher.java:994)
at hudson.Launcher$ProcStarter.start(Launcher.java:506)
at hudson.Launcher$RemoteLaunchCallable.call(Launcher.java:1395)
at hudson.Launcher$RemoteLaunchCallable.call(Launcher.java:1337)
at hudson.remoting.UserRequest.perform(UserRequest.java:225)
at hudson.remoting.UserRequest.perform(UserRequest.java:50)
at hudson.remoting.Request$2.run(Request.java:391)
at hudson.remoting.InterceptingExecutorService.lambda$wrap$0(InterceptingExecutorService.java:81)
at java.base/java.util.concurrent.FutureTask.run(FutureTask.java:264)
at java.base/java.util.concurrent.ThreadPoolExecutor.runWorker(ThreadPoolExecutor.java:1136)
at java.base/java.util.concurrent.ThreadPoolExecutor$Worker.run(ThreadPoolExecutor.java:635)
at java.base/java.lang.Thread.run(Thread.java:840)
Build step 'Invoke top-level Maven targets' marked build as failure
No JDK named ‘JDK 1.8.0_144 (unlimited security)’ found
Build failed in Jenkins: JClouds » jclouds-with-credentials » jclouds-compute-delete-all #108
Posted by Apache Jenkins Server <je...@builds.apache.org>.
See <https://ci-builds.apache.org/job/JClouds/job/jclouds-with-credentials/job/jclouds-compute-delete-all/108/display/redirect>
Changes:
------------------------------------------
Started by upstream project "JClouds/jclouds-with-credentials/jclouds-packet-live-tests" build number 226
originally caused by:
Started by timer
Running as SYSTEM
No JDK named ‘JDK 1.8.0_144 (unlimited security)’ found
[EnvInject] - Loading node environment variables.
Building remotely on builds48 (tmp-22 ubuntu) in workspace <https://ci-builds.apache.org/job/JClouds/job/jclouds-with-credentials/job/jclouds-compute-delete-all/ws/>
No JDK named ‘JDK 1.8.0_144 (unlimited security)’ found
The recommended git tool is: NONE
No credentials specified
No JDK named ‘JDK 1.8.0_144 (unlimited security)’ found
> git rev-parse --resolve-git-dir <https://ci-builds.apache.org/job/JClouds/job/jclouds-with-credentials/job/jclouds-compute-delete-all/ws/.git> # timeout=10
Fetching changes from the remote Git repository
> git config remote.origin.url https://gitbox.apache.org/repos/asf/karaf-jclouds-cli.git # timeout=10
Fetching upstream changes from https://gitbox.apache.org/repos/asf/karaf-jclouds-cli.git
> git --version # timeout=10
> git --version # 'git version 2.34.1'
> git fetch --tags --force --progress -- https://gitbox.apache.org/repos/asf/karaf-jclouds-cli.git +refs/heads/*:refs/remotes/origin/* # timeout=10
> git rev-parse refs/remotes/origin/master^{commit} # timeout=10
No JDK named ‘JDK 1.8.0_144 (unlimited security)’ found
Checking out Revision fdc566154e25a0d44f8dab5a65ee01da1e78b9be (refs/remotes/origin/master)
> git config core.sparsecheckout # timeout=10
> git checkout -f fdc566154e25a0d44f8dab5a65ee01da1e78b9be # timeout=10
Commit message: "fix typo in project.version"
> git rev-list --no-walk fdc566154e25a0d44f8dab5a65ee01da1e78b9be # timeout=10
No JDK named ‘JDK 1.8.0_144 (unlimited security)’ found
No JDK named ‘JDK 1.8.0_144 (unlimited security)’ found
[EnvInject] - Mask passwords that will be passed as build parameters.
No JDK named ‘JDK 1.8.0_144 (unlimited security)’ found
[jclouds-compute-delete-all] $ mvn clean package
FATAL: command execution failed
java.io.IOException: error=2, No such file or directory
at java.base/java.lang.ProcessImpl.forkAndExec(Native Method)
at java.base/java.lang.ProcessImpl.<init>(ProcessImpl.java:314)
at java.base/java.lang.ProcessImpl.start(ProcessImpl.java:244)
at java.base/java.lang.ProcessBuilder.start(ProcessBuilder.java:1110)
Also: hudson.remoting.Channel$CallSiteStackTrace: Remote call to builds48
at hudson.remoting.Channel.attachCallSiteStackTrace(Channel.java:1923)
at hudson.remoting.UserRequest$ExceptionResponse.retrieve(UserRequest.java:384)
at hudson.remoting.Channel.call(Channel.java:1112)
at hudson.Launcher$RemoteLauncher.launch(Launcher.java:1121)
at hudson.Launcher$ProcStarter.start(Launcher.java:506)
at hudson.Launcher$ProcStarter.join(Launcher.java:517)
at hudson.tasks.Maven.perform(Maven.java:368)
at hudson.tasks.BuildStepMonitor$1.perform(BuildStepMonitor.java:20)
at hudson.model.AbstractBuild$AbstractBuildExecution.perform(AbstractBuild.java:818)
at hudson.model.Build$BuildExecution.build(Build.java:199)
at hudson.model.Build$BuildExecution.doRun(Build.java:164)
at hudson.model.AbstractBuild$AbstractBuildExecution.run(AbstractBuild.java:527)
at hudson.model.Run.execute(Run.java:1833)
at hudson.model.FreeStyleBuild.run(FreeStyleBuild.java:44)
at hudson.model.ResourceController.execute(ResourceController.java:101)
at hudson.model.Executor.run(Executor.java:446)
Caused: java.io.IOException: Cannot run program "mvn" (in directory "<https://ci-builds.apache.org/job/JClouds/job/jclouds-with-credentials/job/jclouds-compute-delete-all/ws/")>: error=2, No such file or directory
at java.base/java.lang.ProcessBuilder.start(ProcessBuilder.java:1143)
at java.base/java.lang.ProcessBuilder.start(ProcessBuilder.java:1073)
at hudson.Proc$LocalProc.<init>(Proc.java:252)
at hudson.Proc$LocalProc.<init>(Proc.java:221)
at hudson.Launcher$LocalLauncher.launch(Launcher.java:994)
at hudson.Launcher$ProcStarter.start(Launcher.java:506)
at hudson.Launcher$RemoteLaunchCallable.call(Launcher.java:1395)
at hudson.Launcher$RemoteLaunchCallable.call(Launcher.java:1337)
at hudson.remoting.UserRequest.perform(UserRequest.java:225)
at hudson.remoting.UserRequest.perform(UserRequest.java:50)
at hudson.remoting.Request$2.run(Request.java:391)
at hudson.remoting.InterceptingExecutorService.lambda$wrap$0(InterceptingExecutorService.java:81)
at java.base/java.util.concurrent.FutureTask.run(FutureTask.java:264)
at java.base/java.util.concurrent.ThreadPoolExecutor.runWorker(ThreadPoolExecutor.java:1136)
at java.base/java.util.concurrent.ThreadPoolExecutor$Worker.run(ThreadPoolExecutor.java:635)
at java.base/java.lang.Thread.run(Thread.java:840)
Build step 'Invoke top-level Maven targets' marked build as failure
No JDK named ‘JDK 1.8.0_144 (unlimited security)’ found