You are viewing a plain text version of this content. The canonical link for it is here.
Posted to builds@beam.apache.org by Apache Jenkins Server <je...@builds.apache.org> on 2023/09/06 07:08:16 UTC
Build failed in Jenkins: beam_PostCommit_Python311 #627
See <https://ci-beam.apache.org/job/beam_PostCommit_Python311/627/display/redirect>
Changes:
------------------------------------------
[...truncated 6.22 MB...]
Implementing implicit namespace packages (as specified in PEP 420) is preferred to `pkg_resources.declare_namespace`. See https://setuptools.pypa.io/en/latest/references/keywords.html#keyword-namespace-packages
declare_namespace(pkg)
../../build/gradleenv/2050596099/lib/python3.11/site-packages/pkg_resources/__init__.py:2350: 36 warnings
<https://ci-beam.apache.org/job/beam_PostCommit_Python311/ws/src/build/gradleenv/2050596099/lib/python3.11/site-packages/pkg_resources/__init__.py>:2350: DeprecationWarning: Deprecated call to `pkg_resources.declare_namespace('google')`.
Implementing implicit namespace packages (as specified in PEP 420) is preferred to `pkg_resources.declare_namespace`. See https://setuptools.pypa.io/en/latest/references/keywords.html#keyword-namespace-packages
declare_namespace(parent)
../../build/gradleenv/2050596099/lib/python3.11/site-packages/pkg_resources/__init__.py:2871
../../build/gradleenv/2050596099/lib/python3.11/site-packages/pkg_resources/__init__.py:2871
../../build/gradleenv/2050596099/lib/python3.11/site-packages/pkg_resources/__init__.py:2871
../../build/gradleenv/2050596099/lib/python3.11/site-packages/pkg_resources/__init__.py:2871
../../build/gradleenv/2050596099/lib/python3.11/site-packages/pkg_resources/__init__.py:2871
../../build/gradleenv/2050596099/lib/python3.11/site-packages/pkg_resources/__init__.py:2871
../../build/gradleenv/2050596099/lib/python3.11/site-packages/pkg_resources/__init__.py:2871
../../build/gradleenv/2050596099/lib/python3.11/site-packages/pkg_resources/__init__.py:2871
../../build/gradleenv/2050596099/lib/python3.11/site-packages/pkg_resources/__init__.py:2871
<https://ci-beam.apache.org/job/beam_PostCommit_Python311/ws/src/build/gradleenv/2050596099/lib/python3.11/site-packages/pkg_resources/__init__.py>:2871: DeprecationWarning: Deprecated call to `pkg_resources.declare_namespace('google.logging')`.
Implementing implicit namespace packages (as specified in PEP 420) is preferred to `pkg_resources.declare_namespace`. See https://setuptools.pypa.io/en/latest/references/keywords.html#keyword-namespace-packages
declare_namespace(pkg)
../../build/gradleenv/2050596099/lib/python3.11/site-packages/pkg_resources/__init__.py:2871
../../build/gradleenv/2050596099/lib/python3.11/site-packages/pkg_resources/__init__.py:2871
../../build/gradleenv/2050596099/lib/python3.11/site-packages/pkg_resources/__init__.py:2871
../../build/gradleenv/2050596099/lib/python3.11/site-packages/pkg_resources/__init__.py:2871
../../build/gradleenv/2050596099/lib/python3.11/site-packages/pkg_resources/__init__.py:2871
../../build/gradleenv/2050596099/lib/python3.11/site-packages/pkg_resources/__init__.py:2871
../../build/gradleenv/2050596099/lib/python3.11/site-packages/pkg_resources/__init__.py:2871
../../build/gradleenv/2050596099/lib/python3.11/site-packages/pkg_resources/__init__.py:2871
../../build/gradleenv/2050596099/lib/python3.11/site-packages/pkg_resources/__init__.py:2871
<https://ci-beam.apache.org/job/beam_PostCommit_Python311/ws/src/build/gradleenv/2050596099/lib/python3.11/site-packages/pkg_resources/__init__.py>:2871: DeprecationWarning: Deprecated call to `pkg_resources.declare_namespace('google.iam')`.
Implementing implicit namespace packages (as specified in PEP 420) is preferred to `pkg_resources.declare_namespace`. See https://setuptools.pypa.io/en/latest/references/keywords.html#keyword-namespace-packages
declare_namespace(pkg)
../../build/gradleenv/2050596099/lib/python3.11/site-packages/google/rpc/__init__.py:20
../../build/gradleenv/2050596099/lib/python3.11/site-packages/google/rpc/__init__.py:20
../../build/gradleenv/2050596099/lib/python3.11/site-packages/google/rpc/__init__.py:20
../../build/gradleenv/2050596099/lib/python3.11/site-packages/google/rpc/__init__.py:20
../../build/gradleenv/2050596099/lib/python3.11/site-packages/google/rpc/__init__.py:20
../../build/gradleenv/2050596099/lib/python3.11/site-packages/google/rpc/__init__.py:20
../../build/gradleenv/2050596099/lib/python3.11/site-packages/google/rpc/__init__.py:20
../../build/gradleenv/2050596099/lib/python3.11/site-packages/google/rpc/__init__.py:20
../../build/gradleenv/2050596099/lib/python3.11/site-packages/google/rpc/__init__.py:20
<https://ci-beam.apache.org/job/beam_PostCommit_Python311/ws/src/build/gradleenv/2050596099/lib/python3.11/site-packages/google/rpc/__init__.py>:20: DeprecationWarning: Deprecated call to `pkg_resources.declare_namespace('google.rpc')`.
Implementing implicit namespace packages (as specified in PEP 420) is preferred to `pkg_resources.declare_namespace`. See https://setuptools.pypa.io/en/latest/references/keywords.html#keyword-namespace-packages
pkg_resources.declare_namespace(__name__)
../../build/gradleenv/2050596099/lib/python3.11/site-packages/google/api_core/operations_v1/abstract_operations_client.py:17
../../build/gradleenv/2050596099/lib/python3.11/site-packages/google/api_core/operations_v1/abstract_operations_client.py:17
../../build/gradleenv/2050596099/lib/python3.11/site-packages/google/api_core/operations_v1/abstract_operations_client.py:17
../../build/gradleenv/2050596099/lib/python3.11/site-packages/google/api_core/operations_v1/abstract_operations_client.py:17
../../build/gradleenv/2050596099/lib/python3.11/site-packages/google/api_core/operations_v1/abstract_operations_client.py:17
../../build/gradleenv/2050596099/lib/python3.11/site-packages/google/api_core/operations_v1/abstract_operations_client.py:17
../../build/gradleenv/2050596099/lib/python3.11/site-packages/google/api_core/operations_v1/abstract_operations_client.py:17
../../build/gradleenv/2050596099/lib/python3.11/site-packages/google/api_core/operations_v1/abstract_operations_client.py:17
<https://ci-beam.apache.org/job/beam_PostCommit_Python311/ws/src/build/gradleenv/2050596099/lib/python3.11/site-packages/google/api_core/operations_v1/abstract_operations_client.py>:17: DeprecationWarning: The distutils package is deprecated and slated for removal in Python 3.12. Use setuptools or check PEP 632 for potential alternatives
from distutils import util
apache_beam/dataframe/io_it_test.py: 3 warnings
apache_beam/examples/cookbook/bigquery_tornadoes_it_test.py: 1 warning
apache_beam/examples/dataframe/flight_delays_it_test.py: 1 warning
apache_beam/io/gcp/big_query_query_to_table_it_test.py: 4 warnings
apache_beam/io/gcp/bigquery_read_it_test.py: 7 warnings
apache_beam/io/gcp/bigquery_io_read_it_test.py: 2 warnings
apache_beam/io/gcp/bigquery_json_it_test.py: 3 warnings
<https://ci-beam.apache.org/job/beam_PostCommit_Python311/ws/src/sdks/python/apache_beam/io/gcp/bigquery.py>:2748: BeamDeprecationWarning: options is deprecated since First stable release. References to <pipeline>.options will not be supported
temp_location = pcoll.pipeline.options.view_as(
apache_beam/dataframe/io_it_test.py: 3 warnings
apache_beam/examples/cookbook/bigquery_tornadoes_it_test.py: 1 warning
apache_beam/examples/dataframe/flight_delays_it_test.py: 1 warning
apache_beam/io/gcp/big_query_query_to_table_it_test.py: 4 warnings
apache_beam/io/gcp/bigquery_read_it_test.py: 7 warnings
apache_beam/io/gcp/bigquery_io_read_it_test.py: 2 warnings
apache_beam/io/gcp/bigquery_json_it_test.py: 3 warnings
<https://ci-beam.apache.org/job/beam_PostCommit_Python311/ws/src/sdks/python/apache_beam/io/gcp/bigquery.py>:2750: BeamDeprecationWarning: options is deprecated since First stable release. References to <pipeline>.options will not be supported
job_name = pcoll.pipeline.options.view_as(GoogleCloudOptions).job_name
apache_beam/dataframe/io_it_test.py: 3 warnings
apache_beam/examples/cookbook/bigquery_tornadoes_it_test.py: 1 warning
apache_beam/examples/dataframe/flight_delays_it_test.py: 1 warning
apache_beam/io/gcp/big_query_query_to_table_it_test.py: 4 warnings
apache_beam/io/gcp/bigquery_read_it_test.py: 7 warnings
apache_beam/io/gcp/bigquery_io_read_it_test.py: 2 warnings
apache_beam/io/gcp/bigquery_json_it_test.py: 3 warnings
<https://ci-beam.apache.org/job/beam_PostCommit_Python311/ws/src/sdks/python/apache_beam/io/gcp/bigquery.py>:2774: BeamDeprecationWarning: options is deprecated since First stable release. References to <pipeline>.options will not be supported
pipeline_options=pcoll.pipeline.options,
apache_beam/dataframe/io_it_test.py: 2 warnings
apache_beam/io/gcp/bigquery_json_it_test.py: 1 warning
apache_beam/io/gcp/bigquery_read_it_test.py: 10 warnings
<https://ci-beam.apache.org/job/beam_PostCommit_Python311/ws/src/sdks/python/apache_beam/io/gcp/bigquery.py>:2792: BeamDeprecationWarning: options is deprecated since First stable release. References to <pipeline>.options will not be supported
project_id = pcoll.pipeline.options.view_as(GoogleCloudOptions).project
apache_beam/dataframe/io_it_test.py: 2 warnings
apache_beam/io/gcp/bigquery_json_it_test.py: 1 warning
apache_beam/io/gcp/bigquery_read_it_test.py: 10 warnings
<https://ci-beam.apache.org/job/beam_PostCommit_Python311/ws/src/sdks/python/apache_beam/io/gcp/bigquery.py>:2813: BeamDeprecationWarning: options is deprecated since First stable release. References to <pipeline>.options will not be supported
pipeline_options=pcoll.pipeline.options,
apache_beam/dataframe/io_it_test.py: 2 warnings
apache_beam/io/gcp/bigquery_json_it_test.py: 1 warning
apache_beam/io/gcp/bigquery_read_it_test.py: 10 warnings
<https://ci-beam.apache.org/job/beam_PostCommit_Python311/ws/src/sdks/python/apache_beam/io/gcp/bigquery_read_internal.py>:150: BeamDeprecationWarning: options is deprecated since First stable release. References to <pipeline>.options will not be supported
pipeline_options = input.pipeline.options
apache_beam/examples/cookbook/bigquery_tornadoes_it_test.py: 1 warning
apache_beam/io/gcp/big_query_query_to_table_it_test.py: 4 warnings
apache_beam/io/gcp/bigquery_write_it_test.py: 4 warnings
apache_beam/io/gcp/bigquery_test.py: 2 warnings
<https://ci-beam.apache.org/job/beam_PostCommit_Python311/ws/src/sdks/python/apache_beam/io/gcp/bigquery.py>:2097: BeamDeprecationWarning: options is deprecated since First stable release. References to <pipeline>.options will not be supported
self.table_reference.projectId = pcoll.pipeline.options.view_as(
apache_beam/examples/cookbook/bigquery_tornadoes_it_test.py: 1 warning
apache_beam/examples/complete/game/hourly_team_score_it_test.py: 1 warning
apache_beam/examples/complete/game/game_stats_it_test.py: 2 warnings
apache_beam/io/gcp/big_query_query_to_table_it_test.py: 4 warnings
apache_beam/examples/complete/game/leader_board_it_test.py: 2 warnings
apache_beam/io/gcp/bigquery_json_it_test.py: 2 warnings
apache_beam/io/gcp/bigquery_file_loads_test.py: 3 warnings
apache_beam/io/gcp/bigquery_test.py: 6 warnings
apache_beam/io/gcp/bigquery_write_it_test.py: 4 warnings
<https://ci-beam.apache.org/job/beam_PostCommit_Python311/ws/src/sdks/python/apache_beam/io/gcp/bigquery.py>:2101: BeamDeprecationWarning: options is deprecated since First stable release. References to <pipeline>.options will not be supported
is_streaming_pipeline = p.options.view_as(StandardOptions).streaming
apache_beam/examples/cookbook/bigquery_tornadoes_it_test.py: 1 warning
apache_beam/examples/complete/game/hourly_team_score_it_test.py: 1 warning
apache_beam/examples/complete/game/game_stats_it_test.py: 2 warnings
apache_beam/io/gcp/big_query_query_to_table_it_test.py: 4 warnings
apache_beam/examples/complete/game/leader_board_it_test.py: 2 warnings
apache_beam/io/gcp/bigquery_json_it_test.py: 2 warnings
apache_beam/io/gcp/bigquery_file_loads_test.py: 3 warnings
apache_beam/io/gcp/bigquery_test.py: 6 warnings
apache_beam/io/gcp/bigquery_write_it_test.py: 4 warnings
<https://ci-beam.apache.org/job/beam_PostCommit_Python311/ws/src/sdks/python/apache_beam/io/gcp/bigquery.py>:2107: BeamDeprecationWarning: options is deprecated since First stable release. References to <pipeline>.options will not be supported
experiments = p.options.view_as(DebugOptions).experiments or []
apache_beam/examples/cookbook/bigquery_tornadoes_it_test.py: 1 warning
apache_beam/io/gcp/big_query_query_to_table_it_test.py: 4 warnings
apache_beam/io/gcp/bigquery_file_loads_test.py: 3 warnings
apache_beam/io/gcp/bigquery_test.py: 3 warnings
apache_beam/io/gcp/bigquery_write_it_test.py: 3 warnings
<https://ci-beam.apache.org/job/beam_PostCommit_Python311/ws/src/sdks/python/apache_beam/io/gcp/bigquery_file_loads.py>:1176: BeamDeprecationWarning: options is deprecated since First stable release. References to <pipeline>.options will not be supported
self.project = self.project or p.options.view_as(GoogleCloudOptions).project
apache_beam/examples/cookbook/bigquery_tornadoes_it_test.py: 1 warning
apache_beam/examples/complete/game/hourly_team_score_it_test.py: 1 warning
apache_beam/io/gcp/big_query_query_to_table_it_test.py: 4 warnings
apache_beam/io/gcp/bigquery_file_loads_test.py: 3 warnings
apache_beam/io/gcp/bigquery_test.py: 3 warnings
apache_beam/io/gcp/bigquery_write_it_test.py: 3 warnings
<https://ci-beam.apache.org/job/beam_PostCommit_Python311/ws/src/sdks/python/apache_beam/io/gcp/bigquery_file_loads.py>:1183: BeamDeprecationWarning: options is deprecated since First stable release. References to <pipeline>.options will not be supported
temp_location = p.options.view_as(GoogleCloudOptions).temp_location
apache_beam/examples/cookbook/bigquery_tornadoes_it_test.py: 1 warning
apache_beam/examples/complete/game/hourly_team_score_it_test.py: 1 warning
apache_beam/io/gcp/big_query_query_to_table_it_test.py: 4 warnings
apache_beam/io/gcp/bigquery_file_loads_test.py: 3 warnings
apache_beam/io/gcp/bigquery_test.py: 3 warnings
apache_beam/io/gcp/bigquery_write_it_test.py: 3 warnings
<https://ci-beam.apache.org/job/beam_PostCommit_Python311/ws/src/sdks/python/apache_beam/io/gcp/bigquery_file_loads.py>:1185: BeamDeprecationWarning: options is deprecated since First stable release. References to <pipeline>.options will not be supported
p.options.view_as(GoogleCloudOptions).job_name or 'AUTOMATIC_JOB_NAME')
apache_beam/examples/cookbook/bigquery_tornadoes_it_test.py::BigqueryTornadoesIT::test_bigquery_tornadoes_it
<https://ci-beam.apache.org/job/beam_PostCommit_Python311/ws/src/sdks/python/apache_beam/io/gcp/tests/utils.py>:100: PendingDeprecationWarning: Client.dataset is deprecated and will be removed in a future version. Use a string like 'my_project.my_dataset' or a cloud.google.bigquery.DatasetReference object, instead.
table_ref = client.dataset(dataset_id).table(table_id)
apache_beam/examples/complete/game/hourly_team_score_it_test.py::HourlyTeamScoreIT::test_hourly_team_score_it
apache_beam/examples/complete/game/game_stats_it_test.py::GameStatsIT::test_game_stats_it
apache_beam/examples/complete/game/leader_board_it_test.py::LeaderBoardIT::test_leader_board_it
apache_beam/io/gcp/bigquery_test.py::PubSubBigQueryIT::test_file_loads
apache_beam/io/gcp/bigquery_test.py::PubSubBigQueryIT::test_streaming_inserts
<https://ci-beam.apache.org/job/beam_PostCommit_Python311/ws/src/sdks/python/apache_beam/io/gcp/tests/utils.py>:63: PendingDeprecationWarning: Client.dataset is deprecated and will be removed in a future version. Use a string like 'my_project.my_dataset' or a cloud.google.bigquery.DatasetReference object, instead.
dataset_ref = client.dataset(unique_dataset_name, project=project)
apache_beam/examples/dataframe/flight_delays_it_test.py::FlightDelaysTest::test_flight_delays
<https://ci-beam.apache.org/job/beam_PostCommit_Python311/ws/src/sdks/python/apache_beam/examples/dataframe/flight_delays.py>:47: FutureWarning: The default value of numeric_only in DataFrame.mean is deprecated. In a future version, it will default to False. In addition, specifying 'numeric_only=None' is deprecated. Select only valid columns or specify the value of numeric_only to silence this warning.
return airline_df[at_top_airports].mean()
apache_beam/examples/dataframe/flight_delays_it_test.py::FlightDelaysTest::test_flight_delays
apache_beam/examples/dataframe/taxiride_it_test.py::TaxirideIT::test_aggregation
apache_beam/examples/dataframe/taxiride_it_test.py::TaxirideIT::test_enrich
<https://ci-beam.apache.org/job/beam_PostCommit_Python311/ws/src/sdks/python/apache_beam/io/fileio.py>:605: BeamDeprecationWarning: options is deprecated since First stable release. References to <pipeline>.options will not be supported
p.options.view_as(GoogleCloudOptions).temp_location or
apache_beam/io/gcp/bigquery_read_it_test.py::ReadTests::test_native_source
<https://ci-beam.apache.org/job/beam_PostCommit_Python311/ws/src/sdks/python/apache_beam/io/gcp/bigquery_read_it_test.py>:170: BeamDeprecationWarning: BigQuerySource is deprecated since 2.25.0. Use ReadFromBigQuery instead.
beam.io.BigQuerySource(query=self.query, use_standard_sql=True)))
apache_beam/io/gcp/bigquery_test.py::BigQueryStreamingInsertTransformIntegrationTests::test_multiple_destinations_transform
<https://ci-beam.apache.org/job/beam_PostCommit_Python311/ws/src/sdks/python/apache_beam/io/gcp/bigquery_test.py>:1726: BeamDeprecationWarning: options is deprecated since First stable release. References to <pipeline>.options will not be supported
streaming = self.test_pipeline.options.view_as(StandardOptions).streaming
apache_beam/transforms/external_it_test.py::ExternalTransformIT::test_job_python_from_python_it
<https://ci-beam.apache.org/job/beam_PostCommit_Python311/ws/src/sdks/python/apache_beam/transforms/external.py>:679: BeamDeprecationWarning: options is deprecated since First stable release. References to <pipeline>.options will not be supported
self._expansion_service, pipeline.options)
apache_beam/io/gcp/bigquery_read_it_test.py::ReadNewTypesTests::test_native_source
<https://ci-beam.apache.org/job/beam_PostCommit_Python311/ws/src/sdks/python/apache_beam/io/gcp/bigquery_read_it_test.py>:706: BeamDeprecationWarning: BigQuerySource is deprecated since 2.25.0. Use ReadFromBigQuery instead.
beam.io.BigQuerySource(query=self.query, use_standard_sql=True)))
apache_beam/io/gcp/bigquery_read_it_test.py::ReadAllBQTests::test_read_queries
<https://ci-beam.apache.org/job/beam_PostCommit_Python311/ws/src/sdks/python/apache_beam/io/gcp/bigquery.py>:2920: BeamDeprecationWarning: options is deprecated since First stable release. References to <pipeline>.options will not be supported
job_name = pcoll.pipeline.options.view_as(GoogleCloudOptions).job_name
apache_beam/io/gcp/bigquery_read_it_test.py::ReadAllBQTests::test_read_queries
<https://ci-beam.apache.org/job/beam_PostCommit_Python311/ws/src/sdks/python/apache_beam/io/gcp/bigquery.py>:2921: BeamDeprecationWarning: options is deprecated since First stable release. References to <pipeline>.options will not be supported
project = pcoll.pipeline.options.view_as(GoogleCloudOptions).project
apache_beam/io/gcp/bigquery_read_it_test.py::ReadAllBQTests::test_read_queries
<https://ci-beam.apache.org/job/beam_PostCommit_Python311/ws/src/sdks/python/apache_beam/io/gcp/bigquery.py>:2934: BeamDeprecationWarning: options is deprecated since First stable release. References to <pipeline>.options will not be supported
options=pcoll.pipeline.options,
-- Docs: https://docs.pytest.org/en/stable/how-to/capture-warnings.html
- generated xml file: <https://ci-beam.apache.org/job/beam_PostCommit_Python311/ws/src/sdks/python/pytest_postCommitIT-df-py311.xml> -
[33m========== [32m87 passed[0m, [33m[1m51 skipped[0m, [33m[1m637 warnings[0m[33m in 8012.42s (2:13:32)[0m[33m ===========[0m
FAILURE: Build failed with an exception.
* Where:
Script '<https://ci-beam.apache.org/job/beam_PostCommit_Python311/ws/src/sdks/python/test-suites/portable/common.gradle'> line: 326
* What went wrong:
Execution failed for task ':sdks:python:test-suites:portable:py311:postCommitPy311IT'.
> Process 'command 'sh'' finished with non-zero exit value 1
* Try:
> Run with --stacktrace option to get the stack trace.
> Run with --info or --debug option to get more log output.
* Get more help at https://help.gradle.org
Deprecated Gradle features were used in this build, making it incompatible with Gradle 8.0.
You can use '--warning-mode all' to show the individual deprecation warnings and determine if they come from your own scripts or plugins.
See https://docs.gradle.org/7.6.2/userguide/command_line_interface.html#sec:command_line_warnings
Execution optimizations have been disabled for 1 invalid unit(s) of work during this build to ensure correctness.
Please consult deprecation warnings for more details.
BUILD FAILED in 2h 19m 48s
209 actionable tasks: 144 executed, 59 from cache, 6 up-to-date
Publishing build scan...
https://ge.apache.org/s/djx6sps6ekjou
Build step 'Invoke Gradle script' changed build result to FAILURE
Build step 'Invoke Gradle script' marked build as failure
---------------------------------------------------------------------
To unsubscribe, e-mail: builds-unsubscribe@beam.apache.org
For additional commands, e-mail: builds-help@beam.apache.org
Jenkins build is back to normal : beam_PostCommit_Python311 #634
Posted by Apache Jenkins Server <je...@builds.apache.org>.
See <https://ci-beam.apache.org/job/beam_PostCommit_Python311/634/display/redirect>
---------------------------------------------------------------------
To unsubscribe, e-mail: builds-unsubscribe@beam.apache.org
For additional commands, e-mail: builds-help@beam.apache.org
Build failed in Jenkins: beam_PostCommit_Python311 #633
Posted by Apache Jenkins Server <je...@builds.apache.org>.
See <https://ci-beam.apache.org/job/beam_PostCommit_Python311/633/display/redirect?page=changes>
Changes:
[noreply] Allow users to pass inference args into vertex ai model handler (#28354)
------------------------------------------
[...truncated 8.49 MB...]
Implementing implicit namespace packages (as specified in PEP 420) is preferred to `pkg_resources.declare_namespace`. See https://setuptools.pypa.io/en/latest/references/keywords.html#keyword-namespace-packages
declare_namespace(pkg)
../../build/gradleenv/2050596099/lib/python3.11/site-packages/pkg_resources/__init__.py:2350: 36 warnings
<https://ci-beam.apache.org/job/beam_PostCommit_Python311/ws/src/build/gradleenv/2050596099/lib/python3.11/site-packages/pkg_resources/__init__.py>:2350: DeprecationWarning: Deprecated call to `pkg_resources.declare_namespace('google')`.
Implementing implicit namespace packages (as specified in PEP 420) is preferred to `pkg_resources.declare_namespace`. See https://setuptools.pypa.io/en/latest/references/keywords.html#keyword-namespace-packages
declare_namespace(parent)
../../build/gradleenv/2050596099/lib/python3.11/site-packages/pkg_resources/__init__.py:2871
../../build/gradleenv/2050596099/lib/python3.11/site-packages/pkg_resources/__init__.py:2871
../../build/gradleenv/2050596099/lib/python3.11/site-packages/pkg_resources/__init__.py:2871
../../build/gradleenv/2050596099/lib/python3.11/site-packages/pkg_resources/__init__.py:2871
../../build/gradleenv/2050596099/lib/python3.11/site-packages/pkg_resources/__init__.py:2871
../../build/gradleenv/2050596099/lib/python3.11/site-packages/pkg_resources/__init__.py:2871
../../build/gradleenv/2050596099/lib/python3.11/site-packages/pkg_resources/__init__.py:2871
../../build/gradleenv/2050596099/lib/python3.11/site-packages/pkg_resources/__init__.py:2871
../../build/gradleenv/2050596099/lib/python3.11/site-packages/pkg_resources/__init__.py:2871
<https://ci-beam.apache.org/job/beam_PostCommit_Python311/ws/src/build/gradleenv/2050596099/lib/python3.11/site-packages/pkg_resources/__init__.py>:2871: DeprecationWarning: Deprecated call to `pkg_resources.declare_namespace('google.logging')`.
Implementing implicit namespace packages (as specified in PEP 420) is preferred to `pkg_resources.declare_namespace`. See https://setuptools.pypa.io/en/latest/references/keywords.html#keyword-namespace-packages
declare_namespace(pkg)
../../build/gradleenv/2050596099/lib/python3.11/site-packages/pkg_resources/__init__.py:2871
../../build/gradleenv/2050596099/lib/python3.11/site-packages/pkg_resources/__init__.py:2871
../../build/gradleenv/2050596099/lib/python3.11/site-packages/pkg_resources/__init__.py:2871
../../build/gradleenv/2050596099/lib/python3.11/site-packages/pkg_resources/__init__.py:2871
../../build/gradleenv/2050596099/lib/python3.11/site-packages/pkg_resources/__init__.py:2871
../../build/gradleenv/2050596099/lib/python3.11/site-packages/pkg_resources/__init__.py:2871
../../build/gradleenv/2050596099/lib/python3.11/site-packages/pkg_resources/__init__.py:2871
../../build/gradleenv/2050596099/lib/python3.11/site-packages/pkg_resources/__init__.py:2871
../../build/gradleenv/2050596099/lib/python3.11/site-packages/pkg_resources/__init__.py:2871
<https://ci-beam.apache.org/job/beam_PostCommit_Python311/ws/src/build/gradleenv/2050596099/lib/python3.11/site-packages/pkg_resources/__init__.py>:2871: DeprecationWarning: Deprecated call to `pkg_resources.declare_namespace('google.iam')`.
Implementing implicit namespace packages (as specified in PEP 420) is preferred to `pkg_resources.declare_namespace`. See https://setuptools.pypa.io/en/latest/references/keywords.html#keyword-namespace-packages
declare_namespace(pkg)
../../build/gradleenv/2050596099/lib/python3.11/site-packages/google/rpc/__init__.py:20
../../build/gradleenv/2050596099/lib/python3.11/site-packages/google/rpc/__init__.py:20
../../build/gradleenv/2050596099/lib/python3.11/site-packages/google/rpc/__init__.py:20
../../build/gradleenv/2050596099/lib/python3.11/site-packages/google/rpc/__init__.py:20
../../build/gradleenv/2050596099/lib/python3.11/site-packages/google/rpc/__init__.py:20
../../build/gradleenv/2050596099/lib/python3.11/site-packages/google/rpc/__init__.py:20
../../build/gradleenv/2050596099/lib/python3.11/site-packages/google/rpc/__init__.py:20
../../build/gradleenv/2050596099/lib/python3.11/site-packages/google/rpc/__init__.py:20
../../build/gradleenv/2050596099/lib/python3.11/site-packages/google/rpc/__init__.py:20
<https://ci-beam.apache.org/job/beam_PostCommit_Python311/ws/src/build/gradleenv/2050596099/lib/python3.11/site-packages/google/rpc/__init__.py>:20: DeprecationWarning: Deprecated call to `pkg_resources.declare_namespace('google.rpc')`.
Implementing implicit namespace packages (as specified in PEP 420) is preferred to `pkg_resources.declare_namespace`. See https://setuptools.pypa.io/en/latest/references/keywords.html#keyword-namespace-packages
pkg_resources.declare_namespace(__name__)
../../build/gradleenv/2050596099/lib/python3.11/site-packages/google/api_core/operations_v1/abstract_operations_client.py:17
../../build/gradleenv/2050596099/lib/python3.11/site-packages/google/api_core/operations_v1/abstract_operations_client.py:17
../../build/gradleenv/2050596099/lib/python3.11/site-packages/google/api_core/operations_v1/abstract_operations_client.py:17
../../build/gradleenv/2050596099/lib/python3.11/site-packages/google/api_core/operations_v1/abstract_operations_client.py:17
../../build/gradleenv/2050596099/lib/python3.11/site-packages/google/api_core/operations_v1/abstract_operations_client.py:17
../../build/gradleenv/2050596099/lib/python3.11/site-packages/google/api_core/operations_v1/abstract_operations_client.py:17
../../build/gradleenv/2050596099/lib/python3.11/site-packages/google/api_core/operations_v1/abstract_operations_client.py:17
../../build/gradleenv/2050596099/lib/python3.11/site-packages/google/api_core/operations_v1/abstract_operations_client.py:17
<https://ci-beam.apache.org/job/beam_PostCommit_Python311/ws/src/build/gradleenv/2050596099/lib/python3.11/site-packages/google/api_core/operations_v1/abstract_operations_client.py>:17: DeprecationWarning: The distutils package is deprecated and slated for removal in Python 3.12. Use setuptools or check PEP 632 for potential alternatives
from distutils import util
apache_beam/dataframe/io_it_test.py: 3 warnings
apache_beam/examples/cookbook/bigquery_tornadoes_it_test.py: 1 warning
apache_beam/examples/dataframe/flight_delays_it_test.py: 1 warning
apache_beam/io/gcp/bigquery_read_it_test.py: 7 warnings
apache_beam/io/gcp/bigquery_io_read_it_test.py: 2 warnings
apache_beam/io/gcp/bigquery_json_it_test.py: 3 warnings
apache_beam/io/gcp/big_query_query_to_table_it_test.py: 4 warnings
<https://ci-beam.apache.org/job/beam_PostCommit_Python311/ws/src/sdks/python/apache_beam/io/gcp/bigquery.py>:2748: BeamDeprecationWarning: options is deprecated since First stable release. References to <pipeline>.options will not be supported
temp_location = pcoll.pipeline.options.view_as(
apache_beam/dataframe/io_it_test.py: 3 warnings
apache_beam/examples/cookbook/bigquery_tornadoes_it_test.py: 1 warning
apache_beam/examples/dataframe/flight_delays_it_test.py: 1 warning
apache_beam/io/gcp/bigquery_read_it_test.py: 7 warnings
apache_beam/io/gcp/bigquery_io_read_it_test.py: 2 warnings
apache_beam/io/gcp/bigquery_json_it_test.py: 3 warnings
apache_beam/io/gcp/big_query_query_to_table_it_test.py: 4 warnings
<https://ci-beam.apache.org/job/beam_PostCommit_Python311/ws/src/sdks/python/apache_beam/io/gcp/bigquery.py>:2750: BeamDeprecationWarning: options is deprecated since First stable release. References to <pipeline>.options will not be supported
job_name = pcoll.pipeline.options.view_as(GoogleCloudOptions).job_name
apache_beam/dataframe/io_it_test.py: 3 warnings
apache_beam/examples/cookbook/bigquery_tornadoes_it_test.py: 1 warning
apache_beam/examples/dataframe/flight_delays_it_test.py: 1 warning
apache_beam/io/gcp/bigquery_read_it_test.py: 7 warnings
apache_beam/io/gcp/bigquery_io_read_it_test.py: 2 warnings
apache_beam/io/gcp/bigquery_json_it_test.py: 3 warnings
apache_beam/io/gcp/big_query_query_to_table_it_test.py: 4 warnings
<https://ci-beam.apache.org/job/beam_PostCommit_Python311/ws/src/sdks/python/apache_beam/io/gcp/bigquery.py>:2774: BeamDeprecationWarning: options is deprecated since First stable release. References to <pipeline>.options will not be supported
pipeline_options=pcoll.pipeline.options,
apache_beam/dataframe/io_it_test.py: 2 warnings
apache_beam/io/gcp/bigquery_json_it_test.py: 1 warning
apache_beam/io/gcp/bigquery_read_it_test.py: 10 warnings
<https://ci-beam.apache.org/job/beam_PostCommit_Python311/ws/src/sdks/python/apache_beam/io/gcp/bigquery.py>:2792: BeamDeprecationWarning: options is deprecated since First stable release. References to <pipeline>.options will not be supported
project_id = pcoll.pipeline.options.view_as(GoogleCloudOptions).project
apache_beam/dataframe/io_it_test.py: 2 warnings
apache_beam/io/gcp/bigquery_json_it_test.py: 1 warning
apache_beam/io/gcp/bigquery_read_it_test.py: 10 warnings
<https://ci-beam.apache.org/job/beam_PostCommit_Python311/ws/src/sdks/python/apache_beam/io/gcp/bigquery.py>:2813: BeamDeprecationWarning: options is deprecated since First stable release. References to <pipeline>.options will not be supported
pipeline_options=pcoll.pipeline.options,
apache_beam/dataframe/io_it_test.py: 2 warnings
apache_beam/io/gcp/bigquery_json_it_test.py: 1 warning
apache_beam/io/gcp/bigquery_read_it_test.py: 10 warnings
<https://ci-beam.apache.org/job/beam_PostCommit_Python311/ws/src/sdks/python/apache_beam/io/gcp/bigquery_read_internal.py>:150: BeamDeprecationWarning: options is deprecated since First stable release. References to <pipeline>.options will not be supported
pipeline_options = input.pipeline.options
apache_beam/examples/cookbook/bigquery_tornadoes_it_test.py: 1 warning
apache_beam/io/gcp/bigquery_write_it_test.py: 4 warnings
apache_beam/io/gcp/big_query_query_to_table_it_test.py: 4 warnings
apache_beam/io/gcp/bigquery_test.py: 2 warnings
<https://ci-beam.apache.org/job/beam_PostCommit_Python311/ws/src/sdks/python/apache_beam/io/gcp/bigquery.py>:2097: BeamDeprecationWarning: options is deprecated since First stable release. References to <pipeline>.options will not be supported
self.table_reference.projectId = pcoll.pipeline.options.view_as(
apache_beam/examples/cookbook/bigquery_tornadoes_it_test.py: 1 warning
apache_beam/examples/complete/game/hourly_team_score_it_test.py: 1 warning
apache_beam/examples/complete/game/game_stats_it_test.py: 2 warnings
apache_beam/examples/complete/game/leader_board_it_test.py: 2 warnings
apache_beam/io/gcp/bigquery_file_loads_test.py: 3 warnings
apache_beam/io/gcp/bigquery_write_it_test.py: 4 warnings
apache_beam/io/gcp/bigquery_json_it_test.py: 2 warnings
apache_beam/io/gcp/big_query_query_to_table_it_test.py: 4 warnings
apache_beam/io/gcp/bigquery_test.py: 6 warnings
<https://ci-beam.apache.org/job/beam_PostCommit_Python311/ws/src/sdks/python/apache_beam/io/gcp/bigquery.py>:2101: BeamDeprecationWarning: options is deprecated since First stable release. References to <pipeline>.options will not be supported
is_streaming_pipeline = p.options.view_as(StandardOptions).streaming
apache_beam/examples/cookbook/bigquery_tornadoes_it_test.py: 1 warning
apache_beam/examples/complete/game/hourly_team_score_it_test.py: 1 warning
apache_beam/examples/complete/game/game_stats_it_test.py: 2 warnings
apache_beam/examples/complete/game/leader_board_it_test.py: 2 warnings
apache_beam/io/gcp/bigquery_file_loads_test.py: 3 warnings
apache_beam/io/gcp/bigquery_write_it_test.py: 4 warnings
apache_beam/io/gcp/bigquery_json_it_test.py: 2 warnings
apache_beam/io/gcp/big_query_query_to_table_it_test.py: 4 warnings
apache_beam/io/gcp/bigquery_test.py: 6 warnings
<https://ci-beam.apache.org/job/beam_PostCommit_Python311/ws/src/sdks/python/apache_beam/io/gcp/bigquery.py>:2107: BeamDeprecationWarning: options is deprecated since First stable release. References to <pipeline>.options will not be supported
experiments = p.options.view_as(DebugOptions).experiments or []
apache_beam/examples/cookbook/bigquery_tornadoes_it_test.py: 1 warning
apache_beam/io/gcp/bigquery_file_loads_test.py: 3 warnings
apache_beam/io/gcp/bigquery_write_it_test.py: 3 warnings
apache_beam/io/gcp/big_query_query_to_table_it_test.py: 4 warnings
apache_beam/io/gcp/bigquery_test.py: 3 warnings
<https://ci-beam.apache.org/job/beam_PostCommit_Python311/ws/src/sdks/python/apache_beam/io/gcp/bigquery_file_loads.py>:1176: BeamDeprecationWarning: options is deprecated since First stable release. References to <pipeline>.options will not be supported
self.project = self.project or p.options.view_as(GoogleCloudOptions).project
apache_beam/examples/cookbook/bigquery_tornadoes_it_test.py: 1 warning
apache_beam/examples/complete/game/hourly_team_score_it_test.py: 1 warning
apache_beam/io/gcp/bigquery_file_loads_test.py: 3 warnings
apache_beam/io/gcp/bigquery_write_it_test.py: 3 warnings
apache_beam/io/gcp/big_query_query_to_table_it_test.py: 4 warnings
apache_beam/io/gcp/bigquery_test.py: 3 warnings
<https://ci-beam.apache.org/job/beam_PostCommit_Python311/ws/src/sdks/python/apache_beam/io/gcp/bigquery_file_loads.py>:1183: BeamDeprecationWarning: options is deprecated since First stable release. References to <pipeline>.options will not be supported
temp_location = p.options.view_as(GoogleCloudOptions).temp_location
apache_beam/examples/cookbook/bigquery_tornadoes_it_test.py: 1 warning
apache_beam/examples/complete/game/hourly_team_score_it_test.py: 1 warning
apache_beam/io/gcp/bigquery_file_loads_test.py: 3 warnings
apache_beam/io/gcp/bigquery_write_it_test.py: 3 warnings
apache_beam/io/gcp/big_query_query_to_table_it_test.py: 4 warnings
apache_beam/io/gcp/bigquery_test.py: 3 warnings
<https://ci-beam.apache.org/job/beam_PostCommit_Python311/ws/src/sdks/python/apache_beam/io/gcp/bigquery_file_loads.py>:1185: BeamDeprecationWarning: options is deprecated since First stable release. References to <pipeline>.options will not be supported
p.options.view_as(GoogleCloudOptions).job_name or 'AUTOMATIC_JOB_NAME')
apache_beam/examples/cookbook/bigquery_tornadoes_it_test.py::BigqueryTornadoesIT::test_bigquery_tornadoes_it
<https://ci-beam.apache.org/job/beam_PostCommit_Python311/ws/src/sdks/python/apache_beam/io/gcp/tests/utils.py>:100: PendingDeprecationWarning: Client.dataset is deprecated and will be removed in a future version. Use a string like 'my_project.my_dataset' or a cloud.google.bigquery.DatasetReference object, instead.
table_ref = client.dataset(dataset_id).table(table_id)
apache_beam/examples/complete/game/hourly_team_score_it_test.py::HourlyTeamScoreIT::test_hourly_team_score_it
apache_beam/examples/complete/game/game_stats_it_test.py::GameStatsIT::test_game_stats_it
apache_beam/examples/complete/game/leader_board_it_test.py::LeaderBoardIT::test_leader_board_it
apache_beam/io/gcp/bigquery_test.py::PubSubBigQueryIT::test_file_loads
apache_beam/io/gcp/bigquery_test.py::PubSubBigQueryIT::test_streaming_inserts
<https://ci-beam.apache.org/job/beam_PostCommit_Python311/ws/src/sdks/python/apache_beam/io/gcp/tests/utils.py>:63: PendingDeprecationWarning: Client.dataset is deprecated and will be removed in a future version. Use a string like 'my_project.my_dataset' or a cloud.google.bigquery.DatasetReference object, instead.
dataset_ref = client.dataset(unique_dataset_name, project=project)
apache_beam/examples/dataframe/flight_delays_it_test.py::FlightDelaysTest::test_flight_delays
<https://ci-beam.apache.org/job/beam_PostCommit_Python311/ws/src/sdks/python/apache_beam/examples/dataframe/flight_delays.py>:47: FutureWarning: The default value of numeric_only in DataFrame.mean is deprecated. In a future version, it will default to False. In addition, specifying 'numeric_only=None' is deprecated. Select only valid columns or specify the value of numeric_only to silence this warning.
return airline_df[at_top_airports].mean()
apache_beam/examples/dataframe/flight_delays_it_test.py::FlightDelaysTest::test_flight_delays
apache_beam/examples/dataframe/taxiride_it_test.py::TaxirideIT::test_aggregation
apache_beam/examples/dataframe/taxiride_it_test.py::TaxirideIT::test_enrich
<https://ci-beam.apache.org/job/beam_PostCommit_Python311/ws/src/sdks/python/apache_beam/io/fileio.py>:605: BeamDeprecationWarning: options is deprecated since First stable release. References to <pipeline>.options will not be supported
p.options.view_as(GoogleCloudOptions).temp_location or
apache_beam/io/gcp/bigquery_read_it_test.py::ReadTests::test_native_source
<https://ci-beam.apache.org/job/beam_PostCommit_Python311/ws/src/sdks/python/apache_beam/io/gcp/bigquery_read_it_test.py>:170: BeamDeprecationWarning: BigQuerySource is deprecated since 2.25.0. Use ReadFromBigQuery instead.
beam.io.BigQuerySource(query=self.query, use_standard_sql=True)))
apache_beam/io/gcp/bigquery_test.py::BigQueryStreamingInsertTransformIntegrationTests::test_multiple_destinations_transform
<https://ci-beam.apache.org/job/beam_PostCommit_Python311/ws/src/sdks/python/apache_beam/io/gcp/bigquery_test.py>:1726: BeamDeprecationWarning: options is deprecated since First stable release. References to <pipeline>.options will not be supported
streaming = self.test_pipeline.options.view_as(StandardOptions).streaming
apache_beam/transforms/external_it_test.py::ExternalTransformIT::test_job_python_from_python_it
<https://ci-beam.apache.org/job/beam_PostCommit_Python311/ws/src/sdks/python/apache_beam/transforms/external.py>:679: BeamDeprecationWarning: options is deprecated since First stable release. References to <pipeline>.options will not be supported
self._expansion_service, pipeline.options)
apache_beam/io/gcp/bigquery_read_it_test.py::ReadNewTypesTests::test_native_source
<https://ci-beam.apache.org/job/beam_PostCommit_Python311/ws/src/sdks/python/apache_beam/io/gcp/bigquery_read_it_test.py>:706: BeamDeprecationWarning: BigQuerySource is deprecated since 2.25.0. Use ReadFromBigQuery instead.
beam.io.BigQuerySource(query=self.query, use_standard_sql=True)))
apache_beam/io/gcp/bigquery_read_it_test.py::ReadAllBQTests::test_read_queries
<https://ci-beam.apache.org/job/beam_PostCommit_Python311/ws/src/sdks/python/apache_beam/io/gcp/bigquery.py>:2920: BeamDeprecationWarning: options is deprecated since First stable release. References to <pipeline>.options will not be supported
job_name = pcoll.pipeline.options.view_as(GoogleCloudOptions).job_name
apache_beam/io/gcp/bigquery_read_it_test.py::ReadAllBQTests::test_read_queries
<https://ci-beam.apache.org/job/beam_PostCommit_Python311/ws/src/sdks/python/apache_beam/io/gcp/bigquery.py>:2921: BeamDeprecationWarning: options is deprecated since First stable release. References to <pipeline>.options will not be supported
project = pcoll.pipeline.options.view_as(GoogleCloudOptions).project
apache_beam/io/gcp/bigquery_read_it_test.py::ReadAllBQTests::test_read_queries
<https://ci-beam.apache.org/job/beam_PostCommit_Python311/ws/src/sdks/python/apache_beam/io/gcp/bigquery.py>:2934: BeamDeprecationWarning: options is deprecated since First stable release. References to <pipeline>.options will not be supported
options=pcoll.pipeline.options,
-- Docs: https://docs.pytest.org/en/stable/how-to/capture-warnings.html
- generated xml file: <https://ci-beam.apache.org/job/beam_PostCommit_Python311/ws/src/sdks/python/pytest_postCommitIT-df-py311.xml> -
[33m========== [32m87 passed[0m, [33m[1m51 skipped[0m, [33m[1m628 warnings[0m[33m in 7589.14s (2:06:29)[0m[33m ===========[0m
FAILURE: Build failed with an exception.
* Where:
Script '<https://ci-beam.apache.org/job/beam_PostCommit_Python311/ws/src/sdks/python/test-suites/portable/common.gradle'> line: 326
* What went wrong:
Execution failed for task ':sdks:python:test-suites:portable:py311:postCommitPy311IT'.
> Process 'command 'sh'' finished with non-zero exit value 1
* Try:
> Run with --stacktrace option to get the stack trace.
> Run with --info or --debug option to get more log output.
* Get more help at https://help.gradle.org
Deprecated Gradle features were used in this build, making it incompatible with Gradle 8.0.
You can use '--warning-mode all' to show the individual deprecation warnings and determine if they come from your own scripts or plugins.
See https://docs.gradle.org/7.6.2/userguide/command_line_interface.html#sec:command_line_warnings
Execution optimizations have been disabled for 1 invalid unit(s) of work during this build to ensure correctness.
Please consult deprecation warnings for more details.
BUILD FAILED in 2h 13m 15s
209 actionable tasks: 145 executed, 58 from cache, 6 up-to-date
Publishing build scan...
https://ge.apache.org/s/ucd7h4rnyl45q
Build step 'Invoke Gradle script' changed build result to FAILURE
Build step 'Invoke Gradle script' marked build as failure
---------------------------------------------------------------------
To unsubscribe, e-mail: builds-unsubscribe@beam.apache.org
For additional commands, e-mail: builds-help@beam.apache.org
Build failed in Jenkins: beam_PostCommit_Python311 #632
Posted by Apache Jenkins Server <je...@builds.apache.org>.
See <https://ci-beam.apache.org/job/beam_PostCommit_Python311/632/display/redirect>
Changes:
------------------------------------------
[...truncated 4.07 MB...]
Implementing implicit namespace packages (as specified in PEP 420) is preferred to `pkg_resources.declare_namespace`. See https://setuptools.pypa.io/en/latest/references/keywords.html#keyword-namespace-packages
declare_namespace(pkg)
../../build/gradleenv/2050596099/lib/python3.11/site-packages/pkg_resources/__init__.py:2350: 36 warnings
<https://ci-beam.apache.org/job/beam_PostCommit_Python311/ws/src/build/gradleenv/2050596099/lib/python3.11/site-packages/pkg_resources/__init__.py>:2350: DeprecationWarning: Deprecated call to `pkg_resources.declare_namespace('google')`.
Implementing implicit namespace packages (as specified in PEP 420) is preferred to `pkg_resources.declare_namespace`. See https://setuptools.pypa.io/en/latest/references/keywords.html#keyword-namespace-packages
declare_namespace(parent)
../../build/gradleenv/2050596099/lib/python3.11/site-packages/pkg_resources/__init__.py:2871
../../build/gradleenv/2050596099/lib/python3.11/site-packages/pkg_resources/__init__.py:2871
../../build/gradleenv/2050596099/lib/python3.11/site-packages/pkg_resources/__init__.py:2871
../../build/gradleenv/2050596099/lib/python3.11/site-packages/pkg_resources/__init__.py:2871
../../build/gradleenv/2050596099/lib/python3.11/site-packages/pkg_resources/__init__.py:2871
../../build/gradleenv/2050596099/lib/python3.11/site-packages/pkg_resources/__init__.py:2871
../../build/gradleenv/2050596099/lib/python3.11/site-packages/pkg_resources/__init__.py:2871
../../build/gradleenv/2050596099/lib/python3.11/site-packages/pkg_resources/__init__.py:2871
../../build/gradleenv/2050596099/lib/python3.11/site-packages/pkg_resources/__init__.py:2871
<https://ci-beam.apache.org/job/beam_PostCommit_Python311/ws/src/build/gradleenv/2050596099/lib/python3.11/site-packages/pkg_resources/__init__.py>:2871: DeprecationWarning: Deprecated call to `pkg_resources.declare_namespace('google.logging')`.
Implementing implicit namespace packages (as specified in PEP 420) is preferred to `pkg_resources.declare_namespace`. See https://setuptools.pypa.io/en/latest/references/keywords.html#keyword-namespace-packages
declare_namespace(pkg)
../../build/gradleenv/2050596099/lib/python3.11/site-packages/pkg_resources/__init__.py:2871
../../build/gradleenv/2050596099/lib/python3.11/site-packages/pkg_resources/__init__.py:2871
../../build/gradleenv/2050596099/lib/python3.11/site-packages/pkg_resources/__init__.py:2871
../../build/gradleenv/2050596099/lib/python3.11/site-packages/pkg_resources/__init__.py:2871
../../build/gradleenv/2050596099/lib/python3.11/site-packages/pkg_resources/__init__.py:2871
../../build/gradleenv/2050596099/lib/python3.11/site-packages/pkg_resources/__init__.py:2871
../../build/gradleenv/2050596099/lib/python3.11/site-packages/pkg_resources/__init__.py:2871
../../build/gradleenv/2050596099/lib/python3.11/site-packages/pkg_resources/__init__.py:2871
../../build/gradleenv/2050596099/lib/python3.11/site-packages/pkg_resources/__init__.py:2871
<https://ci-beam.apache.org/job/beam_PostCommit_Python311/ws/src/build/gradleenv/2050596099/lib/python3.11/site-packages/pkg_resources/__init__.py>:2871: DeprecationWarning: Deprecated call to `pkg_resources.declare_namespace('google.iam')`.
Implementing implicit namespace packages (as specified in PEP 420) is preferred to `pkg_resources.declare_namespace`. See https://setuptools.pypa.io/en/latest/references/keywords.html#keyword-namespace-packages
declare_namespace(pkg)
../../build/gradleenv/2050596099/lib/python3.11/site-packages/google/rpc/__init__.py:20
../../build/gradleenv/2050596099/lib/python3.11/site-packages/google/rpc/__init__.py:20
../../build/gradleenv/2050596099/lib/python3.11/site-packages/google/rpc/__init__.py:20
../../build/gradleenv/2050596099/lib/python3.11/site-packages/google/rpc/__init__.py:20
../../build/gradleenv/2050596099/lib/python3.11/site-packages/google/rpc/__init__.py:20
../../build/gradleenv/2050596099/lib/python3.11/site-packages/google/rpc/__init__.py:20
../../build/gradleenv/2050596099/lib/python3.11/site-packages/google/rpc/__init__.py:20
../../build/gradleenv/2050596099/lib/python3.11/site-packages/google/rpc/__init__.py:20
../../build/gradleenv/2050596099/lib/python3.11/site-packages/google/rpc/__init__.py:20
<https://ci-beam.apache.org/job/beam_PostCommit_Python311/ws/src/build/gradleenv/2050596099/lib/python3.11/site-packages/google/rpc/__init__.py>:20: DeprecationWarning: Deprecated call to `pkg_resources.declare_namespace('google.rpc')`.
Implementing implicit namespace packages (as specified in PEP 420) is preferred to `pkg_resources.declare_namespace`. See https://setuptools.pypa.io/en/latest/references/keywords.html#keyword-namespace-packages
pkg_resources.declare_namespace(__name__)
../../build/gradleenv/2050596099/lib/python3.11/site-packages/google/api_core/operations_v1/abstract_operations_client.py:17
../../build/gradleenv/2050596099/lib/python3.11/site-packages/google/api_core/operations_v1/abstract_operations_client.py:17
../../build/gradleenv/2050596099/lib/python3.11/site-packages/google/api_core/operations_v1/abstract_operations_client.py:17
../../build/gradleenv/2050596099/lib/python3.11/site-packages/google/api_core/operations_v1/abstract_operations_client.py:17
../../build/gradleenv/2050596099/lib/python3.11/site-packages/google/api_core/operations_v1/abstract_operations_client.py:17
../../build/gradleenv/2050596099/lib/python3.11/site-packages/google/api_core/operations_v1/abstract_operations_client.py:17
../../build/gradleenv/2050596099/lib/python3.11/site-packages/google/api_core/operations_v1/abstract_operations_client.py:17
../../build/gradleenv/2050596099/lib/python3.11/site-packages/google/api_core/operations_v1/abstract_operations_client.py:17
<https://ci-beam.apache.org/job/beam_PostCommit_Python311/ws/src/build/gradleenv/2050596099/lib/python3.11/site-packages/google/api_core/operations_v1/abstract_operations_client.py>:17: DeprecationWarning: The distutils package is deprecated and slated for removal in Python 3.12. Use setuptools or check PEP 632 for potential alternatives
from distutils import util
apache_beam/dataframe/io_it_test.py: 3 warnings
apache_beam/examples/cookbook/bigquery_tornadoes_it_test.py: 1 warning
apache_beam/examples/dataframe/flight_delays_it_test.py: 1 warning
apache_beam/io/gcp/bigquery_io_read_it_test.py: 2 warnings
apache_beam/io/gcp/bigquery_read_it_test.py: 7 warnings
apache_beam/io/gcp/bigquery_json_it_test.py: 3 warnings
apache_beam/io/gcp/big_query_query_to_table_it_test.py: 4 warnings
<https://ci-beam.apache.org/job/beam_PostCommit_Python311/ws/src/sdks/python/apache_beam/io/gcp/bigquery.py>:2748: BeamDeprecationWarning: options is deprecated since First stable release. References to <pipeline>.options will not be supported
temp_location = pcoll.pipeline.options.view_as(
apache_beam/dataframe/io_it_test.py: 3 warnings
apache_beam/examples/cookbook/bigquery_tornadoes_it_test.py: 1 warning
apache_beam/examples/dataframe/flight_delays_it_test.py: 1 warning
apache_beam/io/gcp/bigquery_io_read_it_test.py: 2 warnings
apache_beam/io/gcp/bigquery_read_it_test.py: 7 warnings
apache_beam/io/gcp/bigquery_json_it_test.py: 3 warnings
apache_beam/io/gcp/big_query_query_to_table_it_test.py: 4 warnings
<https://ci-beam.apache.org/job/beam_PostCommit_Python311/ws/src/sdks/python/apache_beam/io/gcp/bigquery.py>:2750: BeamDeprecationWarning: options is deprecated since First stable release. References to <pipeline>.options will not be supported
job_name = pcoll.pipeline.options.view_as(GoogleCloudOptions).job_name
apache_beam/dataframe/io_it_test.py: 3 warnings
apache_beam/examples/cookbook/bigquery_tornadoes_it_test.py: 1 warning
apache_beam/examples/dataframe/flight_delays_it_test.py: 1 warning
apache_beam/io/gcp/bigquery_io_read_it_test.py: 2 warnings
apache_beam/io/gcp/bigquery_read_it_test.py: 7 warnings
apache_beam/io/gcp/bigquery_json_it_test.py: 3 warnings
apache_beam/io/gcp/big_query_query_to_table_it_test.py: 4 warnings
<https://ci-beam.apache.org/job/beam_PostCommit_Python311/ws/src/sdks/python/apache_beam/io/gcp/bigquery.py>:2774: BeamDeprecationWarning: options is deprecated since First stable release. References to <pipeline>.options will not be supported
pipeline_options=pcoll.pipeline.options,
apache_beam/dataframe/io_it_test.py: 2 warnings
apache_beam/io/gcp/bigquery_json_it_test.py: 1 warning
apache_beam/io/gcp/bigquery_read_it_test.py: 10 warnings
<https://ci-beam.apache.org/job/beam_PostCommit_Python311/ws/src/sdks/python/apache_beam/io/gcp/bigquery.py>:2792: BeamDeprecationWarning: options is deprecated since First stable release. References to <pipeline>.options will not be supported
project_id = pcoll.pipeline.options.view_as(GoogleCloudOptions).project
apache_beam/dataframe/io_it_test.py: 2 warnings
apache_beam/io/gcp/bigquery_json_it_test.py: 1 warning
apache_beam/io/gcp/bigquery_read_it_test.py: 10 warnings
<https://ci-beam.apache.org/job/beam_PostCommit_Python311/ws/src/sdks/python/apache_beam/io/gcp/bigquery.py>:2813: BeamDeprecationWarning: options is deprecated since First stable release. References to <pipeline>.options will not be supported
pipeline_options=pcoll.pipeline.options,
apache_beam/dataframe/io_it_test.py: 2 warnings
apache_beam/io/gcp/bigquery_json_it_test.py: 1 warning
apache_beam/io/gcp/bigquery_read_it_test.py: 10 warnings
<https://ci-beam.apache.org/job/beam_PostCommit_Python311/ws/src/sdks/python/apache_beam/io/gcp/bigquery_read_internal.py>:150: BeamDeprecationWarning: options is deprecated since First stable release. References to <pipeline>.options will not be supported
pipeline_options = input.pipeline.options
apache_beam/examples/cookbook/bigquery_tornadoes_it_test.py: 1 warning
apache_beam/io/gcp/bigquery_write_it_test.py: 4 warnings
apache_beam/io/gcp/big_query_query_to_table_it_test.py: 4 warnings
apache_beam/io/gcp/bigquery_test.py: 2 warnings
<https://ci-beam.apache.org/job/beam_PostCommit_Python311/ws/src/sdks/python/apache_beam/io/gcp/bigquery.py>:2097: BeamDeprecationWarning: options is deprecated since First stable release. References to <pipeline>.options will not be supported
self.table_reference.projectId = pcoll.pipeline.options.view_as(
apache_beam/examples/cookbook/bigquery_tornadoes_it_test.py: 1 warning
apache_beam/examples/complete/game/hourly_team_score_it_test.py: 1 warning
apache_beam/examples/complete/game/game_stats_it_test.py: 2 warnings
apache_beam/examples/complete/game/leader_board_it_test.py: 2 warnings
apache_beam/io/gcp/bigquery_file_loads_test.py: 3 warnings
apache_beam/io/gcp/bigquery_write_it_test.py: 4 warnings
apache_beam/io/gcp/bigquery_json_it_test.py: 2 warnings
apache_beam/io/gcp/big_query_query_to_table_it_test.py: 4 warnings
apache_beam/io/gcp/bigquery_test.py: 6 warnings
<https://ci-beam.apache.org/job/beam_PostCommit_Python311/ws/src/sdks/python/apache_beam/io/gcp/bigquery.py>:2101: BeamDeprecationWarning: options is deprecated since First stable release. References to <pipeline>.options will not be supported
is_streaming_pipeline = p.options.view_as(StandardOptions).streaming
apache_beam/examples/cookbook/bigquery_tornadoes_it_test.py: 1 warning
apache_beam/examples/complete/game/hourly_team_score_it_test.py: 1 warning
apache_beam/examples/complete/game/game_stats_it_test.py: 2 warnings
apache_beam/examples/complete/game/leader_board_it_test.py: 2 warnings
apache_beam/io/gcp/bigquery_file_loads_test.py: 3 warnings
apache_beam/io/gcp/bigquery_write_it_test.py: 4 warnings
apache_beam/io/gcp/bigquery_json_it_test.py: 2 warnings
apache_beam/io/gcp/big_query_query_to_table_it_test.py: 4 warnings
apache_beam/io/gcp/bigquery_test.py: 6 warnings
<https://ci-beam.apache.org/job/beam_PostCommit_Python311/ws/src/sdks/python/apache_beam/io/gcp/bigquery.py>:2107: BeamDeprecationWarning: options is deprecated since First stable release. References to <pipeline>.options will not be supported
experiments = p.options.view_as(DebugOptions).experiments or []
apache_beam/examples/cookbook/bigquery_tornadoes_it_test.py: 1 warning
apache_beam/io/gcp/bigquery_file_loads_test.py: 3 warnings
apache_beam/io/gcp/bigquery_write_it_test.py: 3 warnings
apache_beam/io/gcp/big_query_query_to_table_it_test.py: 4 warnings
apache_beam/io/gcp/bigquery_test.py: 3 warnings
<https://ci-beam.apache.org/job/beam_PostCommit_Python311/ws/src/sdks/python/apache_beam/io/gcp/bigquery_file_loads.py>:1176: BeamDeprecationWarning: options is deprecated since First stable release. References to <pipeline>.options will not be supported
self.project = self.project or p.options.view_as(GoogleCloudOptions).project
apache_beam/examples/cookbook/bigquery_tornadoes_it_test.py: 1 warning
apache_beam/examples/complete/game/hourly_team_score_it_test.py: 1 warning
apache_beam/io/gcp/bigquery_file_loads_test.py: 3 warnings
apache_beam/io/gcp/bigquery_write_it_test.py: 3 warnings
apache_beam/io/gcp/big_query_query_to_table_it_test.py: 4 warnings
apache_beam/io/gcp/bigquery_test.py: 3 warnings
<https://ci-beam.apache.org/job/beam_PostCommit_Python311/ws/src/sdks/python/apache_beam/io/gcp/bigquery_file_loads.py>:1183: BeamDeprecationWarning: options is deprecated since First stable release. References to <pipeline>.options will not be supported
temp_location = p.options.view_as(GoogleCloudOptions).temp_location
apache_beam/examples/cookbook/bigquery_tornadoes_it_test.py: 1 warning
apache_beam/examples/complete/game/hourly_team_score_it_test.py: 1 warning
apache_beam/io/gcp/bigquery_file_loads_test.py: 3 warnings
apache_beam/io/gcp/bigquery_write_it_test.py: 3 warnings
apache_beam/io/gcp/big_query_query_to_table_it_test.py: 4 warnings
apache_beam/io/gcp/bigquery_test.py: 3 warnings
<https://ci-beam.apache.org/job/beam_PostCommit_Python311/ws/src/sdks/python/apache_beam/io/gcp/bigquery_file_loads.py>:1185: BeamDeprecationWarning: options is deprecated since First stable release. References to <pipeline>.options will not be supported
p.options.view_as(GoogleCloudOptions).job_name or 'AUTOMATIC_JOB_NAME')
apache_beam/examples/cookbook/bigquery_tornadoes_it_test.py::BigqueryTornadoesIT::test_bigquery_tornadoes_it
<https://ci-beam.apache.org/job/beam_PostCommit_Python311/ws/src/sdks/python/apache_beam/io/gcp/tests/utils.py>:100: PendingDeprecationWarning: Client.dataset is deprecated and will be removed in a future version. Use a string like 'my_project.my_dataset' or a cloud.google.bigquery.DatasetReference object, instead.
table_ref = client.dataset(dataset_id).table(table_id)
apache_beam/examples/complete/game/hourly_team_score_it_test.py::HourlyTeamScoreIT::test_hourly_team_score_it
apache_beam/examples/complete/game/game_stats_it_test.py::GameStatsIT::test_game_stats_it
apache_beam/examples/complete/game/leader_board_it_test.py::LeaderBoardIT::test_leader_board_it
apache_beam/io/gcp/bigquery_test.py::PubSubBigQueryIT::test_file_loads
apache_beam/io/gcp/bigquery_test.py::PubSubBigQueryIT::test_streaming_inserts
<https://ci-beam.apache.org/job/beam_PostCommit_Python311/ws/src/sdks/python/apache_beam/io/gcp/tests/utils.py>:63: PendingDeprecationWarning: Client.dataset is deprecated and will be removed in a future version. Use a string like 'my_project.my_dataset' or a cloud.google.bigquery.DatasetReference object, instead.
dataset_ref = client.dataset(unique_dataset_name, project=project)
apache_beam/examples/dataframe/taxiride_it_test.py::TaxirideIT::test_aggregation
apache_beam/examples/dataframe/flight_delays_it_test.py::FlightDelaysTest::test_flight_delays
apache_beam/examples/dataframe/taxiride_it_test.py::TaxirideIT::test_enrich
<https://ci-beam.apache.org/job/beam_PostCommit_Python311/ws/src/sdks/python/apache_beam/io/fileio.py>:605: BeamDeprecationWarning: options is deprecated since First stable release. References to <pipeline>.options will not be supported
p.options.view_as(GoogleCloudOptions).temp_location or
apache_beam/examples/dataframe/flight_delays_it_test.py::FlightDelaysTest::test_flight_delays
<https://ci-beam.apache.org/job/beam_PostCommit_Python311/ws/src/sdks/python/apache_beam/examples/dataframe/flight_delays.py>:47: FutureWarning: The default value of numeric_only in DataFrame.mean is deprecated. In a future version, it will default to False. In addition, specifying 'numeric_only=None' is deprecated. Select only valid columns or specify the value of numeric_only to silence this warning.
return airline_df[at_top_airports].mean()
apache_beam/io/gcp/bigquery_read_it_test.py::ReadTests::test_native_source
<https://ci-beam.apache.org/job/beam_PostCommit_Python311/ws/src/sdks/python/apache_beam/io/gcp/bigquery_read_it_test.py>:170: BeamDeprecationWarning: BigQuerySource is deprecated since 2.25.0. Use ReadFromBigQuery instead.
beam.io.BigQuerySource(query=self.query, use_standard_sql=True)))
apache_beam/io/gcp/bigquery_test.py::BigQueryStreamingInsertTransformIntegrationTests::test_multiple_destinations_transform
<https://ci-beam.apache.org/job/beam_PostCommit_Python311/ws/src/sdks/python/apache_beam/io/gcp/bigquery_test.py>:1726: BeamDeprecationWarning: options is deprecated since First stable release. References to <pipeline>.options will not be supported
streaming = self.test_pipeline.options.view_as(StandardOptions).streaming
apache_beam/transforms/external_it_test.py::ExternalTransformIT::test_job_python_from_python_it
<https://ci-beam.apache.org/job/beam_PostCommit_Python311/ws/src/sdks/python/apache_beam/transforms/external.py>:679: BeamDeprecationWarning: options is deprecated since First stable release. References to <pipeline>.options will not be supported
self._expansion_service, pipeline.options)
apache_beam/io/gcp/bigquery_read_it_test.py::ReadNewTypesTests::test_native_source
<https://ci-beam.apache.org/job/beam_PostCommit_Python311/ws/src/sdks/python/apache_beam/io/gcp/bigquery_read_it_test.py>:706: BeamDeprecationWarning: BigQuerySource is deprecated since 2.25.0. Use ReadFromBigQuery instead.
beam.io.BigQuerySource(query=self.query, use_standard_sql=True)))
apache_beam/io/gcp/bigquery_read_it_test.py::ReadAllBQTests::test_read_queries
<https://ci-beam.apache.org/job/beam_PostCommit_Python311/ws/src/sdks/python/apache_beam/io/gcp/bigquery.py>:2920: BeamDeprecationWarning: options is deprecated since First stable release. References to <pipeline>.options will not be supported
job_name = pcoll.pipeline.options.view_as(GoogleCloudOptions).job_name
apache_beam/io/gcp/bigquery_read_it_test.py::ReadAllBQTests::test_read_queries
<https://ci-beam.apache.org/job/beam_PostCommit_Python311/ws/src/sdks/python/apache_beam/io/gcp/bigquery.py>:2921: BeamDeprecationWarning: options is deprecated since First stable release. References to <pipeline>.options will not be supported
project = pcoll.pipeline.options.view_as(GoogleCloudOptions).project
apache_beam/io/gcp/bigquery_read_it_test.py::ReadAllBQTests::test_read_queries
<https://ci-beam.apache.org/job/beam_PostCommit_Python311/ws/src/sdks/python/apache_beam/io/gcp/bigquery.py>:2934: BeamDeprecationWarning: options is deprecated since First stable release. References to <pipeline>.options will not be supported
options=pcoll.pipeline.options,
-- Docs: https://docs.pytest.org/en/stable/how-to/capture-warnings.html
- generated xml file: <https://ci-beam.apache.org/job/beam_PostCommit_Python311/ws/src/sdks/python/pytest_postCommitIT-df-py311.xml> -
[33m========== [32m87 passed[0m, [33m[1m51 skipped[0m, [33m[1m628 warnings[0m[33m in 7409.68s (2:03:29)[0m[33m ===========[0m
FAILURE: Build failed with an exception.
* Where:
Script '<https://ci-beam.apache.org/job/beam_PostCommit_Python311/ws/src/sdks/python/test-suites/portable/common.gradle'> line: 326
* What went wrong:
Execution failed for task ':sdks:python:test-suites:portable:py311:postCommitPy311IT'.
> Process 'command 'sh'' finished with non-zero exit value 1
* Try:
> Run with --stacktrace option to get the stack trace.
> Run with --info or --debug option to get more log output.
* Get more help at https://help.gradle.org
Deprecated Gradle features were used in this build, making it incompatible with Gradle 8.0.
You can use '--warning-mode all' to show the individual deprecation warnings and determine if they come from your own scripts or plugins.
See https://docs.gradle.org/7.6.2/userguide/command_line_interface.html#sec:command_line_warnings
Execution optimizations have been disabled for 1 invalid unit(s) of work during this build to ensure correctness.
Please consult deprecation warnings for more details.
BUILD FAILED in 2h 9m 57s
209 actionable tasks: 144 executed, 59 from cache, 6 up-to-date
Publishing build scan...
https://ge.apache.org/s/sh4wpxymsmlko
Build step 'Invoke Gradle script' changed build result to FAILURE
Build step 'Invoke Gradle script' marked build as failure
---------------------------------------------------------------------
To unsubscribe, e-mail: builds-unsubscribe@beam.apache.org
For additional commands, e-mail: builds-help@beam.apache.org
Build failed in Jenkins: beam_PostCommit_Python311 #631
Posted by Apache Jenkins Server <je...@builds.apache.org>.
See <https://ci-beam.apache.org/job/beam_PostCommit_Python311/631/display/redirect>
Changes:
------------------------------------------
[...truncated 5.16 MB...]
Implementing implicit namespace packages (as specified in PEP 420) is preferred to `pkg_resources.declare_namespace`. See https://setuptools.pypa.io/en/latest/references/keywords.html#keyword-namespace-packages
declare_namespace(pkg)
../../build/gradleenv/2050596099/lib/python3.11/site-packages/pkg_resources/__init__.py:2350: 36 warnings
<https://ci-beam.apache.org/job/beam_PostCommit_Python311/ws/src/build/gradleenv/2050596099/lib/python3.11/site-packages/pkg_resources/__init__.py>:2350: DeprecationWarning: Deprecated call to `pkg_resources.declare_namespace('google')`.
Implementing implicit namespace packages (as specified in PEP 420) is preferred to `pkg_resources.declare_namespace`. See https://setuptools.pypa.io/en/latest/references/keywords.html#keyword-namespace-packages
declare_namespace(parent)
../../build/gradleenv/2050596099/lib/python3.11/site-packages/pkg_resources/__init__.py:2871
../../build/gradleenv/2050596099/lib/python3.11/site-packages/pkg_resources/__init__.py:2871
../../build/gradleenv/2050596099/lib/python3.11/site-packages/pkg_resources/__init__.py:2871
../../build/gradleenv/2050596099/lib/python3.11/site-packages/pkg_resources/__init__.py:2871
../../build/gradleenv/2050596099/lib/python3.11/site-packages/pkg_resources/__init__.py:2871
../../build/gradleenv/2050596099/lib/python3.11/site-packages/pkg_resources/__init__.py:2871
../../build/gradleenv/2050596099/lib/python3.11/site-packages/pkg_resources/__init__.py:2871
../../build/gradleenv/2050596099/lib/python3.11/site-packages/pkg_resources/__init__.py:2871
../../build/gradleenv/2050596099/lib/python3.11/site-packages/pkg_resources/__init__.py:2871
<https://ci-beam.apache.org/job/beam_PostCommit_Python311/ws/src/build/gradleenv/2050596099/lib/python3.11/site-packages/pkg_resources/__init__.py>:2871: DeprecationWarning: Deprecated call to `pkg_resources.declare_namespace('google.logging')`.
Implementing implicit namespace packages (as specified in PEP 420) is preferred to `pkg_resources.declare_namespace`. See https://setuptools.pypa.io/en/latest/references/keywords.html#keyword-namespace-packages
declare_namespace(pkg)
../../build/gradleenv/2050596099/lib/python3.11/site-packages/pkg_resources/__init__.py:2871
../../build/gradleenv/2050596099/lib/python3.11/site-packages/pkg_resources/__init__.py:2871
../../build/gradleenv/2050596099/lib/python3.11/site-packages/pkg_resources/__init__.py:2871
../../build/gradleenv/2050596099/lib/python3.11/site-packages/pkg_resources/__init__.py:2871
../../build/gradleenv/2050596099/lib/python3.11/site-packages/pkg_resources/__init__.py:2871
../../build/gradleenv/2050596099/lib/python3.11/site-packages/pkg_resources/__init__.py:2871
../../build/gradleenv/2050596099/lib/python3.11/site-packages/pkg_resources/__init__.py:2871
../../build/gradleenv/2050596099/lib/python3.11/site-packages/pkg_resources/__init__.py:2871
../../build/gradleenv/2050596099/lib/python3.11/site-packages/pkg_resources/__init__.py:2871
<https://ci-beam.apache.org/job/beam_PostCommit_Python311/ws/src/build/gradleenv/2050596099/lib/python3.11/site-packages/pkg_resources/__init__.py>:2871: DeprecationWarning: Deprecated call to `pkg_resources.declare_namespace('google.iam')`.
Implementing implicit namespace packages (as specified in PEP 420) is preferred to `pkg_resources.declare_namespace`. See https://setuptools.pypa.io/en/latest/references/keywords.html#keyword-namespace-packages
declare_namespace(pkg)
../../build/gradleenv/2050596099/lib/python3.11/site-packages/google/rpc/__init__.py:20
../../build/gradleenv/2050596099/lib/python3.11/site-packages/google/rpc/__init__.py:20
../../build/gradleenv/2050596099/lib/python3.11/site-packages/google/rpc/__init__.py:20
../../build/gradleenv/2050596099/lib/python3.11/site-packages/google/rpc/__init__.py:20
../../build/gradleenv/2050596099/lib/python3.11/site-packages/google/rpc/__init__.py:20
../../build/gradleenv/2050596099/lib/python3.11/site-packages/google/rpc/__init__.py:20
../../build/gradleenv/2050596099/lib/python3.11/site-packages/google/rpc/__init__.py:20
../../build/gradleenv/2050596099/lib/python3.11/site-packages/google/rpc/__init__.py:20
../../build/gradleenv/2050596099/lib/python3.11/site-packages/google/rpc/__init__.py:20
<https://ci-beam.apache.org/job/beam_PostCommit_Python311/ws/src/build/gradleenv/2050596099/lib/python3.11/site-packages/google/rpc/__init__.py>:20: DeprecationWarning: Deprecated call to `pkg_resources.declare_namespace('google.rpc')`.
Implementing implicit namespace packages (as specified in PEP 420) is preferred to `pkg_resources.declare_namespace`. See https://setuptools.pypa.io/en/latest/references/keywords.html#keyword-namespace-packages
pkg_resources.declare_namespace(__name__)
../../build/gradleenv/2050596099/lib/python3.11/site-packages/google/api_core/operations_v1/abstract_operations_client.py:17
../../build/gradleenv/2050596099/lib/python3.11/site-packages/google/api_core/operations_v1/abstract_operations_client.py:17
../../build/gradleenv/2050596099/lib/python3.11/site-packages/google/api_core/operations_v1/abstract_operations_client.py:17
../../build/gradleenv/2050596099/lib/python3.11/site-packages/google/api_core/operations_v1/abstract_operations_client.py:17
../../build/gradleenv/2050596099/lib/python3.11/site-packages/google/api_core/operations_v1/abstract_operations_client.py:17
../../build/gradleenv/2050596099/lib/python3.11/site-packages/google/api_core/operations_v1/abstract_operations_client.py:17
../../build/gradleenv/2050596099/lib/python3.11/site-packages/google/api_core/operations_v1/abstract_operations_client.py:17
../../build/gradleenv/2050596099/lib/python3.11/site-packages/google/api_core/operations_v1/abstract_operations_client.py:17
<https://ci-beam.apache.org/job/beam_PostCommit_Python311/ws/src/build/gradleenv/2050596099/lib/python3.11/site-packages/google/api_core/operations_v1/abstract_operations_client.py>:17: DeprecationWarning: The distutils package is deprecated and slated for removal in Python 3.12. Use setuptools or check PEP 632 for potential alternatives
from distutils import util
apache_beam/dataframe/io_it_test.py: 3 warnings
apache_beam/examples/cookbook/bigquery_tornadoes_it_test.py: 1 warning
apache_beam/examples/dataframe/flight_delays_it_test.py: 1 warning
apache_beam/io/gcp/big_query_query_to_table_it_test.py: 4 warnings
apache_beam/io/gcp/bigquery_io_read_it_test.py: 2 warnings
apache_beam/io/gcp/bigquery_read_it_test.py: 7 warnings
apache_beam/io/gcp/bigquery_json_it_test.py: 3 warnings
<https://ci-beam.apache.org/job/beam_PostCommit_Python311/ws/src/sdks/python/apache_beam/io/gcp/bigquery.py>:2748: BeamDeprecationWarning: options is deprecated since First stable release. References to <pipeline>.options will not be supported
temp_location = pcoll.pipeline.options.view_as(
apache_beam/dataframe/io_it_test.py: 3 warnings
apache_beam/examples/cookbook/bigquery_tornadoes_it_test.py: 1 warning
apache_beam/examples/dataframe/flight_delays_it_test.py: 1 warning
apache_beam/io/gcp/big_query_query_to_table_it_test.py: 4 warnings
apache_beam/io/gcp/bigquery_io_read_it_test.py: 2 warnings
apache_beam/io/gcp/bigquery_read_it_test.py: 7 warnings
apache_beam/io/gcp/bigquery_json_it_test.py: 3 warnings
<https://ci-beam.apache.org/job/beam_PostCommit_Python311/ws/src/sdks/python/apache_beam/io/gcp/bigquery.py>:2750: BeamDeprecationWarning: options is deprecated since First stable release. References to <pipeline>.options will not be supported
job_name = pcoll.pipeline.options.view_as(GoogleCloudOptions).job_name
apache_beam/dataframe/io_it_test.py: 3 warnings
apache_beam/examples/cookbook/bigquery_tornadoes_it_test.py: 1 warning
apache_beam/examples/dataframe/flight_delays_it_test.py: 1 warning
apache_beam/io/gcp/big_query_query_to_table_it_test.py: 4 warnings
apache_beam/io/gcp/bigquery_io_read_it_test.py: 2 warnings
apache_beam/io/gcp/bigquery_read_it_test.py: 7 warnings
apache_beam/io/gcp/bigquery_json_it_test.py: 3 warnings
<https://ci-beam.apache.org/job/beam_PostCommit_Python311/ws/src/sdks/python/apache_beam/io/gcp/bigquery.py>:2774: BeamDeprecationWarning: options is deprecated since First stable release. References to <pipeline>.options will not be supported
pipeline_options=pcoll.pipeline.options,
apache_beam/dataframe/io_it_test.py: 2 warnings
apache_beam/io/gcp/bigquery_json_it_test.py: 1 warning
apache_beam/io/gcp/bigquery_read_it_test.py: 10 warnings
<https://ci-beam.apache.org/job/beam_PostCommit_Python311/ws/src/sdks/python/apache_beam/io/gcp/bigquery.py>:2792: BeamDeprecationWarning: options is deprecated since First stable release. References to <pipeline>.options will not be supported
project_id = pcoll.pipeline.options.view_as(GoogleCloudOptions).project
apache_beam/dataframe/io_it_test.py: 2 warnings
apache_beam/io/gcp/bigquery_json_it_test.py: 1 warning
apache_beam/io/gcp/bigquery_read_it_test.py: 10 warnings
<https://ci-beam.apache.org/job/beam_PostCommit_Python311/ws/src/sdks/python/apache_beam/io/gcp/bigquery.py>:2813: BeamDeprecationWarning: options is deprecated since First stable release. References to <pipeline>.options will not be supported
pipeline_options=pcoll.pipeline.options,
apache_beam/dataframe/io_it_test.py: 2 warnings
apache_beam/io/gcp/bigquery_json_it_test.py: 1 warning
apache_beam/io/gcp/bigquery_read_it_test.py: 10 warnings
<https://ci-beam.apache.org/job/beam_PostCommit_Python311/ws/src/sdks/python/apache_beam/io/gcp/bigquery_read_internal.py>:150: BeamDeprecationWarning: options is deprecated since First stable release. References to <pipeline>.options will not be supported
pipeline_options = input.pipeline.options
apache_beam/examples/cookbook/bigquery_tornadoes_it_test.py: 1 warning
apache_beam/io/gcp/big_query_query_to_table_it_test.py: 4 warnings
apache_beam/io/gcp/bigquery_write_it_test.py: 4 warnings
apache_beam/io/gcp/bigquery_test.py: 2 warnings
<https://ci-beam.apache.org/job/beam_PostCommit_Python311/ws/src/sdks/python/apache_beam/io/gcp/bigquery.py>:2097: BeamDeprecationWarning: options is deprecated since First stable release. References to <pipeline>.options will not be supported
self.table_reference.projectId = pcoll.pipeline.options.view_as(
apache_beam/examples/cookbook/bigquery_tornadoes_it_test.py: 1 warning
apache_beam/examples/complete/game/hourly_team_score_it_test.py: 1 warning
apache_beam/examples/complete/game/game_stats_it_test.py: 2 warnings
apache_beam/io/gcp/big_query_query_to_table_it_test.py: 4 warnings
apache_beam/examples/complete/game/leader_board_it_test.py: 2 warnings
apache_beam/io/gcp/bigquery_write_it_test.py: 4 warnings
apache_beam/io/gcp/bigquery_file_loads_test.py: 3 warnings
apache_beam/io/gcp/bigquery_json_it_test.py: 2 warnings
apache_beam/io/gcp/bigquery_test.py: 6 warnings
<https://ci-beam.apache.org/job/beam_PostCommit_Python311/ws/src/sdks/python/apache_beam/io/gcp/bigquery.py>:2101: BeamDeprecationWarning: options is deprecated since First stable release. References to <pipeline>.options will not be supported
is_streaming_pipeline = p.options.view_as(StandardOptions).streaming
apache_beam/examples/cookbook/bigquery_tornadoes_it_test.py: 1 warning
apache_beam/examples/complete/game/hourly_team_score_it_test.py: 1 warning
apache_beam/examples/complete/game/game_stats_it_test.py: 2 warnings
apache_beam/io/gcp/big_query_query_to_table_it_test.py: 4 warnings
apache_beam/examples/complete/game/leader_board_it_test.py: 2 warnings
apache_beam/io/gcp/bigquery_write_it_test.py: 4 warnings
apache_beam/io/gcp/bigquery_file_loads_test.py: 3 warnings
apache_beam/io/gcp/bigquery_json_it_test.py: 2 warnings
apache_beam/io/gcp/bigquery_test.py: 6 warnings
<https://ci-beam.apache.org/job/beam_PostCommit_Python311/ws/src/sdks/python/apache_beam/io/gcp/bigquery.py>:2107: BeamDeprecationWarning: options is deprecated since First stable release. References to <pipeline>.options will not be supported
experiments = p.options.view_as(DebugOptions).experiments or []
apache_beam/examples/cookbook/bigquery_tornadoes_it_test.py: 1 warning
apache_beam/io/gcp/big_query_query_to_table_it_test.py: 4 warnings
apache_beam/io/gcp/bigquery_write_it_test.py: 3 warnings
apache_beam/io/gcp/bigquery_file_loads_test.py: 3 warnings
apache_beam/io/gcp/bigquery_test.py: 3 warnings
<https://ci-beam.apache.org/job/beam_PostCommit_Python311/ws/src/sdks/python/apache_beam/io/gcp/bigquery_file_loads.py>:1176: BeamDeprecationWarning: options is deprecated since First stable release. References to <pipeline>.options will not be supported
self.project = self.project or p.options.view_as(GoogleCloudOptions).project
apache_beam/examples/cookbook/bigquery_tornadoes_it_test.py: 1 warning
apache_beam/examples/complete/game/hourly_team_score_it_test.py: 1 warning
apache_beam/io/gcp/big_query_query_to_table_it_test.py: 4 warnings
apache_beam/io/gcp/bigquery_write_it_test.py: 3 warnings
apache_beam/io/gcp/bigquery_file_loads_test.py: 3 warnings
apache_beam/io/gcp/bigquery_test.py: 3 warnings
<https://ci-beam.apache.org/job/beam_PostCommit_Python311/ws/src/sdks/python/apache_beam/io/gcp/bigquery_file_loads.py>:1183: BeamDeprecationWarning: options is deprecated since First stable release. References to <pipeline>.options will not be supported
temp_location = p.options.view_as(GoogleCloudOptions).temp_location
apache_beam/examples/cookbook/bigquery_tornadoes_it_test.py: 1 warning
apache_beam/examples/complete/game/hourly_team_score_it_test.py: 1 warning
apache_beam/io/gcp/big_query_query_to_table_it_test.py: 4 warnings
apache_beam/io/gcp/bigquery_write_it_test.py: 3 warnings
apache_beam/io/gcp/bigquery_file_loads_test.py: 3 warnings
apache_beam/io/gcp/bigquery_test.py: 3 warnings
<https://ci-beam.apache.org/job/beam_PostCommit_Python311/ws/src/sdks/python/apache_beam/io/gcp/bigquery_file_loads.py>:1185: BeamDeprecationWarning: options is deprecated since First stable release. References to <pipeline>.options will not be supported
p.options.view_as(GoogleCloudOptions).job_name or 'AUTOMATIC_JOB_NAME')
apache_beam/examples/cookbook/bigquery_tornadoes_it_test.py::BigqueryTornadoesIT::test_bigquery_tornadoes_it
<https://ci-beam.apache.org/job/beam_PostCommit_Python311/ws/src/sdks/python/apache_beam/io/gcp/tests/utils.py>:100: PendingDeprecationWarning: Client.dataset is deprecated and will be removed in a future version. Use a string like 'my_project.my_dataset' or a cloud.google.bigquery.DatasetReference object, instead.
table_ref = client.dataset(dataset_id).table(table_id)
apache_beam/examples/complete/game/hourly_team_score_it_test.py::HourlyTeamScoreIT::test_hourly_team_score_it
apache_beam/examples/complete/game/game_stats_it_test.py::GameStatsIT::test_game_stats_it
apache_beam/examples/complete/game/leader_board_it_test.py::LeaderBoardIT::test_leader_board_it
apache_beam/io/gcp/bigquery_test.py::PubSubBigQueryIT::test_file_loads
apache_beam/io/gcp/bigquery_test.py::PubSubBigQueryIT::test_streaming_inserts
<https://ci-beam.apache.org/job/beam_PostCommit_Python311/ws/src/sdks/python/apache_beam/io/gcp/tests/utils.py>:63: PendingDeprecationWarning: Client.dataset is deprecated and will be removed in a future version. Use a string like 'my_project.my_dataset' or a cloud.google.bigquery.DatasetReference object, instead.
dataset_ref = client.dataset(unique_dataset_name, project=project)
apache_beam/examples/dataframe/flight_delays_it_test.py::FlightDelaysTest::test_flight_delays
<https://ci-beam.apache.org/job/beam_PostCommit_Python311/ws/src/sdks/python/apache_beam/examples/dataframe/flight_delays.py>:47: FutureWarning: The default value of numeric_only in DataFrame.mean is deprecated. In a future version, it will default to False. In addition, specifying 'numeric_only=None' is deprecated. Select only valid columns or specify the value of numeric_only to silence this warning.
return airline_df[at_top_airports].mean()
apache_beam/examples/dataframe/flight_delays_it_test.py::FlightDelaysTest::test_flight_delays
apache_beam/examples/dataframe/taxiride_it_test.py::TaxirideIT::test_aggregation
apache_beam/examples/dataframe/taxiride_it_test.py::TaxirideIT::test_enrich
<https://ci-beam.apache.org/job/beam_PostCommit_Python311/ws/src/sdks/python/apache_beam/io/fileio.py>:605: BeamDeprecationWarning: options is deprecated since First stable release. References to <pipeline>.options will not be supported
p.options.view_as(GoogleCloudOptions).temp_location or
apache_beam/io/gcp/bigquery_read_it_test.py::ReadTests::test_native_source
<https://ci-beam.apache.org/job/beam_PostCommit_Python311/ws/src/sdks/python/apache_beam/io/gcp/bigquery_read_it_test.py>:170: BeamDeprecationWarning: BigQuerySource is deprecated since 2.25.0. Use ReadFromBigQuery instead.
beam.io.BigQuerySource(query=self.query, use_standard_sql=True)))
apache_beam/io/gcp/bigquery_test.py::BigQueryStreamingInsertTransformIntegrationTests::test_multiple_destinations_transform
<https://ci-beam.apache.org/job/beam_PostCommit_Python311/ws/src/sdks/python/apache_beam/io/gcp/bigquery_test.py>:1726: BeamDeprecationWarning: options is deprecated since First stable release. References to <pipeline>.options will not be supported
streaming = self.test_pipeline.options.view_as(StandardOptions).streaming
apache_beam/transforms/external_it_test.py::ExternalTransformIT::test_job_python_from_python_it
<https://ci-beam.apache.org/job/beam_PostCommit_Python311/ws/src/sdks/python/apache_beam/transforms/external.py>:679: BeamDeprecationWarning: options is deprecated since First stable release. References to <pipeline>.options will not be supported
self._expansion_service, pipeline.options)
apache_beam/io/gcp/bigquery_read_it_test.py::ReadNewTypesTests::test_native_source
<https://ci-beam.apache.org/job/beam_PostCommit_Python311/ws/src/sdks/python/apache_beam/io/gcp/bigquery_read_it_test.py>:706: BeamDeprecationWarning: BigQuerySource is deprecated since 2.25.0. Use ReadFromBigQuery instead.
beam.io.BigQuerySource(query=self.query, use_standard_sql=True)))
apache_beam/io/gcp/bigquery_read_it_test.py::ReadAllBQTests::test_read_queries
<https://ci-beam.apache.org/job/beam_PostCommit_Python311/ws/src/sdks/python/apache_beam/io/gcp/bigquery.py>:2920: BeamDeprecationWarning: options is deprecated since First stable release. References to <pipeline>.options will not be supported
job_name = pcoll.pipeline.options.view_as(GoogleCloudOptions).job_name
apache_beam/io/gcp/bigquery_read_it_test.py::ReadAllBQTests::test_read_queries
<https://ci-beam.apache.org/job/beam_PostCommit_Python311/ws/src/sdks/python/apache_beam/io/gcp/bigquery.py>:2921: BeamDeprecationWarning: options is deprecated since First stable release. References to <pipeline>.options will not be supported
project = pcoll.pipeline.options.view_as(GoogleCloudOptions).project
apache_beam/io/gcp/bigquery_read_it_test.py::ReadAllBQTests::test_read_queries
<https://ci-beam.apache.org/job/beam_PostCommit_Python311/ws/src/sdks/python/apache_beam/io/gcp/bigquery.py>:2934: BeamDeprecationWarning: options is deprecated since First stable release. References to <pipeline>.options will not be supported
options=pcoll.pipeline.options,
-- Docs: https://docs.pytest.org/en/stable/how-to/capture-warnings.html
- generated xml file: <https://ci-beam.apache.org/job/beam_PostCommit_Python311/ws/src/sdks/python/pytest_postCommitIT-df-py311.xml> -
[33m========== [32m87 passed[0m, [33m[1m51 skipped[0m, [33m[1m628 warnings[0m[33m in 7357.07s (2:02:37)[0m[33m ===========[0m
FAILURE: Build failed with an exception.
* Where:
Script '<https://ci-beam.apache.org/job/beam_PostCommit_Python311/ws/src/sdks/python/test-suites/portable/common.gradle'> line: 326
* What went wrong:
Execution failed for task ':sdks:python:test-suites:portable:py311:postCommitPy311IT'.
> Process 'command 'sh'' finished with non-zero exit value 1
* Try:
> Run with --stacktrace option to get the stack trace.
> Run with --info or --debug option to get more log output.
* Get more help at https://help.gradle.org
Deprecated Gradle features were used in this build, making it incompatible with Gradle 8.0.
You can use '--warning-mode all' to show the individual deprecation warnings and determine if they come from your own scripts or plugins.
See https://docs.gradle.org/7.6.2/userguide/command_line_interface.html#sec:command_line_warnings
Execution optimizations have been disabled for 1 invalid unit(s) of work during this build to ensure correctness.
Please consult deprecation warnings for more details.
BUILD FAILED in 2h 8m 42s
209 actionable tasks: 144 executed, 59 from cache, 6 up-to-date
Publishing build scan...
https://ge.apache.org/s/3llwgphcnfbwc
Build step 'Invoke Gradle script' changed build result to FAILURE
Build step 'Invoke Gradle script' marked build as failure
---------------------------------------------------------------------
To unsubscribe, e-mail: builds-unsubscribe@beam.apache.org
For additional commands, e-mail: builds-help@beam.apache.org
Build failed in Jenkins: beam_PostCommit_Python311 #630
Posted by Apache Jenkins Server <je...@builds.apache.org>.
See <https://ci-beam.apache.org/job/beam_PostCommit_Python311/630/display/redirect>
Changes:
------------------------------------------
[...truncated 8.49 MB...]
Implementing implicit namespace packages (as specified in PEP 420) is preferred to `pkg_resources.declare_namespace`. See https://setuptools.pypa.io/en/latest/references/keywords.html#keyword-namespace-packages
declare_namespace(pkg)
../../build/gradleenv/2050596099/lib/python3.11/site-packages/pkg_resources/__init__.py:2350: 36 warnings
<https://ci-beam.apache.org/job/beam_PostCommit_Python311/ws/src/build/gradleenv/2050596099/lib/python3.11/site-packages/pkg_resources/__init__.py>:2350: DeprecationWarning: Deprecated call to `pkg_resources.declare_namespace('google')`.
Implementing implicit namespace packages (as specified in PEP 420) is preferred to `pkg_resources.declare_namespace`. See https://setuptools.pypa.io/en/latest/references/keywords.html#keyword-namespace-packages
declare_namespace(parent)
../../build/gradleenv/2050596099/lib/python3.11/site-packages/pkg_resources/__init__.py:2871
../../build/gradleenv/2050596099/lib/python3.11/site-packages/pkg_resources/__init__.py:2871
../../build/gradleenv/2050596099/lib/python3.11/site-packages/pkg_resources/__init__.py:2871
../../build/gradleenv/2050596099/lib/python3.11/site-packages/pkg_resources/__init__.py:2871
../../build/gradleenv/2050596099/lib/python3.11/site-packages/pkg_resources/__init__.py:2871
../../build/gradleenv/2050596099/lib/python3.11/site-packages/pkg_resources/__init__.py:2871
../../build/gradleenv/2050596099/lib/python3.11/site-packages/pkg_resources/__init__.py:2871
../../build/gradleenv/2050596099/lib/python3.11/site-packages/pkg_resources/__init__.py:2871
../../build/gradleenv/2050596099/lib/python3.11/site-packages/pkg_resources/__init__.py:2871
<https://ci-beam.apache.org/job/beam_PostCommit_Python311/ws/src/build/gradleenv/2050596099/lib/python3.11/site-packages/pkg_resources/__init__.py>:2871: DeprecationWarning: Deprecated call to `pkg_resources.declare_namespace('google.logging')`.
Implementing implicit namespace packages (as specified in PEP 420) is preferred to `pkg_resources.declare_namespace`. See https://setuptools.pypa.io/en/latest/references/keywords.html#keyword-namespace-packages
declare_namespace(pkg)
../../build/gradleenv/2050596099/lib/python3.11/site-packages/pkg_resources/__init__.py:2871
../../build/gradleenv/2050596099/lib/python3.11/site-packages/pkg_resources/__init__.py:2871
../../build/gradleenv/2050596099/lib/python3.11/site-packages/pkg_resources/__init__.py:2871
../../build/gradleenv/2050596099/lib/python3.11/site-packages/pkg_resources/__init__.py:2871
../../build/gradleenv/2050596099/lib/python3.11/site-packages/pkg_resources/__init__.py:2871
../../build/gradleenv/2050596099/lib/python3.11/site-packages/pkg_resources/__init__.py:2871
../../build/gradleenv/2050596099/lib/python3.11/site-packages/pkg_resources/__init__.py:2871
../../build/gradleenv/2050596099/lib/python3.11/site-packages/pkg_resources/__init__.py:2871
../../build/gradleenv/2050596099/lib/python3.11/site-packages/pkg_resources/__init__.py:2871
<https://ci-beam.apache.org/job/beam_PostCommit_Python311/ws/src/build/gradleenv/2050596099/lib/python3.11/site-packages/pkg_resources/__init__.py>:2871: DeprecationWarning: Deprecated call to `pkg_resources.declare_namespace('google.iam')`.
Implementing implicit namespace packages (as specified in PEP 420) is preferred to `pkg_resources.declare_namespace`. See https://setuptools.pypa.io/en/latest/references/keywords.html#keyword-namespace-packages
declare_namespace(pkg)
../../build/gradleenv/2050596099/lib/python3.11/site-packages/google/rpc/__init__.py:20
../../build/gradleenv/2050596099/lib/python3.11/site-packages/google/rpc/__init__.py:20
../../build/gradleenv/2050596099/lib/python3.11/site-packages/google/rpc/__init__.py:20
../../build/gradleenv/2050596099/lib/python3.11/site-packages/google/rpc/__init__.py:20
../../build/gradleenv/2050596099/lib/python3.11/site-packages/google/rpc/__init__.py:20
../../build/gradleenv/2050596099/lib/python3.11/site-packages/google/rpc/__init__.py:20
../../build/gradleenv/2050596099/lib/python3.11/site-packages/google/rpc/__init__.py:20
../../build/gradleenv/2050596099/lib/python3.11/site-packages/google/rpc/__init__.py:20
../../build/gradleenv/2050596099/lib/python3.11/site-packages/google/rpc/__init__.py:20
<https://ci-beam.apache.org/job/beam_PostCommit_Python311/ws/src/build/gradleenv/2050596099/lib/python3.11/site-packages/google/rpc/__init__.py>:20: DeprecationWarning: Deprecated call to `pkg_resources.declare_namespace('google.rpc')`.
Implementing implicit namespace packages (as specified in PEP 420) is preferred to `pkg_resources.declare_namespace`. See https://setuptools.pypa.io/en/latest/references/keywords.html#keyword-namespace-packages
pkg_resources.declare_namespace(__name__)
../../build/gradleenv/2050596099/lib/python3.11/site-packages/google/api_core/operations_v1/abstract_operations_client.py:17
../../build/gradleenv/2050596099/lib/python3.11/site-packages/google/api_core/operations_v1/abstract_operations_client.py:17
../../build/gradleenv/2050596099/lib/python3.11/site-packages/google/api_core/operations_v1/abstract_operations_client.py:17
../../build/gradleenv/2050596099/lib/python3.11/site-packages/google/api_core/operations_v1/abstract_operations_client.py:17
../../build/gradleenv/2050596099/lib/python3.11/site-packages/google/api_core/operations_v1/abstract_operations_client.py:17
../../build/gradleenv/2050596099/lib/python3.11/site-packages/google/api_core/operations_v1/abstract_operations_client.py:17
../../build/gradleenv/2050596099/lib/python3.11/site-packages/google/api_core/operations_v1/abstract_operations_client.py:17
../../build/gradleenv/2050596099/lib/python3.11/site-packages/google/api_core/operations_v1/abstract_operations_client.py:17
<https://ci-beam.apache.org/job/beam_PostCommit_Python311/ws/src/build/gradleenv/2050596099/lib/python3.11/site-packages/google/api_core/operations_v1/abstract_operations_client.py>:17: DeprecationWarning: The distutils package is deprecated and slated for removal in Python 3.12. Use setuptools or check PEP 632 for potential alternatives
from distutils import util
apache_beam/dataframe/io_it_test.py: 3 warnings
apache_beam/examples/cookbook/bigquery_tornadoes_it_test.py: 1 warning
apache_beam/examples/dataframe/flight_delays_it_test.py: 1 warning
apache_beam/io/gcp/big_query_query_to_table_it_test.py: 4 warnings
apache_beam/io/gcp/bigquery_io_read_it_test.py: 2 warnings
apache_beam/io/gcp/bigquery_read_it_test.py: 7 warnings
apache_beam/io/gcp/bigquery_json_it_test.py: 3 warnings
<https://ci-beam.apache.org/job/beam_PostCommit_Python311/ws/src/sdks/python/apache_beam/io/gcp/bigquery.py>:2748: BeamDeprecationWarning: options is deprecated since First stable release. References to <pipeline>.options will not be supported
temp_location = pcoll.pipeline.options.view_as(
apache_beam/dataframe/io_it_test.py: 3 warnings
apache_beam/examples/cookbook/bigquery_tornadoes_it_test.py: 1 warning
apache_beam/examples/dataframe/flight_delays_it_test.py: 1 warning
apache_beam/io/gcp/big_query_query_to_table_it_test.py: 4 warnings
apache_beam/io/gcp/bigquery_io_read_it_test.py: 2 warnings
apache_beam/io/gcp/bigquery_read_it_test.py: 7 warnings
apache_beam/io/gcp/bigquery_json_it_test.py: 3 warnings
<https://ci-beam.apache.org/job/beam_PostCommit_Python311/ws/src/sdks/python/apache_beam/io/gcp/bigquery.py>:2750: BeamDeprecationWarning: options is deprecated since First stable release. References to <pipeline>.options will not be supported
job_name = pcoll.pipeline.options.view_as(GoogleCloudOptions).job_name
apache_beam/dataframe/io_it_test.py: 3 warnings
apache_beam/examples/cookbook/bigquery_tornadoes_it_test.py: 1 warning
apache_beam/examples/dataframe/flight_delays_it_test.py: 1 warning
apache_beam/io/gcp/big_query_query_to_table_it_test.py: 4 warnings
apache_beam/io/gcp/bigquery_io_read_it_test.py: 2 warnings
apache_beam/io/gcp/bigquery_read_it_test.py: 7 warnings
apache_beam/io/gcp/bigquery_json_it_test.py: 3 warnings
<https://ci-beam.apache.org/job/beam_PostCommit_Python311/ws/src/sdks/python/apache_beam/io/gcp/bigquery.py>:2774: BeamDeprecationWarning: options is deprecated since First stable release. References to <pipeline>.options will not be supported
pipeline_options=pcoll.pipeline.options,
apache_beam/dataframe/io_it_test.py: 2 warnings
apache_beam/io/gcp/bigquery_json_it_test.py: 1 warning
apache_beam/io/gcp/bigquery_read_it_test.py: 10 warnings
<https://ci-beam.apache.org/job/beam_PostCommit_Python311/ws/src/sdks/python/apache_beam/io/gcp/bigquery.py>:2792: BeamDeprecationWarning: options is deprecated since First stable release. References to <pipeline>.options will not be supported
project_id = pcoll.pipeline.options.view_as(GoogleCloudOptions).project
apache_beam/dataframe/io_it_test.py: 2 warnings
apache_beam/io/gcp/bigquery_json_it_test.py: 1 warning
apache_beam/io/gcp/bigquery_read_it_test.py: 10 warnings
<https://ci-beam.apache.org/job/beam_PostCommit_Python311/ws/src/sdks/python/apache_beam/io/gcp/bigquery.py>:2813: BeamDeprecationWarning: options is deprecated since First stable release. References to <pipeline>.options will not be supported
pipeline_options=pcoll.pipeline.options,
apache_beam/dataframe/io_it_test.py: 2 warnings
apache_beam/io/gcp/bigquery_json_it_test.py: 1 warning
apache_beam/io/gcp/bigquery_read_it_test.py: 10 warnings
<https://ci-beam.apache.org/job/beam_PostCommit_Python311/ws/src/sdks/python/apache_beam/io/gcp/bigquery_read_internal.py>:150: BeamDeprecationWarning: options is deprecated since First stable release. References to <pipeline>.options will not be supported
pipeline_options = input.pipeline.options
apache_beam/examples/cookbook/bigquery_tornadoes_it_test.py: 1 warning
apache_beam/io/gcp/big_query_query_to_table_it_test.py: 4 warnings
apache_beam/io/gcp/bigquery_write_it_test.py: 4 warnings
apache_beam/io/gcp/bigquery_test.py: 2 warnings
<https://ci-beam.apache.org/job/beam_PostCommit_Python311/ws/src/sdks/python/apache_beam/io/gcp/bigquery.py>:2097: BeamDeprecationWarning: options is deprecated since First stable release. References to <pipeline>.options will not be supported
self.table_reference.projectId = pcoll.pipeline.options.view_as(
apache_beam/examples/cookbook/bigquery_tornadoes_it_test.py: 1 warning
apache_beam/examples/complete/game/hourly_team_score_it_test.py: 1 warning
apache_beam/examples/complete/game/game_stats_it_test.py: 2 warnings
apache_beam/io/gcp/big_query_query_to_table_it_test.py: 4 warnings
apache_beam/examples/complete/game/leader_board_it_test.py: 2 warnings
apache_beam/io/gcp/bigquery_write_it_test.py: 4 warnings
apache_beam/io/gcp/bigquery_json_it_test.py: 2 warnings
apache_beam/io/gcp/bigquery_file_loads_test.py: 3 warnings
apache_beam/io/gcp/bigquery_test.py: 6 warnings
<https://ci-beam.apache.org/job/beam_PostCommit_Python311/ws/src/sdks/python/apache_beam/io/gcp/bigquery.py>:2101: BeamDeprecationWarning: options is deprecated since First stable release. References to <pipeline>.options will not be supported
is_streaming_pipeline = p.options.view_as(StandardOptions).streaming
apache_beam/examples/cookbook/bigquery_tornadoes_it_test.py: 1 warning
apache_beam/examples/complete/game/hourly_team_score_it_test.py: 1 warning
apache_beam/examples/complete/game/game_stats_it_test.py: 2 warnings
apache_beam/io/gcp/big_query_query_to_table_it_test.py: 4 warnings
apache_beam/examples/complete/game/leader_board_it_test.py: 2 warnings
apache_beam/io/gcp/bigquery_write_it_test.py: 4 warnings
apache_beam/io/gcp/bigquery_json_it_test.py: 2 warnings
apache_beam/io/gcp/bigquery_file_loads_test.py: 3 warnings
apache_beam/io/gcp/bigquery_test.py: 6 warnings
<https://ci-beam.apache.org/job/beam_PostCommit_Python311/ws/src/sdks/python/apache_beam/io/gcp/bigquery.py>:2107: BeamDeprecationWarning: options is deprecated since First stable release. References to <pipeline>.options will not be supported
experiments = p.options.view_as(DebugOptions).experiments or []
apache_beam/examples/cookbook/bigquery_tornadoes_it_test.py: 1 warning
apache_beam/io/gcp/big_query_query_to_table_it_test.py: 4 warnings
apache_beam/io/gcp/bigquery_write_it_test.py: 3 warnings
apache_beam/io/gcp/bigquery_file_loads_test.py: 3 warnings
apache_beam/io/gcp/bigquery_test.py: 3 warnings
<https://ci-beam.apache.org/job/beam_PostCommit_Python311/ws/src/sdks/python/apache_beam/io/gcp/bigquery_file_loads.py>:1176: BeamDeprecationWarning: options is deprecated since First stable release. References to <pipeline>.options will not be supported
self.project = self.project or p.options.view_as(GoogleCloudOptions).project
apache_beam/examples/cookbook/bigquery_tornadoes_it_test.py: 1 warning
apache_beam/examples/complete/game/hourly_team_score_it_test.py: 1 warning
apache_beam/io/gcp/big_query_query_to_table_it_test.py: 4 warnings
apache_beam/io/gcp/bigquery_write_it_test.py: 3 warnings
apache_beam/io/gcp/bigquery_file_loads_test.py: 3 warnings
apache_beam/io/gcp/bigquery_test.py: 3 warnings
<https://ci-beam.apache.org/job/beam_PostCommit_Python311/ws/src/sdks/python/apache_beam/io/gcp/bigquery_file_loads.py>:1183: BeamDeprecationWarning: options is deprecated since First stable release. References to <pipeline>.options will not be supported
temp_location = p.options.view_as(GoogleCloudOptions).temp_location
apache_beam/examples/cookbook/bigquery_tornadoes_it_test.py: 1 warning
apache_beam/examples/complete/game/hourly_team_score_it_test.py: 1 warning
apache_beam/io/gcp/big_query_query_to_table_it_test.py: 4 warnings
apache_beam/io/gcp/bigquery_write_it_test.py: 3 warnings
apache_beam/io/gcp/bigquery_file_loads_test.py: 3 warnings
apache_beam/io/gcp/bigquery_test.py: 3 warnings
<https://ci-beam.apache.org/job/beam_PostCommit_Python311/ws/src/sdks/python/apache_beam/io/gcp/bigquery_file_loads.py>:1185: BeamDeprecationWarning: options is deprecated since First stable release. References to <pipeline>.options will not be supported
p.options.view_as(GoogleCloudOptions).job_name or 'AUTOMATIC_JOB_NAME')
apache_beam/examples/cookbook/bigquery_tornadoes_it_test.py::BigqueryTornadoesIT::test_bigquery_tornadoes_it
<https://ci-beam.apache.org/job/beam_PostCommit_Python311/ws/src/sdks/python/apache_beam/io/gcp/tests/utils.py>:100: PendingDeprecationWarning: Client.dataset is deprecated and will be removed in a future version. Use a string like 'my_project.my_dataset' or a cloud.google.bigquery.DatasetReference object, instead.
table_ref = client.dataset(dataset_id).table(table_id)
apache_beam/examples/complete/game/hourly_team_score_it_test.py::HourlyTeamScoreIT::test_hourly_team_score_it
apache_beam/examples/complete/game/game_stats_it_test.py::GameStatsIT::test_game_stats_it
apache_beam/examples/complete/game/leader_board_it_test.py::LeaderBoardIT::test_leader_board_it
apache_beam/io/gcp/bigquery_test.py::PubSubBigQueryIT::test_file_loads
apache_beam/io/gcp/bigquery_test.py::PubSubBigQueryIT::test_streaming_inserts
<https://ci-beam.apache.org/job/beam_PostCommit_Python311/ws/src/sdks/python/apache_beam/io/gcp/tests/utils.py>:63: PendingDeprecationWarning: Client.dataset is deprecated and will be removed in a future version. Use a string like 'my_project.my_dataset' or a cloud.google.bigquery.DatasetReference object, instead.
dataset_ref = client.dataset(unique_dataset_name, project=project)
apache_beam/examples/dataframe/flight_delays_it_test.py::FlightDelaysTest::test_flight_delays
<https://ci-beam.apache.org/job/beam_PostCommit_Python311/ws/src/sdks/python/apache_beam/examples/dataframe/flight_delays.py>:47: FutureWarning: The default value of numeric_only in DataFrame.mean is deprecated. In a future version, it will default to False. In addition, specifying 'numeric_only=None' is deprecated. Select only valid columns or specify the value of numeric_only to silence this warning.
return airline_df[at_top_airports].mean()
apache_beam/examples/dataframe/flight_delays_it_test.py::FlightDelaysTest::test_flight_delays
apache_beam/examples/dataframe/taxiride_it_test.py::TaxirideIT::test_aggregation
apache_beam/examples/dataframe/taxiride_it_test.py::TaxirideIT::test_enrich
<https://ci-beam.apache.org/job/beam_PostCommit_Python311/ws/src/sdks/python/apache_beam/io/fileio.py>:605: BeamDeprecationWarning: options is deprecated since First stable release. References to <pipeline>.options will not be supported
p.options.view_as(GoogleCloudOptions).temp_location or
apache_beam/io/gcp/bigquery_read_it_test.py::ReadTests::test_native_source
<https://ci-beam.apache.org/job/beam_PostCommit_Python311/ws/src/sdks/python/apache_beam/io/gcp/bigquery_read_it_test.py>:170: BeamDeprecationWarning: BigQuerySource is deprecated since 2.25.0. Use ReadFromBigQuery instead.
beam.io.BigQuerySource(query=self.query, use_standard_sql=True)))
apache_beam/io/gcp/bigquery_test.py::BigQueryStreamingInsertTransformIntegrationTests::test_multiple_destinations_transform
<https://ci-beam.apache.org/job/beam_PostCommit_Python311/ws/src/sdks/python/apache_beam/io/gcp/bigquery_test.py>:1726: BeamDeprecationWarning: options is deprecated since First stable release. References to <pipeline>.options will not be supported
streaming = self.test_pipeline.options.view_as(StandardOptions).streaming
apache_beam/transforms/external_it_test.py::ExternalTransformIT::test_job_python_from_python_it
<https://ci-beam.apache.org/job/beam_PostCommit_Python311/ws/src/sdks/python/apache_beam/transforms/external.py>:679: BeamDeprecationWarning: options is deprecated since First stable release. References to <pipeline>.options will not be supported
self._expansion_service, pipeline.options)
apache_beam/io/gcp/bigquery_read_it_test.py::ReadNewTypesTests::test_native_source
<https://ci-beam.apache.org/job/beam_PostCommit_Python311/ws/src/sdks/python/apache_beam/io/gcp/bigquery_read_it_test.py>:706: BeamDeprecationWarning: BigQuerySource is deprecated since 2.25.0. Use ReadFromBigQuery instead.
beam.io.BigQuerySource(query=self.query, use_standard_sql=True)))
apache_beam/io/gcp/bigquery_read_it_test.py::ReadAllBQTests::test_read_queries
<https://ci-beam.apache.org/job/beam_PostCommit_Python311/ws/src/sdks/python/apache_beam/io/gcp/bigquery.py>:2920: BeamDeprecationWarning: options is deprecated since First stable release. References to <pipeline>.options will not be supported
job_name = pcoll.pipeline.options.view_as(GoogleCloudOptions).job_name
apache_beam/io/gcp/bigquery_read_it_test.py::ReadAllBQTests::test_read_queries
<https://ci-beam.apache.org/job/beam_PostCommit_Python311/ws/src/sdks/python/apache_beam/io/gcp/bigquery.py>:2921: BeamDeprecationWarning: options is deprecated since First stable release. References to <pipeline>.options will not be supported
project = pcoll.pipeline.options.view_as(GoogleCloudOptions).project
apache_beam/io/gcp/bigquery_read_it_test.py::ReadAllBQTests::test_read_queries
<https://ci-beam.apache.org/job/beam_PostCommit_Python311/ws/src/sdks/python/apache_beam/io/gcp/bigquery.py>:2934: BeamDeprecationWarning: options is deprecated since First stable release. References to <pipeline>.options will not be supported
options=pcoll.pipeline.options,
-- Docs: https://docs.pytest.org/en/stable/how-to/capture-warnings.html
- generated xml file: <https://ci-beam.apache.org/job/beam_PostCommit_Python311/ws/src/sdks/python/pytest_postCommitIT-df-py311.xml> -
[33m========== [32m87 passed[0m, [33m[1m51 skipped[0m, [33m[1m628 warnings[0m[33m in 7955.67s (2:12:35)[0m[33m ===========[0m
FAILURE: Build failed with an exception.
* Where:
Script '<https://ci-beam.apache.org/job/beam_PostCommit_Python311/ws/src/sdks/python/test-suites/portable/common.gradle'> line: 326
* What went wrong:
Execution failed for task ':sdks:python:test-suites:portable:py311:postCommitPy311IT'.
> Process 'command 'sh'' finished with non-zero exit value 1
* Try:
> Run with --stacktrace option to get the stack trace.
> Run with --info or --debug option to get more log output.
* Get more help at https://help.gradle.org
Deprecated Gradle features were used in this build, making it incompatible with Gradle 8.0.
You can use '--warning-mode all' to show the individual deprecation warnings and determine if they come from your own scripts or plugins.
See https://docs.gradle.org/7.6.2/userguide/command_line_interface.html#sec:command_line_warnings
Execution optimizations have been disabled for 1 invalid unit(s) of work during this build to ensure correctness.
Please consult deprecation warnings for more details.
BUILD FAILED in 2h 19m 20s
209 actionable tasks: 144 executed, 59 from cache, 6 up-to-date
Publishing build scan...
https://ge.apache.org/s/r4eudfybe43cm
Build step 'Invoke Gradle script' changed build result to FAILURE
Build step 'Invoke Gradle script' marked build as failure
---------------------------------------------------------------------
To unsubscribe, e-mail: builds-unsubscribe@beam.apache.org
For additional commands, e-mail: builds-help@beam.apache.org
Build failed in Jenkins: beam_PostCommit_Python311 #629
Posted by Apache Jenkins Server <je...@builds.apache.org>.
See <https://ci-beam.apache.org/job/beam_PostCommit_Python311/629/display/redirect?page=changes>
Changes:
[noreply] Fix Java 11 Example PreCommit GItHub Action (#28291)
------------------------------------------
[...truncated 8.41 MB...]
Implementing implicit namespace packages (as specified in PEP 420) is preferred to `pkg_resources.declare_namespace`. See https://setuptools.pypa.io/en/latest/references/keywords.html#keyword-namespace-packages
declare_namespace(pkg)
../../build/gradleenv/2050596099/lib/python3.11/site-packages/pkg_resources/__init__.py:2350: 36 warnings
<https://ci-beam.apache.org/job/beam_PostCommit_Python311/ws/src/build/gradleenv/2050596099/lib/python3.11/site-packages/pkg_resources/__init__.py>:2350: DeprecationWarning: Deprecated call to `pkg_resources.declare_namespace('google')`.
Implementing implicit namespace packages (as specified in PEP 420) is preferred to `pkg_resources.declare_namespace`. See https://setuptools.pypa.io/en/latest/references/keywords.html#keyword-namespace-packages
declare_namespace(parent)
../../build/gradleenv/2050596099/lib/python3.11/site-packages/pkg_resources/__init__.py:2871
../../build/gradleenv/2050596099/lib/python3.11/site-packages/pkg_resources/__init__.py:2871
../../build/gradleenv/2050596099/lib/python3.11/site-packages/pkg_resources/__init__.py:2871
../../build/gradleenv/2050596099/lib/python3.11/site-packages/pkg_resources/__init__.py:2871
../../build/gradleenv/2050596099/lib/python3.11/site-packages/pkg_resources/__init__.py:2871
../../build/gradleenv/2050596099/lib/python3.11/site-packages/pkg_resources/__init__.py:2871
../../build/gradleenv/2050596099/lib/python3.11/site-packages/pkg_resources/__init__.py:2871
../../build/gradleenv/2050596099/lib/python3.11/site-packages/pkg_resources/__init__.py:2871
../../build/gradleenv/2050596099/lib/python3.11/site-packages/pkg_resources/__init__.py:2871
<https://ci-beam.apache.org/job/beam_PostCommit_Python311/ws/src/build/gradleenv/2050596099/lib/python3.11/site-packages/pkg_resources/__init__.py>:2871: DeprecationWarning: Deprecated call to `pkg_resources.declare_namespace('google.logging')`.
Implementing implicit namespace packages (as specified in PEP 420) is preferred to `pkg_resources.declare_namespace`. See https://setuptools.pypa.io/en/latest/references/keywords.html#keyword-namespace-packages
declare_namespace(pkg)
../../build/gradleenv/2050596099/lib/python3.11/site-packages/pkg_resources/__init__.py:2871
../../build/gradleenv/2050596099/lib/python3.11/site-packages/pkg_resources/__init__.py:2871
../../build/gradleenv/2050596099/lib/python3.11/site-packages/pkg_resources/__init__.py:2871
../../build/gradleenv/2050596099/lib/python3.11/site-packages/pkg_resources/__init__.py:2871
../../build/gradleenv/2050596099/lib/python3.11/site-packages/pkg_resources/__init__.py:2871
../../build/gradleenv/2050596099/lib/python3.11/site-packages/pkg_resources/__init__.py:2871
../../build/gradleenv/2050596099/lib/python3.11/site-packages/pkg_resources/__init__.py:2871
../../build/gradleenv/2050596099/lib/python3.11/site-packages/pkg_resources/__init__.py:2871
../../build/gradleenv/2050596099/lib/python3.11/site-packages/pkg_resources/__init__.py:2871
<https://ci-beam.apache.org/job/beam_PostCommit_Python311/ws/src/build/gradleenv/2050596099/lib/python3.11/site-packages/pkg_resources/__init__.py>:2871: DeprecationWarning: Deprecated call to `pkg_resources.declare_namespace('google.iam')`.
Implementing implicit namespace packages (as specified in PEP 420) is preferred to `pkg_resources.declare_namespace`. See https://setuptools.pypa.io/en/latest/references/keywords.html#keyword-namespace-packages
declare_namespace(pkg)
../../build/gradleenv/2050596099/lib/python3.11/site-packages/google/rpc/__init__.py:20
../../build/gradleenv/2050596099/lib/python3.11/site-packages/google/rpc/__init__.py:20
../../build/gradleenv/2050596099/lib/python3.11/site-packages/google/rpc/__init__.py:20
../../build/gradleenv/2050596099/lib/python3.11/site-packages/google/rpc/__init__.py:20
../../build/gradleenv/2050596099/lib/python3.11/site-packages/google/rpc/__init__.py:20
../../build/gradleenv/2050596099/lib/python3.11/site-packages/google/rpc/__init__.py:20
../../build/gradleenv/2050596099/lib/python3.11/site-packages/google/rpc/__init__.py:20
../../build/gradleenv/2050596099/lib/python3.11/site-packages/google/rpc/__init__.py:20
../../build/gradleenv/2050596099/lib/python3.11/site-packages/google/rpc/__init__.py:20
<https://ci-beam.apache.org/job/beam_PostCommit_Python311/ws/src/build/gradleenv/2050596099/lib/python3.11/site-packages/google/rpc/__init__.py>:20: DeprecationWarning: Deprecated call to `pkg_resources.declare_namespace('google.rpc')`.
Implementing implicit namespace packages (as specified in PEP 420) is preferred to `pkg_resources.declare_namespace`. See https://setuptools.pypa.io/en/latest/references/keywords.html#keyword-namespace-packages
pkg_resources.declare_namespace(__name__)
../../build/gradleenv/2050596099/lib/python3.11/site-packages/google/api_core/operations_v1/abstract_operations_client.py:17
../../build/gradleenv/2050596099/lib/python3.11/site-packages/google/api_core/operations_v1/abstract_operations_client.py:17
../../build/gradleenv/2050596099/lib/python3.11/site-packages/google/api_core/operations_v1/abstract_operations_client.py:17
../../build/gradleenv/2050596099/lib/python3.11/site-packages/google/api_core/operations_v1/abstract_operations_client.py:17
../../build/gradleenv/2050596099/lib/python3.11/site-packages/google/api_core/operations_v1/abstract_operations_client.py:17
../../build/gradleenv/2050596099/lib/python3.11/site-packages/google/api_core/operations_v1/abstract_operations_client.py:17
../../build/gradleenv/2050596099/lib/python3.11/site-packages/google/api_core/operations_v1/abstract_operations_client.py:17
../../build/gradleenv/2050596099/lib/python3.11/site-packages/google/api_core/operations_v1/abstract_operations_client.py:17
<https://ci-beam.apache.org/job/beam_PostCommit_Python311/ws/src/build/gradleenv/2050596099/lib/python3.11/site-packages/google/api_core/operations_v1/abstract_operations_client.py>:17: DeprecationWarning: The distutils package is deprecated and slated for removal in Python 3.12. Use setuptools or check PEP 632 for potential alternatives
from distutils import util
apache_beam/dataframe/io_it_test.py: 3 warnings
apache_beam/examples/cookbook/bigquery_tornadoes_it_test.py: 1 warning
apache_beam/examples/dataframe/flight_delays_it_test.py: 1 warning
apache_beam/io/gcp/big_query_query_to_table_it_test.py: 4 warnings
apache_beam/io/gcp/bigquery_read_it_test.py: 7 warnings
apache_beam/io/gcp/bigquery_io_read_it_test.py: 2 warnings
apache_beam/io/gcp/bigquery_json_it_test.py: 3 warnings
<https://ci-beam.apache.org/job/beam_PostCommit_Python311/ws/src/sdks/python/apache_beam/io/gcp/bigquery.py>:2748: BeamDeprecationWarning: options is deprecated since First stable release. References to <pipeline>.options will not be supported
temp_location = pcoll.pipeline.options.view_as(
apache_beam/dataframe/io_it_test.py: 3 warnings
apache_beam/examples/cookbook/bigquery_tornadoes_it_test.py: 1 warning
apache_beam/examples/dataframe/flight_delays_it_test.py: 1 warning
apache_beam/io/gcp/big_query_query_to_table_it_test.py: 4 warnings
apache_beam/io/gcp/bigquery_read_it_test.py: 7 warnings
apache_beam/io/gcp/bigquery_io_read_it_test.py: 2 warnings
apache_beam/io/gcp/bigquery_json_it_test.py: 3 warnings
<https://ci-beam.apache.org/job/beam_PostCommit_Python311/ws/src/sdks/python/apache_beam/io/gcp/bigquery.py>:2750: BeamDeprecationWarning: options is deprecated since First stable release. References to <pipeline>.options will not be supported
job_name = pcoll.pipeline.options.view_as(GoogleCloudOptions).job_name
apache_beam/dataframe/io_it_test.py: 3 warnings
apache_beam/examples/cookbook/bigquery_tornadoes_it_test.py: 1 warning
apache_beam/examples/dataframe/flight_delays_it_test.py: 1 warning
apache_beam/io/gcp/big_query_query_to_table_it_test.py: 4 warnings
apache_beam/io/gcp/bigquery_read_it_test.py: 7 warnings
apache_beam/io/gcp/bigquery_io_read_it_test.py: 2 warnings
apache_beam/io/gcp/bigquery_json_it_test.py: 3 warnings
<https://ci-beam.apache.org/job/beam_PostCommit_Python311/ws/src/sdks/python/apache_beam/io/gcp/bigquery.py>:2774: BeamDeprecationWarning: options is deprecated since First stable release. References to <pipeline>.options will not be supported
pipeline_options=pcoll.pipeline.options,
apache_beam/examples/cookbook/bigquery_tornadoes_it_test.py: 1 warning
apache_beam/io/gcp/big_query_query_to_table_it_test.py: 4 warnings
apache_beam/io/gcp/bigquery_write_it_test.py: 4 warnings
apache_beam/io/gcp/bigquery_test.py: 2 warnings
<https://ci-beam.apache.org/job/beam_PostCommit_Python311/ws/src/sdks/python/apache_beam/io/gcp/bigquery.py>:2097: BeamDeprecationWarning: options is deprecated since First stable release. References to <pipeline>.options will not be supported
self.table_reference.projectId = pcoll.pipeline.options.view_as(
apache_beam/examples/cookbook/bigquery_tornadoes_it_test.py: 1 warning
apache_beam/examples/complete/game/game_stats_it_test.py: 2 warnings
apache_beam/examples/complete/game/hourly_team_score_it_test.py: 1 warning
apache_beam/examples/complete/game/leader_board_it_test.py: 2 warnings
apache_beam/io/gcp/big_query_query_to_table_it_test.py: 4 warnings
apache_beam/io/gcp/bigquery_file_loads_test.py: 3 warnings
apache_beam/io/gcp/bigquery_json_it_test.py: 2 warnings
apache_beam/io/gcp/bigquery_test.py: 6 warnings
apache_beam/io/gcp/bigquery_write_it_test.py: 4 warnings
<https://ci-beam.apache.org/job/beam_PostCommit_Python311/ws/src/sdks/python/apache_beam/io/gcp/bigquery.py>:2101: BeamDeprecationWarning: options is deprecated since First stable release. References to <pipeline>.options will not be supported
is_streaming_pipeline = p.options.view_as(StandardOptions).streaming
apache_beam/examples/cookbook/bigquery_tornadoes_it_test.py: 1 warning
apache_beam/examples/complete/game/game_stats_it_test.py: 2 warnings
apache_beam/examples/complete/game/hourly_team_score_it_test.py: 1 warning
apache_beam/examples/complete/game/leader_board_it_test.py: 2 warnings
apache_beam/io/gcp/big_query_query_to_table_it_test.py: 4 warnings
apache_beam/io/gcp/bigquery_file_loads_test.py: 3 warnings
apache_beam/io/gcp/bigquery_json_it_test.py: 2 warnings
apache_beam/io/gcp/bigquery_test.py: 6 warnings
apache_beam/io/gcp/bigquery_write_it_test.py: 4 warnings
<https://ci-beam.apache.org/job/beam_PostCommit_Python311/ws/src/sdks/python/apache_beam/io/gcp/bigquery.py>:2107: BeamDeprecationWarning: options is deprecated since First stable release. References to <pipeline>.options will not be supported
experiments = p.options.view_as(DebugOptions).experiments or []
apache_beam/examples/cookbook/bigquery_tornadoes_it_test.py: 1 warning
apache_beam/io/gcp/big_query_query_to_table_it_test.py: 4 warnings
apache_beam/io/gcp/bigquery_file_loads_test.py: 3 warnings
apache_beam/io/gcp/bigquery_write_it_test.py: 3 warnings
apache_beam/io/gcp/bigquery_test.py: 3 warnings
<https://ci-beam.apache.org/job/beam_PostCommit_Python311/ws/src/sdks/python/apache_beam/io/gcp/bigquery_file_loads.py>:1176: BeamDeprecationWarning: options is deprecated since First stable release. References to <pipeline>.options will not be supported
self.project = self.project or p.options.view_as(GoogleCloudOptions).project
apache_beam/examples/cookbook/bigquery_tornadoes_it_test.py: 1 warning
apache_beam/examples/complete/game/hourly_team_score_it_test.py: 1 warning
apache_beam/io/gcp/big_query_query_to_table_it_test.py: 4 warnings
apache_beam/io/gcp/bigquery_file_loads_test.py: 3 warnings
apache_beam/io/gcp/bigquery_write_it_test.py: 3 warnings
apache_beam/io/gcp/bigquery_test.py: 3 warnings
<https://ci-beam.apache.org/job/beam_PostCommit_Python311/ws/src/sdks/python/apache_beam/io/gcp/bigquery_file_loads.py>:1183: BeamDeprecationWarning: options is deprecated since First stable release. References to <pipeline>.options will not be supported
temp_location = p.options.view_as(GoogleCloudOptions).temp_location
apache_beam/examples/cookbook/bigquery_tornadoes_it_test.py: 1 warning
apache_beam/examples/complete/game/hourly_team_score_it_test.py: 1 warning
apache_beam/io/gcp/big_query_query_to_table_it_test.py: 4 warnings
apache_beam/io/gcp/bigquery_file_loads_test.py: 3 warnings
apache_beam/io/gcp/bigquery_write_it_test.py: 3 warnings
apache_beam/io/gcp/bigquery_test.py: 3 warnings
<https://ci-beam.apache.org/job/beam_PostCommit_Python311/ws/src/sdks/python/apache_beam/io/gcp/bigquery_file_loads.py>:1185: BeamDeprecationWarning: options is deprecated since First stable release. References to <pipeline>.options will not be supported
p.options.view_as(GoogleCloudOptions).job_name or 'AUTOMATIC_JOB_NAME')
apache_beam/examples/cookbook/bigquery_tornadoes_it_test.py::BigqueryTornadoesIT::test_bigquery_tornadoes_it
<https://ci-beam.apache.org/job/beam_PostCommit_Python311/ws/src/sdks/python/apache_beam/io/gcp/tests/utils.py>:100: PendingDeprecationWarning: Client.dataset is deprecated and will be removed in a future version. Use a string like 'my_project.my_dataset' or a cloud.google.bigquery.DatasetReference object, instead.
table_ref = client.dataset(dataset_id).table(table_id)
apache_beam/examples/complete/game/game_stats_it_test.py::GameStatsIT::test_game_stats_it
apache_beam/examples/complete/game/hourly_team_score_it_test.py::HourlyTeamScoreIT::test_hourly_team_score_it
apache_beam/examples/complete/game/leader_board_it_test.py::LeaderBoardIT::test_leader_board_it
apache_beam/io/gcp/bigquery_test.py::PubSubBigQueryIT::test_file_loads
apache_beam/io/gcp/bigquery_test.py::PubSubBigQueryIT::test_streaming_inserts
<https://ci-beam.apache.org/job/beam_PostCommit_Python311/ws/src/sdks/python/apache_beam/io/gcp/tests/utils.py>:63: PendingDeprecationWarning: Client.dataset is deprecated and will be removed in a future version. Use a string like 'my_project.my_dataset' or a cloud.google.bigquery.DatasetReference object, instead.
dataset_ref = client.dataset(unique_dataset_name, project=project)
apache_beam/dataframe/io_it_test.py: 2 warnings
apache_beam/io/gcp/bigquery_json_it_test.py: 1 warning
apache_beam/io/gcp/bigquery_read_it_test.py: 10 warnings
<https://ci-beam.apache.org/job/beam_PostCommit_Python311/ws/src/sdks/python/apache_beam/io/gcp/bigquery.py>:2792: BeamDeprecationWarning: options is deprecated since First stable release. References to <pipeline>.options will not be supported
project_id = pcoll.pipeline.options.view_as(GoogleCloudOptions).project
apache_beam/dataframe/io_it_test.py: 2 warnings
apache_beam/io/gcp/bigquery_json_it_test.py: 1 warning
apache_beam/io/gcp/bigquery_read_it_test.py: 10 warnings
<https://ci-beam.apache.org/job/beam_PostCommit_Python311/ws/src/sdks/python/apache_beam/io/gcp/bigquery.py>:2813: BeamDeprecationWarning: options is deprecated since First stable release. References to <pipeline>.options will not be supported
pipeline_options=pcoll.pipeline.options,
apache_beam/dataframe/io_it_test.py: 2 warnings
apache_beam/io/gcp/bigquery_json_it_test.py: 1 warning
apache_beam/io/gcp/bigquery_read_it_test.py: 10 warnings
<https://ci-beam.apache.org/job/beam_PostCommit_Python311/ws/src/sdks/python/apache_beam/io/gcp/bigquery_read_internal.py>:150: BeamDeprecationWarning: options is deprecated since First stable release. References to <pipeline>.options will not be supported
pipeline_options = input.pipeline.options
apache_beam/examples/dataframe/flight_delays_it_test.py::FlightDelaysTest::test_flight_delays
<https://ci-beam.apache.org/job/beam_PostCommit_Python311/ws/src/sdks/python/apache_beam/examples/dataframe/flight_delays.py>:47: FutureWarning: The default value of numeric_only in DataFrame.mean is deprecated. In a future version, it will default to False. In addition, specifying 'numeric_only=None' is deprecated. Select only valid columns or specify the value of numeric_only to silence this warning.
return airline_df[at_top_airports].mean()
apache_beam/examples/dataframe/flight_delays_it_test.py::FlightDelaysTest::test_flight_delays
apache_beam/examples/dataframe/taxiride_it_test.py::TaxirideIT::test_aggregation
apache_beam/examples/dataframe/taxiride_it_test.py::TaxirideIT::test_enrich
<https://ci-beam.apache.org/job/beam_PostCommit_Python311/ws/src/sdks/python/apache_beam/io/fileio.py>:605: BeamDeprecationWarning: options is deprecated since First stable release. References to <pipeline>.options will not be supported
p.options.view_as(GoogleCloudOptions).temp_location or
apache_beam/io/gcp/bigquery_read_it_test.py::ReadTests::test_native_source
<https://ci-beam.apache.org/job/beam_PostCommit_Python311/ws/src/sdks/python/apache_beam/io/gcp/bigquery_read_it_test.py>:170: BeamDeprecationWarning: BigQuerySource is deprecated since 2.25.0. Use ReadFromBigQuery instead.
beam.io.BigQuerySource(query=self.query, use_standard_sql=True)))
apache_beam/io/gcp/bigquery_test.py::BigQueryStreamingInsertTransformIntegrationTests::test_multiple_destinations_transform
<https://ci-beam.apache.org/job/beam_PostCommit_Python311/ws/src/sdks/python/apache_beam/io/gcp/bigquery_test.py>:1726: BeamDeprecationWarning: options is deprecated since First stable release. References to <pipeline>.options will not be supported
streaming = self.test_pipeline.options.view_as(StandardOptions).streaming
apache_beam/transforms/external_it_test.py::ExternalTransformIT::test_job_python_from_python_it
<https://ci-beam.apache.org/job/beam_PostCommit_Python311/ws/src/sdks/python/apache_beam/transforms/external.py>:679: BeamDeprecationWarning: options is deprecated since First stable release. References to <pipeline>.options will not be supported
self._expansion_service, pipeline.options)
apache_beam/io/gcp/bigquery_read_it_test.py::ReadNewTypesTests::test_native_source
<https://ci-beam.apache.org/job/beam_PostCommit_Python311/ws/src/sdks/python/apache_beam/io/gcp/bigquery_read_it_test.py>:706: BeamDeprecationWarning: BigQuerySource is deprecated since 2.25.0. Use ReadFromBigQuery instead.
beam.io.BigQuerySource(query=self.query, use_standard_sql=True)))
apache_beam/io/gcp/bigquery_read_it_test.py::ReadAllBQTests::test_read_queries
<https://ci-beam.apache.org/job/beam_PostCommit_Python311/ws/src/sdks/python/apache_beam/io/gcp/bigquery.py>:2920: BeamDeprecationWarning: options is deprecated since First stable release. References to <pipeline>.options will not be supported
job_name = pcoll.pipeline.options.view_as(GoogleCloudOptions).job_name
apache_beam/io/gcp/bigquery_read_it_test.py::ReadAllBQTests::test_read_queries
<https://ci-beam.apache.org/job/beam_PostCommit_Python311/ws/src/sdks/python/apache_beam/io/gcp/bigquery.py>:2921: BeamDeprecationWarning: options is deprecated since First stable release. References to <pipeline>.options will not be supported
project = pcoll.pipeline.options.view_as(GoogleCloudOptions).project
apache_beam/io/gcp/bigquery_read_it_test.py::ReadAllBQTests::test_read_queries
<https://ci-beam.apache.org/job/beam_PostCommit_Python311/ws/src/sdks/python/apache_beam/io/gcp/bigquery.py>:2934: BeamDeprecationWarning: options is deprecated since First stable release. References to <pipeline>.options will not be supported
options=pcoll.pipeline.options,
-- Docs: https://docs.pytest.org/en/stable/how-to/capture-warnings.html
- generated xml file: <https://ci-beam.apache.org/job/beam_PostCommit_Python311/ws/src/sdks/python/pytest_postCommitIT-df-py311.xml> -
[33m========== [32m87 passed[0m, [33m[1m51 skipped[0m, [33m[1m637 warnings[0m[33m in 8872.55s (2:27:52)[0m[33m ===========[0m
FAILURE: Build failed with an exception.
* Where:
Script '<https://ci-beam.apache.org/job/beam_PostCommit_Python311/ws/src/sdks/python/test-suites/portable/common.gradle'> line: 326
* What went wrong:
Execution failed for task ':sdks:python:test-suites:portable:py311:postCommitPy311IT'.
> Process 'command 'sh'' finished with non-zero exit value 1
* Try:
> Run with --stacktrace option to get the stack trace.
> Run with --info or --debug option to get more log output.
* Get more help at https://help.gradle.org
Deprecated Gradle features were used in this build, making it incompatible with Gradle 8.0.
You can use '--warning-mode all' to show the individual deprecation warnings and determine if they come from your own scripts or plugins.
See https://docs.gradle.org/7.6.2/userguide/command_line_interface.html#sec:command_line_warnings
Execution optimizations have been disabled for 1 invalid unit(s) of work during this build to ensure correctness.
Please consult deprecation warnings for more details.
BUILD FAILED in 2h 36m 41s
209 actionable tasks: 145 executed, 58 from cache, 6 up-to-date
Publishing build scan...
https://ge.apache.org/s/63gcb6qbkex3u
Build step 'Invoke Gradle script' changed build result to FAILURE
Build step 'Invoke Gradle script' marked build as failure
---------------------------------------------------------------------
To unsubscribe, e-mail: builds-unsubscribe@beam.apache.org
For additional commands, e-mail: builds-help@beam.apache.org
Build failed in Jenkins: beam_PostCommit_Python311 #628
Posted by Apache Jenkins Server <je...@builds.apache.org>.
See <https://ci-beam.apache.org/job/beam_PostCommit_Python311/628/display/redirect>
Changes:
------------------------------------------
[...truncated 6.31 MB...]
Implementing implicit namespace packages (as specified in PEP 420) is preferred to `pkg_resources.declare_namespace`. See https://setuptools.pypa.io/en/latest/references/keywords.html#keyword-namespace-packages
declare_namespace(pkg)
../../build/gradleenv/2050596099/lib/python3.11/site-packages/pkg_resources/__init__.py:2350: 36 warnings
<https://ci-beam.apache.org/job/beam_PostCommit_Python311/ws/src/build/gradleenv/2050596099/lib/python3.11/site-packages/pkg_resources/__init__.py>:2350: DeprecationWarning: Deprecated call to `pkg_resources.declare_namespace('google')`.
Implementing implicit namespace packages (as specified in PEP 420) is preferred to `pkg_resources.declare_namespace`. See https://setuptools.pypa.io/en/latest/references/keywords.html#keyword-namespace-packages
declare_namespace(parent)
../../build/gradleenv/2050596099/lib/python3.11/site-packages/pkg_resources/__init__.py:2871
../../build/gradleenv/2050596099/lib/python3.11/site-packages/pkg_resources/__init__.py:2871
../../build/gradleenv/2050596099/lib/python3.11/site-packages/pkg_resources/__init__.py:2871
../../build/gradleenv/2050596099/lib/python3.11/site-packages/pkg_resources/__init__.py:2871
../../build/gradleenv/2050596099/lib/python3.11/site-packages/pkg_resources/__init__.py:2871
../../build/gradleenv/2050596099/lib/python3.11/site-packages/pkg_resources/__init__.py:2871
../../build/gradleenv/2050596099/lib/python3.11/site-packages/pkg_resources/__init__.py:2871
../../build/gradleenv/2050596099/lib/python3.11/site-packages/pkg_resources/__init__.py:2871
../../build/gradleenv/2050596099/lib/python3.11/site-packages/pkg_resources/__init__.py:2871
<https://ci-beam.apache.org/job/beam_PostCommit_Python311/ws/src/build/gradleenv/2050596099/lib/python3.11/site-packages/pkg_resources/__init__.py>:2871: DeprecationWarning: Deprecated call to `pkg_resources.declare_namespace('google.logging')`.
Implementing implicit namespace packages (as specified in PEP 420) is preferred to `pkg_resources.declare_namespace`. See https://setuptools.pypa.io/en/latest/references/keywords.html#keyword-namespace-packages
declare_namespace(pkg)
../../build/gradleenv/2050596099/lib/python3.11/site-packages/pkg_resources/__init__.py:2871
../../build/gradleenv/2050596099/lib/python3.11/site-packages/pkg_resources/__init__.py:2871
../../build/gradleenv/2050596099/lib/python3.11/site-packages/pkg_resources/__init__.py:2871
../../build/gradleenv/2050596099/lib/python3.11/site-packages/pkg_resources/__init__.py:2871
../../build/gradleenv/2050596099/lib/python3.11/site-packages/pkg_resources/__init__.py:2871
../../build/gradleenv/2050596099/lib/python3.11/site-packages/pkg_resources/__init__.py:2871
../../build/gradleenv/2050596099/lib/python3.11/site-packages/pkg_resources/__init__.py:2871
../../build/gradleenv/2050596099/lib/python3.11/site-packages/pkg_resources/__init__.py:2871
../../build/gradleenv/2050596099/lib/python3.11/site-packages/pkg_resources/__init__.py:2871
<https://ci-beam.apache.org/job/beam_PostCommit_Python311/ws/src/build/gradleenv/2050596099/lib/python3.11/site-packages/pkg_resources/__init__.py>:2871: DeprecationWarning: Deprecated call to `pkg_resources.declare_namespace('google.iam')`.
Implementing implicit namespace packages (as specified in PEP 420) is preferred to `pkg_resources.declare_namespace`. See https://setuptools.pypa.io/en/latest/references/keywords.html#keyword-namespace-packages
declare_namespace(pkg)
../../build/gradleenv/2050596099/lib/python3.11/site-packages/google/rpc/__init__.py:20
../../build/gradleenv/2050596099/lib/python3.11/site-packages/google/rpc/__init__.py:20
../../build/gradleenv/2050596099/lib/python3.11/site-packages/google/rpc/__init__.py:20
../../build/gradleenv/2050596099/lib/python3.11/site-packages/google/rpc/__init__.py:20
../../build/gradleenv/2050596099/lib/python3.11/site-packages/google/rpc/__init__.py:20
../../build/gradleenv/2050596099/lib/python3.11/site-packages/google/rpc/__init__.py:20
../../build/gradleenv/2050596099/lib/python3.11/site-packages/google/rpc/__init__.py:20
../../build/gradleenv/2050596099/lib/python3.11/site-packages/google/rpc/__init__.py:20
../../build/gradleenv/2050596099/lib/python3.11/site-packages/google/rpc/__init__.py:20
<https://ci-beam.apache.org/job/beam_PostCommit_Python311/ws/src/build/gradleenv/2050596099/lib/python3.11/site-packages/google/rpc/__init__.py>:20: DeprecationWarning: Deprecated call to `pkg_resources.declare_namespace('google.rpc')`.
Implementing implicit namespace packages (as specified in PEP 420) is preferred to `pkg_resources.declare_namespace`. See https://setuptools.pypa.io/en/latest/references/keywords.html#keyword-namespace-packages
pkg_resources.declare_namespace(__name__)
../../build/gradleenv/2050596099/lib/python3.11/site-packages/google/api_core/operations_v1/abstract_operations_client.py:17
../../build/gradleenv/2050596099/lib/python3.11/site-packages/google/api_core/operations_v1/abstract_operations_client.py:17
../../build/gradleenv/2050596099/lib/python3.11/site-packages/google/api_core/operations_v1/abstract_operations_client.py:17
../../build/gradleenv/2050596099/lib/python3.11/site-packages/google/api_core/operations_v1/abstract_operations_client.py:17
../../build/gradleenv/2050596099/lib/python3.11/site-packages/google/api_core/operations_v1/abstract_operations_client.py:17
../../build/gradleenv/2050596099/lib/python3.11/site-packages/google/api_core/operations_v1/abstract_operations_client.py:17
../../build/gradleenv/2050596099/lib/python3.11/site-packages/google/api_core/operations_v1/abstract_operations_client.py:17
../../build/gradleenv/2050596099/lib/python3.11/site-packages/google/api_core/operations_v1/abstract_operations_client.py:17
<https://ci-beam.apache.org/job/beam_PostCommit_Python311/ws/src/build/gradleenv/2050596099/lib/python3.11/site-packages/google/api_core/operations_v1/abstract_operations_client.py>:17: DeprecationWarning: The distutils package is deprecated and slated for removal in Python 3.12. Use setuptools or check PEP 632 for potential alternatives
from distutils import util
apache_beam/dataframe/io_it_test.py: 3 warnings
apache_beam/examples/cookbook/bigquery_tornadoes_it_test.py: 1 warning
apache_beam/examples/dataframe/flight_delays_it_test.py: 1 warning
apache_beam/io/gcp/bigquery_read_it_test.py: 7 warnings
apache_beam/io/gcp/bigquery_io_read_it_test.py: 2 warnings
apache_beam/io/gcp/bigquery_json_it_test.py: 3 warnings
apache_beam/io/gcp/big_query_query_to_table_it_test.py: 4 warnings
<https://ci-beam.apache.org/job/beam_PostCommit_Python311/ws/src/sdks/python/apache_beam/io/gcp/bigquery.py>:2748: BeamDeprecationWarning: options is deprecated since First stable release. References to <pipeline>.options will not be supported
temp_location = pcoll.pipeline.options.view_as(
apache_beam/dataframe/io_it_test.py: 3 warnings
apache_beam/examples/cookbook/bigquery_tornadoes_it_test.py: 1 warning
apache_beam/examples/dataframe/flight_delays_it_test.py: 1 warning
apache_beam/io/gcp/bigquery_read_it_test.py: 7 warnings
apache_beam/io/gcp/bigquery_io_read_it_test.py: 2 warnings
apache_beam/io/gcp/bigquery_json_it_test.py: 3 warnings
apache_beam/io/gcp/big_query_query_to_table_it_test.py: 4 warnings
<https://ci-beam.apache.org/job/beam_PostCommit_Python311/ws/src/sdks/python/apache_beam/io/gcp/bigquery.py>:2750: BeamDeprecationWarning: options is deprecated since First stable release. References to <pipeline>.options will not be supported
job_name = pcoll.pipeline.options.view_as(GoogleCloudOptions).job_name
apache_beam/dataframe/io_it_test.py: 3 warnings
apache_beam/examples/cookbook/bigquery_tornadoes_it_test.py: 1 warning
apache_beam/examples/dataframe/flight_delays_it_test.py: 1 warning
apache_beam/io/gcp/bigquery_read_it_test.py: 7 warnings
apache_beam/io/gcp/bigquery_io_read_it_test.py: 2 warnings
apache_beam/io/gcp/bigquery_json_it_test.py: 3 warnings
apache_beam/io/gcp/big_query_query_to_table_it_test.py: 4 warnings
<https://ci-beam.apache.org/job/beam_PostCommit_Python311/ws/src/sdks/python/apache_beam/io/gcp/bigquery.py>:2774: BeamDeprecationWarning: options is deprecated since First stable release. References to <pipeline>.options will not be supported
pipeline_options=pcoll.pipeline.options,
apache_beam/dataframe/io_it_test.py: 2 warnings
apache_beam/io/gcp/bigquery_json_it_test.py: 1 warning
apache_beam/io/gcp/bigquery_read_it_test.py: 10 warnings
<https://ci-beam.apache.org/job/beam_PostCommit_Python311/ws/src/sdks/python/apache_beam/io/gcp/bigquery.py>:2792: BeamDeprecationWarning: options is deprecated since First stable release. References to <pipeline>.options will not be supported
project_id = pcoll.pipeline.options.view_as(GoogleCloudOptions).project
apache_beam/dataframe/io_it_test.py: 2 warnings
apache_beam/io/gcp/bigquery_json_it_test.py: 1 warning
apache_beam/io/gcp/bigquery_read_it_test.py: 10 warnings
<https://ci-beam.apache.org/job/beam_PostCommit_Python311/ws/src/sdks/python/apache_beam/io/gcp/bigquery.py>:2813: BeamDeprecationWarning: options is deprecated since First stable release. References to <pipeline>.options will not be supported
pipeline_options=pcoll.pipeline.options,
apache_beam/dataframe/io_it_test.py: 2 warnings
apache_beam/io/gcp/bigquery_json_it_test.py: 1 warning
apache_beam/io/gcp/bigquery_read_it_test.py: 10 warnings
<https://ci-beam.apache.org/job/beam_PostCommit_Python311/ws/src/sdks/python/apache_beam/io/gcp/bigquery_read_internal.py>:150: BeamDeprecationWarning: options is deprecated since First stable release. References to <pipeline>.options will not be supported
pipeline_options = input.pipeline.options
apache_beam/examples/complete/game/hourly_team_score_it_test.py::HourlyTeamScoreIT::test_hourly_team_score_it
apache_beam/examples/complete/game/game_stats_it_test.py::GameStatsIT::test_game_stats_it
apache_beam/examples/complete/game/leader_board_it_test.py::LeaderBoardIT::test_leader_board_it
apache_beam/io/gcp/bigquery_test.py::PubSubBigQueryIT::test_file_loads
apache_beam/io/gcp/bigquery_test.py::PubSubBigQueryIT::test_streaming_inserts
<https://ci-beam.apache.org/job/beam_PostCommit_Python311/ws/src/sdks/python/apache_beam/io/gcp/tests/utils.py>:63: PendingDeprecationWarning: Client.dataset is deprecated and will be removed in a future version. Use a string like 'my_project.my_dataset' or a cloud.google.bigquery.DatasetReference object, instead.
dataset_ref = client.dataset(unique_dataset_name, project=project)
apache_beam/examples/complete/game/hourly_team_score_it_test.py: 1 warning
apache_beam/examples/cookbook/bigquery_tornadoes_it_test.py: 1 warning
apache_beam/examples/complete/game/game_stats_it_test.py: 2 warnings
apache_beam/examples/complete/game/leader_board_it_test.py: 2 warnings
apache_beam/io/gcp/bigquery_write_it_test.py: 4 warnings
apache_beam/io/gcp/bigquery_json_it_test.py: 2 warnings
apache_beam/io/gcp/bigquery_file_loads_test.py: 3 warnings
apache_beam/io/gcp/bigquery_test.py: 6 warnings
apache_beam/io/gcp/big_query_query_to_table_it_test.py: 4 warnings
<https://ci-beam.apache.org/job/beam_PostCommit_Python311/ws/src/sdks/python/apache_beam/io/gcp/bigquery.py>:2101: BeamDeprecationWarning: options is deprecated since First stable release. References to <pipeline>.options will not be supported
is_streaming_pipeline = p.options.view_as(StandardOptions).streaming
apache_beam/examples/complete/game/hourly_team_score_it_test.py: 1 warning
apache_beam/examples/cookbook/bigquery_tornadoes_it_test.py: 1 warning
apache_beam/examples/complete/game/game_stats_it_test.py: 2 warnings
apache_beam/examples/complete/game/leader_board_it_test.py: 2 warnings
apache_beam/io/gcp/bigquery_write_it_test.py: 4 warnings
apache_beam/io/gcp/bigquery_json_it_test.py: 2 warnings
apache_beam/io/gcp/bigquery_file_loads_test.py: 3 warnings
apache_beam/io/gcp/bigquery_test.py: 6 warnings
apache_beam/io/gcp/big_query_query_to_table_it_test.py: 4 warnings
<https://ci-beam.apache.org/job/beam_PostCommit_Python311/ws/src/sdks/python/apache_beam/io/gcp/bigquery.py>:2107: BeamDeprecationWarning: options is deprecated since First stable release. References to <pipeline>.options will not be supported
experiments = p.options.view_as(DebugOptions).experiments or []
apache_beam/examples/complete/game/hourly_team_score_it_test.py: 1 warning
apache_beam/examples/cookbook/bigquery_tornadoes_it_test.py: 1 warning
apache_beam/io/gcp/bigquery_write_it_test.py: 3 warnings
apache_beam/io/gcp/bigquery_file_loads_test.py: 3 warnings
apache_beam/io/gcp/bigquery_test.py: 3 warnings
apache_beam/io/gcp/big_query_query_to_table_it_test.py: 4 warnings
<https://ci-beam.apache.org/job/beam_PostCommit_Python311/ws/src/sdks/python/apache_beam/io/gcp/bigquery_file_loads.py>:1183: BeamDeprecationWarning: options is deprecated since First stable release. References to <pipeline>.options will not be supported
temp_location = p.options.view_as(GoogleCloudOptions).temp_location
apache_beam/examples/complete/game/hourly_team_score_it_test.py: 1 warning
apache_beam/examples/cookbook/bigquery_tornadoes_it_test.py: 1 warning
apache_beam/io/gcp/bigquery_write_it_test.py: 3 warnings
apache_beam/io/gcp/bigquery_file_loads_test.py: 3 warnings
apache_beam/io/gcp/bigquery_test.py: 3 warnings
apache_beam/io/gcp/big_query_query_to_table_it_test.py: 4 warnings
<https://ci-beam.apache.org/job/beam_PostCommit_Python311/ws/src/sdks/python/apache_beam/io/gcp/bigquery_file_loads.py>:1185: BeamDeprecationWarning: options is deprecated since First stable release. References to <pipeline>.options will not be supported
p.options.view_as(GoogleCloudOptions).job_name or 'AUTOMATIC_JOB_NAME')
apache_beam/examples/cookbook/bigquery_tornadoes_it_test.py: 1 warning
apache_beam/io/gcp/bigquery_write_it_test.py: 4 warnings
apache_beam/io/gcp/big_query_query_to_table_it_test.py: 4 warnings
apache_beam/io/gcp/bigquery_test.py: 2 warnings
<https://ci-beam.apache.org/job/beam_PostCommit_Python311/ws/src/sdks/python/apache_beam/io/gcp/bigquery.py>:2097: BeamDeprecationWarning: options is deprecated since First stable release. References to <pipeline>.options will not be supported
self.table_reference.projectId = pcoll.pipeline.options.view_as(
apache_beam/examples/cookbook/bigquery_tornadoes_it_test.py: 1 warning
apache_beam/io/gcp/bigquery_write_it_test.py: 3 warnings
apache_beam/io/gcp/bigquery_file_loads_test.py: 3 warnings
apache_beam/io/gcp/bigquery_test.py: 3 warnings
apache_beam/io/gcp/big_query_query_to_table_it_test.py: 4 warnings
<https://ci-beam.apache.org/job/beam_PostCommit_Python311/ws/src/sdks/python/apache_beam/io/gcp/bigquery_file_loads.py>:1176: BeamDeprecationWarning: options is deprecated since First stable release. References to <pipeline>.options will not be supported
self.project = self.project or p.options.view_as(GoogleCloudOptions).project
apache_beam/examples/cookbook/bigquery_tornadoes_it_test.py::BigqueryTornadoesIT::test_bigquery_tornadoes_it
<https://ci-beam.apache.org/job/beam_PostCommit_Python311/ws/src/sdks/python/apache_beam/io/gcp/tests/utils.py>:100: PendingDeprecationWarning: Client.dataset is deprecated and will be removed in a future version. Use a string like 'my_project.my_dataset' or a cloud.google.bigquery.DatasetReference object, instead.
table_ref = client.dataset(dataset_id).table(table_id)
apache_beam/examples/dataframe/taxiride_it_test.py::TaxirideIT::test_aggregation
apache_beam/examples/dataframe/flight_delays_it_test.py::FlightDelaysTest::test_flight_delays
apache_beam/examples/dataframe/taxiride_it_test.py::TaxirideIT::test_enrich
<https://ci-beam.apache.org/job/beam_PostCommit_Python311/ws/src/sdks/python/apache_beam/io/fileio.py>:605: BeamDeprecationWarning: options is deprecated since First stable release. References to <pipeline>.options will not be supported
p.options.view_as(GoogleCloudOptions).temp_location or
apache_beam/examples/dataframe/flight_delays_it_test.py::FlightDelaysTest::test_flight_delays
<https://ci-beam.apache.org/job/beam_PostCommit_Python311/ws/src/sdks/python/apache_beam/examples/dataframe/flight_delays.py>:47: FutureWarning: The default value of numeric_only in DataFrame.mean is deprecated. In a future version, it will default to False. In addition, specifying 'numeric_only=None' is deprecated. Select only valid columns or specify the value of numeric_only to silence this warning.
return airline_df[at_top_airports].mean()
apache_beam/io/gcp/bigquery_read_it_test.py::ReadTests::test_native_source
<https://ci-beam.apache.org/job/beam_PostCommit_Python311/ws/src/sdks/python/apache_beam/io/gcp/bigquery_read_it_test.py>:170: BeamDeprecationWarning: BigQuerySource is deprecated since 2.25.0. Use ReadFromBigQuery instead.
beam.io.BigQuerySource(query=self.query, use_standard_sql=True)))
apache_beam/io/gcp/bigquery_test.py::BigQueryStreamingInsertTransformIntegrationTests::test_multiple_destinations_transform
<https://ci-beam.apache.org/job/beam_PostCommit_Python311/ws/src/sdks/python/apache_beam/io/gcp/bigquery_test.py>:1726: BeamDeprecationWarning: options is deprecated since First stable release. References to <pipeline>.options will not be supported
streaming = self.test_pipeline.options.view_as(StandardOptions).streaming
apache_beam/transforms/external_it_test.py::ExternalTransformIT::test_job_python_from_python_it
<https://ci-beam.apache.org/job/beam_PostCommit_Python311/ws/src/sdks/python/apache_beam/transforms/external.py>:679: BeamDeprecationWarning: options is deprecated since First stable release. References to <pipeline>.options will not be supported
self._expansion_service, pipeline.options)
apache_beam/io/gcp/bigquery_read_it_test.py::ReadNewTypesTests::test_native_source
<https://ci-beam.apache.org/job/beam_PostCommit_Python311/ws/src/sdks/python/apache_beam/io/gcp/bigquery_read_it_test.py>:706: BeamDeprecationWarning: BigQuerySource is deprecated since 2.25.0. Use ReadFromBigQuery instead.
beam.io.BigQuerySource(query=self.query, use_standard_sql=True)))
apache_beam/io/gcp/bigquery_read_it_test.py::ReadAllBQTests::test_read_queries
<https://ci-beam.apache.org/job/beam_PostCommit_Python311/ws/src/sdks/python/apache_beam/io/gcp/bigquery.py>:2920: BeamDeprecationWarning: options is deprecated since First stable release. References to <pipeline>.options will not be supported
job_name = pcoll.pipeline.options.view_as(GoogleCloudOptions).job_name
apache_beam/io/gcp/bigquery_read_it_test.py::ReadAllBQTests::test_read_queries
<https://ci-beam.apache.org/job/beam_PostCommit_Python311/ws/src/sdks/python/apache_beam/io/gcp/bigquery.py>:2921: BeamDeprecationWarning: options is deprecated since First stable release. References to <pipeline>.options will not be supported
project = pcoll.pipeline.options.view_as(GoogleCloudOptions).project
apache_beam/io/gcp/bigquery_read_it_test.py::ReadAllBQTests::test_read_queries
<https://ci-beam.apache.org/job/beam_PostCommit_Python311/ws/src/sdks/python/apache_beam/io/gcp/bigquery.py>:2934: BeamDeprecationWarning: options is deprecated since First stable release. References to <pipeline>.options will not be supported
options=pcoll.pipeline.options,
-- Docs: https://docs.pytest.org/en/stable/how-to/capture-warnings.html
- generated xml file: <https://ci-beam.apache.org/job/beam_PostCommit_Python311/ws/src/sdks/python/pytest_postCommitIT-df-py311.xml> -
[33m========== [32m87 passed[0m, [33m[1m51 skipped[0m, [33m[1m637 warnings[0m[33m in 7713.45s (2:08:33)[0m[33m ===========[0m
FAILURE: Build failed with an exception.
* Where:
Script '<https://ci-beam.apache.org/job/beam_PostCommit_Python311/ws/src/sdks/python/test-suites/portable/common.gradle'> line: 326
* What went wrong:
Execution failed for task ':sdks:python:test-suites:portable:py311:postCommitPy311IT'.
> Process 'command 'sh'' finished with non-zero exit value 1
* Try:
> Run with --stacktrace option to get the stack trace.
> Run with --info or --debug option to get more log output.
* Get more help at https://help.gradle.org
Deprecated Gradle features were used in this build, making it incompatible with Gradle 8.0.
You can use '--warning-mode all' to show the individual deprecation warnings and determine if they come from your own scripts or plugins.
See https://docs.gradle.org/7.6.2/userguide/command_line_interface.html#sec:command_line_warnings
Execution optimizations have been disabled for 1 invalid unit(s) of work during this build to ensure correctness.
Please consult deprecation warnings for more details.
BUILD FAILED in 2h 15m 13s
209 actionable tasks: 144 executed, 59 from cache, 6 up-to-date
Publishing build scan...
https://ge.apache.org/s/yxaz7thvu7v32
Build step 'Invoke Gradle script' changed build result to FAILURE
Build step 'Invoke Gradle script' marked build as failure
---------------------------------------------------------------------
To unsubscribe, e-mail: builds-unsubscribe@beam.apache.org
For additional commands, e-mail: builds-help@beam.apache.org