You are viewing a plain text version of this content. The canonical link for it is here.
Posted to dev@lucene.apache.org by Policeman Jenkins Server <je...@thetaphi.de> on 2013/01/22 13:51:05 UTC

[JENKINS] Lucene-Solr-trunk-Linux (32bit/jdk1.7.0_10) - Build # 3913 - Failure!

Build: http://jenkins.thetaphi.de/job/Lucene-Solr-trunk-Linux/3913/
Java: 32bit/jdk1.7.0_10 -server -XX:+UseG1GC

1 tests failed.
FAILED:  junit.framework.TestSuite.org.apache.solr.update.SoftAutoCommitTest

Error Message:
ERROR: SolrIndexSearcher opens=12 closes=11

Stack Trace:
java.lang.AssertionError: ERROR: SolrIndexSearcher opens=12 closes=11
	at __randomizedtesting.SeedInfo.seed([E7CE84C9EC40FB1F]:0)
	at org.junit.Assert.fail(Assert.java:93)
	at org.apache.solr.SolrTestCaseJ4.endTrackingSearchers(SolrTestCaseJ4.java:246)
	at org.apache.solr.SolrTestCaseJ4.afterClass(SolrTestCaseJ4.java:97)
	at sun.reflect.GeneratedMethodAccessor17.invoke(Unknown Source)
	at sun.reflect.DelegatingMethodAccessorImpl.invoke(DelegatingMethodAccessorImpl.java:43)
	at java.lang.reflect.Method.invoke(Method.java:601)
	at com.carrotsearch.randomizedtesting.RandomizedRunner.invoke(RandomizedRunner.java:1559)
	at com.carrotsearch.randomizedtesting.RandomizedRunner.access$600(RandomizedRunner.java:79)
	at com.carrotsearch.randomizedtesting.RandomizedRunner$5.evaluate(RandomizedRunner.java:700)
	at com.carrotsearch.randomizedtesting.rules.StatementAdapter.evaluate(StatementAdapter.java:36)
	at com.carrotsearch.randomizedtesting.rules.SystemPropertiesRestoreRule$1.evaluate(SystemPropertiesRestoreRule.java:53)
	at org.apache.lucene.util.AbstractBeforeAfterRule$1.evaluate(AbstractBeforeAfterRule.java:46)
	at org.apache.lucene.util.TestRuleStoreClassName$1.evaluate(TestRuleStoreClassName.java:42)
	at com.carrotsearch.randomizedtesting.rules.SystemPropertiesInvariantRule$1.evaluate(SystemPropertiesInvariantRule.java:55)
	at com.carrotsearch.randomizedtesting.rules.NoShadowingOrOverridesOnMethodsRule$1.evaluate(NoShadowingOrOverridesOnMethodsRule.java:39)
	at com.carrotsearch.randomizedtesting.rules.NoShadowingOrOverridesOnMethodsRule$1.evaluate(NoShadowingOrOverridesOnMethodsRule.java:39)
	at com.carrotsearch.randomizedtesting.rules.StatementAdapter.evaluate(StatementAdapter.java:36)
	at org.apache.lucene.util.TestRuleAssertionsRequired$1.evaluate(TestRuleAssertionsRequired.java:43)
	at org.apache.lucene.util.TestRuleMarkFailure$1.evaluate(TestRuleMarkFailure.java:48)
	at org.apache.lucene.util.TestRuleIgnoreAfterMaxFailures$1.evaluate(TestRuleIgnoreAfterMaxFailures.java:70)
	at org.apache.lucene.util.TestRuleIgnoreTestSuites$1.evaluate(TestRuleIgnoreTestSuites.java:55)
	at com.carrotsearch.randomizedtesting.rules.StatementAdapter.evaluate(StatementAdapter.java:36)
	at com.carrotsearch.randomizedtesting.ThreadLeakControl$StatementRunner.run(ThreadLeakControl.java:358)
	at java.lang.Thread.run(Thread.java:722)




Build Log:
[...truncated 9398 lines...]
[junit4:junit4] Suite: org.apache.solr.update.SoftAutoCommitTest
[junit4:junit4]   2> 0 T2014 oas.SolrTestCaseJ4.initCore ####initCore
[junit4:junit4]   2> Creating dataDir: /mnt/ssd/jenkins/workspace/Lucene-Solr-trunk-Linux/solr/build/solr-core/test/J1/./solrtest-SoftAutoCommitTest-1358858753631
[junit4:junit4]   2> 1 T2014 oasc.SolrResourceLoader.<init> new SolrResourceLoader for directory: '/mnt/ssd/jenkins/workspace/Lucene-Solr-trunk-Linux/solr/build/solr-core/test-files/solr/collection1/'
[junit4:junit4]   2> 2 T2014 oasc.SolrResourceLoader.replaceClassLoader Adding 'file:/mnt/ssd/jenkins/workspace/Lucene-Solr-trunk-Linux/solr/build/solr-core/test-files/solr/collection1/lib/README' to classloader
[junit4:junit4]   2> 2 T2014 oasc.SolrResourceLoader.replaceClassLoader Adding 'file:/mnt/ssd/jenkins/workspace/Lucene-Solr-trunk-Linux/solr/build/solr-core/test-files/solr/collection1/lib/classes/' to classloader
[junit4:junit4]   2> 35 T2014 oasc.SolrConfig.<init> Using Lucene MatchVersion: LUCENE_50
[junit4:junit4]   2> 76 T2014 oasc.SolrConfig.<init> Loaded SolrConfig: solrconfig.xml
[junit4:junit4]   2> 77 T2014 oass.IndexSchema.readSchema Reading Solr Schema
[junit4:junit4]   2> 81 T2014 oass.IndexSchema.readSchema Schema name=test
[junit4:junit4]   2> 438 T2014 oass.OpenExchangeRatesOrgProvider.init Initialized with rates=open-exchange-rates.json, refreshInterval=1440.
[junit4:junit4]   2> 443 T2014 oass.IndexSchema.readSchema default search field in schema is text
[junit4:junit4]   2> 446 T2014 oass.IndexSchema.readSchema unique key field: id
[junit4:junit4]   2> 450 T2014 oass.FileExchangeRateProvider.reload Reloading exchange rates from file currency.xml
[junit4:junit4]   2> 453 T2014 oass.FileExchangeRateProvider.reload Reloading exchange rates from file currency.xml
[junit4:junit4]   2> 455 T2014 oass.OpenExchangeRatesOrgProvider.reload Reloading exchange rates from open-exchange-rates.json
[junit4:junit4]   2> 456 T2014 oass.OpenExchangeRatesOrgProvider.reload Reloading exchange rates from open-exchange-rates.json
[junit4:junit4]   2> 456 T2014 oasc.SolrResourceLoader.locateSolrHome JNDI not configured for solr (NoInitialContextEx)
[junit4:junit4]   2> 456 T2014 oasc.SolrResourceLoader.locateSolrHome using system property solr.solr.home: /mnt/ssd/jenkins/workspace/Lucene-Solr-trunk-Linux/solr/build/solr-core/test-files/solr
[junit4:junit4]   2> 457 T2014 oasc.SolrResourceLoader.<init> new SolrResourceLoader for directory: '/mnt/ssd/jenkins/workspace/Lucene-Solr-trunk-Linux/solr/build/solr-core/test-files/solr/'
[junit4:junit4]   2> 464 T2014 oasc.CoreContainer.<init> New CoreContainer 13961794
[junit4:junit4]   2> 464 T2014 oasc.SolrCore.<init> [collection1] Opening new SolrCore at /mnt/ssd/jenkins/workspace/Lucene-Solr-trunk-Linux/solr/build/solr-core/test-files/solr/collection1/, dataDir=/mnt/ssd/jenkins/workspace/Lucene-Solr-trunk-Linux/solr/build/solr-core/test/J1/./solrtest-SoftAutoCommitTest-1358858753631/
[junit4:junit4]   2> 465 T2014 oasc.JmxMonitoredMap.<init> JMX monitoring is enabled. Adding Solr mbeans to JMX Server: com.sun.jmx.mbeanserver.JmxMBeanServer@1b2254c
[junit4:junit4]   2> 465 T2014 oasc.SolrCore.initDirectoryFactory org.apache.solr.core.MockDirectoryFactory
[junit4:junit4]   2> 466 T2014 oasc.CachingDirectoryFactory.get return new directory for /mnt/ssd/jenkins/workspace/Lucene-Solr-trunk-Linux/solr/build/solr-core/test/J1/./solrtest-SoftAutoCommitTest-1358858753631 forceNew:false
[junit4:junit4]   2> 466 T2014 oasc.CachingDirectoryFactory.close Releasing directory:/mnt/ssd/jenkins/workspace/Lucene-Solr-trunk-Linux/solr/build/solr-core/test/J1/./solrtest-SoftAutoCommitTest-1358858753631
[junit4:junit4]   2> 466 T2014 oasc.SolrCore.getNewIndexDir New index directory detected: old=null new=/mnt/ssd/jenkins/workspace/Lucene-Solr-trunk-Linux/solr/build/solr-core/test/J1/./solrtest-SoftAutoCommitTest-1358858753631/index/
[junit4:junit4]   2> 467 T2014 oasc.SolrCore.initIndex WARNING [collection1] Solr index directory '/mnt/ssd/jenkins/workspace/Lucene-Solr-trunk-Linux/solr/build/solr-core/test/J1/./solrtest-SoftAutoCommitTest-1358858753631/index' doesn't exist. Creating new index...
[junit4:junit4]   2> 467 T2014 oasc.CachingDirectoryFactory.get return new directory for /mnt/ssd/jenkins/workspace/Lucene-Solr-trunk-Linux/solr/build/solr-core/test/J1/./solrtest-SoftAutoCommitTest-1358858753631/index forceNew:false
[junit4:junit4]   2> 468 T2014 oasc.SolrDeletionPolicy.onCommit SolrDeletionPolicy.onCommit: commits:num=1
[junit4:junit4]   2> 		commit{dir=RateLimitedDirectoryWrapper(MockDirWrapper(org.apache.lucene.store.RAMDirectory@f953d7 lockFactory=org.apache.lucene.store.NativeFSLockFactory@1916f2c)),segFN=segments_1,generation=1,filenames=[segments_1]
[junit4:junit4]   2> 469 T2014 oasc.SolrDeletionPolicy.updateCommits newest commit = 1[segments_1]
[junit4:junit4]   2> 469 T2014 oasc.CachingDirectoryFactory.close Releasing directory:/mnt/ssd/jenkins/workspace/Lucene-Solr-trunk-Linux/solr/build/solr-core/test/J1/./solrtest-SoftAutoCommitTest-1358858753631/index
[junit4:junit4]   2> 470 T2014 oasc.SolrCore.initWriters created xml: solr.XMLResponseWriter
[junit4:junit4]   2> 471 T2014 oasup.UpdateRequestProcessorChain.init inserting DistributedUpdateProcessorFactory into updateRequestProcessorChain "dedupe"
[junit4:junit4]   2> 471 T2014 oasup.UpdateRequestProcessorChain.init inserting DistributedUpdateProcessorFactory into updateRequestProcessorChain "dedupe-allfields"
[junit4:junit4]   2> 472 T2014 oasup.UpdateRequestProcessorChain.init inserting DistributedUpdateProcessorFactory into updateRequestProcessorChain "stored_sig"
[junit4:junit4]   2> 472 T2014 oasup.UpdateRequestProcessorChain.init inserting DistributedUpdateProcessorFactory into updateRequestProcessorChain "uniq-fields"
[junit4:junit4]   2> 472 T2014 oasup.UpdateRequestProcessorChain.init inserting DistributedUpdateProcessorFactory into updateRequestProcessorChain "distrib-dup-test-chain-implicit"
[junit4:junit4]   2> 473 T2014 oasc.RequestHandlers.initHandlersFromConfig adding lazy requestHandler: solr.ReplicationHandler
[junit4:junit4]   2> 473 T2014 oasc.RequestHandlers.initHandlersFromConfig created /replication: solr.ReplicationHandler
[junit4:junit4]   2> 473 T2014 oasc.RequestHandlers.initHandlersFromConfig created standard: solr.StandardRequestHandler
[junit4:junit4]   2> 474 T2014 oasc.RequestHandlers.initHandlersFromConfig created /get: solr.RealTimeGetHandler
[junit4:junit4]   2> 474 T2014 oasc.RequestHandlers.initHandlersFromConfig created dismax: solr.SearchHandler
[junit4:junit4]   2> 475 T2014 oasc.RequestHandlers.initHandlersFromConfig created mock: org.apache.solr.core.MockQuerySenderListenerReqHandler
[junit4:junit4]   2> 475 T2014 oasc.RequestHandlers.initHandlersFromConfig created /admin/: org.apache.solr.handler.admin.AdminHandlers
[junit4:junit4]   2> 475 T2014 oasc.RequestHandlers.initHandlersFromConfig created defaults: solr.StandardRequestHandler
[junit4:junit4]   2> 476 T2014 oasc.RequestHandlers.initHandlersFromConfig adding lazy requestHandler: solr.StandardRequestHandler
[junit4:junit4]   2> 476 T2014 oasc.RequestHandlers.initHandlersFromConfig created lazy: solr.StandardRequestHandler
[junit4:junit4]   2> 476 T2014 oasc.RequestHandlers.initHandlersFromConfig created /update: solr.UpdateRequestHandler
[junit4:junit4]   2> 477 T2014 oasc.RequestHandlers.initHandlersFromConfig created /terms: org.apache.solr.handler.component.SearchHandler
[junit4:junit4]   2> 477 T2014 oasc.RequestHandlers.initHandlersFromConfig created spellCheckCompRH: org.apache.solr.handler.component.SearchHandler
[junit4:junit4]   2> 478 T2014 oasc.RequestHandlers.initHandlersFromConfig created spellCheckCompRH_Direct: org.apache.solr.handler.component.SearchHandler
[junit4:junit4]   2> 478 T2014 oasc.RequestHandlers.initHandlersFromConfig created spellCheckWithWordbreak: org.apache.solr.handler.component.SearchHandler
[junit4:junit4]   2> 478 T2014 oasc.RequestHandlers.initHandlersFromConfig created spellCheckWithWordbreak_Direct: org.apache.solr.handler.component.SearchHandler
[junit4:junit4]   2> 479 T2014 oasc.RequestHandlers.initHandlersFromConfig created spellCheckCompRH1: org.apache.solr.handler.component.SearchHandler
[junit4:junit4]   2> 479 T2014 oasc.RequestHandlers.initHandlersFromConfig created mltrh: org.apache.solr.handler.component.SearchHandler
[junit4:junit4]   2> 479 T2014 oasc.RequestHandlers.initHandlersFromConfig created tvrh: org.apache.solr.handler.component.SearchHandler
[junit4:junit4]   2> 480 T2014 oasc.RequestHandlers.initHandlersFromConfig created /mlt: solr.MoreLikeThisHandler
[junit4:junit4]   2> 480 T2014 oasc.RequestHandlers.initHandlersFromConfig created /debug/dump: solr.DumpRequestHandler
[junit4:junit4]   2> 483 T2014 oashl.XMLLoader.init xsltCacheLifetimeSeconds=60
[junit4:junit4]   2> 484 T2014 oasc.SolrCore.initDeprecatedSupport WARNING solrconfig.xml uses deprecated <admin/gettableFiles>, Please update your config to use the ShowFileRequestHandler.
[junit4:junit4]   2> 485 T2014 oasc.SolrCore.initDeprecatedSupport WARNING adding ShowFileRequestHandler with hidden files: [THROW.ERROR.ON.ADD.UPDATEPROCESSOR.JS, SOLRCONFIG-HIGHLIGHT.XML, SCHEMA-REQUIRED-FIELDS.XML, SCHEMA-REPLICATION2.XML, TRIVIAL.UPDATEPROCESSOR1.JS, BAD-SCHEMA-DUP-DYNAMICFIELD.XML, SCHEMA-MINIMAL.XML, SOLRCONFIG-CACHING.XML, SCHEMA-POSTINGSHIGHLIGHT.XML, SOLRCONFIG-REPEATER.XML, BAD-SCHEMA-NONTEXT-ANALYZER.XML, CURRENCY.XML, SOLRCONFIG-MERGEPOLICY.XML, SOLRCONFIG-TLOG.XML, SOLRCONFIG-MASTER.XML, SOLRCONFIG-COMPONENTS-NAME.XML, BAD-SCHEMA-UNIQUEKEY-MULTIVALUED.XML, SCHEMA11.XML, SOLRCONFIG-BASIC.XML, DA_COMPOUNDDICTIONARY.TXT, MISSLEADING.EXTENSION.UPDATEPROCESSOR.JS.TXT, SCHEMA-COPYFIELD-TEST.XML, SOLRCONFIG-SLAVE.XML, ELEVATE.XML, SOLRCONFIG-PROPINJECT-INDEXDEFAULT.XML, TRIVIAL.UPDATEPROCESSOR0.JS, BAD-SOLRCONFIG-BOGUS-SCRIPTENGINE-NAME.XML, SCHEMA-CHARFILTERS.XML, SCHEMA-IB.XML, SOLRCONFIG-QUERYSENDER.XML, SCHEMA-REPLICATION1.XML, SOLRCONFIG-SNIPPET-PROCESSOR.XML, DA_UTF8.XML, CONDITIONAL.UPDATEPROCESSOR.JS, MISSING.FUNCTIONS.UPDATEPROCESSOR.JS, HYPHENATION.DTD, SOLRCONFIG-ENABLEPLUGIN.XML, SCHEMA-PHRASESUGGEST.XML, STEMDICT.TXT, HUNSPELL-TEST.AFF, SCHEMA-SNIPPET-TYPE.XML, STOPTYPES-1.TXT, STOPWORDSWRONGENCODING.TXT, SCHEMA-NUMERIC.XML, SOLRCONFIG-TRANSFORMERS.XML, SOLRCONFIG-PROPINJECT.XML, BAD-SCHEMA-NOT-INDEXED-BUT-TF.XML, SOLRCONFIG-SIMPLELOCK.XML, WDFTYPES.TXT, SCHEMA-REVERSED.XML, STOPTYPES-2.TXT, BAD-SCHEMA-CURRENCY-FT-MULTIVALUED.XML, SOLRCONFIG-SPELLCHECKCOMPONENT.XML, BAD-SCHEMA-CURRENCY-MULTIVALUED.XML, SOLRCONFIG-PHRASESUGGEST.XML, SCHEMA-DFR.XML, BAD-SCHEMA-NOT-INDEXED-BUT-POS.XML, KEEP-1.TXT, OPEN-EXCHANGE-RATES.JSON, SCHEMA-SPATIAL.XML, STOPWITHBOM.TXT, SCHEMA-BINARYFIELD.XML, SOLRCONFIG-POSTINGSHIGHLIGHT.XML, SOLRCONFIG-SPELLCHECKER.XML, SOLRCONFIG-UPDATE-PROCESSOR-CHAINS.XML, BAD-SCHEMA-OMIT-TF-BUT-NOT-POS.XML, BAD-SCHEMA-DUP-FIELDTYPE.XML, SCHEMA-XINCLUDE.XML, SOLRCONFIG-MASTER1.XML, SCHEMA-BEHAVIOR.XML, SYNONYMS.TXT, BAD-SCHEMA-CURRENCY-DYNAMIC-MULTIVALUED.XML, SCHEMA_CODEC.XML, SCHEMA.XML, SOLRCONFIG-SOLR-749.XML, SOLRCONFIG-MASTER1-KEEPONEBACKUP.XML, SCHEMA-EFF.XML, SOLRCONFIG-FUNCTIONQUERY.XML, STOP-2.TXT, SCHEMA-LMDIRICHLET.XML, SOLRCONFIG-TERMINDEX.XML, SOLRCONFIG-ELEVATE.XML, SCHEMA-FOLDING.XML, STOPWORDS.TXT, SCHEMA-STOP-KEEP.XML, FUZZYSUGGEST.TXT, BAD-SCHEMA-NOT-INDEXED-BUT-NORMS.XML, SOLRCONFIG-SOLCOREPROPERTIES.XML, STOP-1.TXT, SOLRCONFIG-MASTER2.XML, SCHEMA-SPELLCHECKER.XML, SOLRCONFIG-RESPONSE-LOG-COMPONENT.XML, SOLRCONFIG-LAZYWRITER.XML, SCHEMA-LUCENEMATCHVERSION.XML, FRENCHARTICLES.TXT, BAD-MP-SOLRCONFIG.XML, SCHEMA15.XML, SOLRCONFIG-REQHANDLER.INCL, SCHEMASURROUND.XML, SOLRCONFIG-MASTER3.XML, HUNSPELL-TEST.DIC, SOLRCONFIG-XINCLUDE.XML, BAD-SCHEMA-CODEC-GLOBAL-VS-FT-MISMATCH.XML, SOLRCONFIG-DELPOLICY1.XML, SOLRCONFIG-SLAVE1.XML, SCHEMA-SIM.XML, SCHEMA-SNIPPET-FIELD.XML, SCHEMA-COLLATE.XML, STOP-SNOWBALL.TXT, BAD-SCHEMA-SIM-GLOBAL-VS-FT-MISMATCH.XML, PROTWORDS.TXT, SCHEMA-TRIE.XML, SOLRCONFIG_CODEC.XML, SCHEMA-SYNONYM-TOKENIZER.XML, BAD-SOLRCONFIG-INVALID-SCRIPTFILE.XML, JASUGGEST.TXT, SCHEMA-TFIDF.XML, SOLRCONFIG-SCRIPT-UPDATEPROCESSOR.XML, SCHEMA-LMJELINEKMERCER.XML, PHRASESUGGEST.TXT, BAD-SOLRCONFIG-MISSING-SCRIPTFILE.XML, BAD-SCHEMA-UNIQUEKEY-USES-DEFAULT.XML, OLD_SYNONYMS.TXT, SOLRCONFIG-DELPOLICY2.XML, XSLT, SOLRCONFIG-NATIVELOCK.XML, BAD-SCHEMA-DUP-FIELD.XML, SOLRCONFIG-NOCACHE.XML, SCHEMA-BM25.XML, ADDFIELDS.UPDATEPROCESSOR.JS, SOLRCONFIG-ALTDIRECTORY.XML, SOLRCONFIG-QUERYSENDER-NOQUERY.XML, COMPOUNDDICTIONARY.TXT, SOLRCONFIG_PERF.XML, SOLRCONFIG-INDEXCONFIG.XML, BAD-SCHEMA-ANALYZER-CLASS-AND-NESTED.XML, SCHEMA-NOT-REQUIRED-UNIQUE-KEY.XML, KEEP-2.TXT, BAD-SCHEMA-UNIQUEKEY-IS-COPYFIELD-DEST.XML, SCHEMA12.XML, MAPPING-ISOLATIN1ACCENT.TXT, BAD_SOLRCONFIG.XML, BAD-SCHEMA-EXTERNAL-FILEFIELD.XML]
[junit4:junit4]   2> 487 T2014 oasc.CachingDirectoryFactory.close Releasing directory:/mnt/ssd/jenkins/workspace/Lucene-Solr-trunk-Linux/solr/build/solr-core/test/J1/./solrtest-SoftAutoCommitTest-1358858753631
[junit4:junit4]   2> 487 T2014 oass.SolrIndexSearcher.<init> Opening Searcher@339063 main
[junit4:junit4]   2> 488 T2014 oasu.CommitTracker.<init> Hard AutoCommit: disabled
[junit4:junit4]   2> 488 T2014 oasu.CommitTracker.<init> Soft AutoCommit: disabled
[junit4:junit4]   2> 488 T2014 oashc.SpellCheckComponent.inform Initializing spell checkers
[junit4:junit4]   2> 680 T2014 oass.DirectSolrSpellChecker.init init: {name=direct,classname=DirectSolrSpellChecker,field=lowerfilt,minQueryLength=3}
[junit4:junit4]   2> 698 T2015 oasc.SolrCore.registerSearcher [collection1] Registered new searcher Searcher@339063 main{StandardDirectoryReader(segments_1:1)}
[junit4:junit4]   2> 701 T2014 oasc.CoreContainer.registerCore registering core: collection1
[junit4:junit4]   2> 703 T2014 oas.SolrTestCaseJ4.initCore ####initCore end
[junit4:junit4]   2> 705 T2014 oas.SolrTestCaseJ4.setUp ###Starting testSoftAndHardCommitMaxTimeRapidAdds
[junit4:junit4]   2> 706 T2014 oasc.CoreContainer.reload Reloading SolrCore 'collection1' using instanceDir: /mnt/ssd/jenkins/workspace/Lucene-Solr-trunk-Linux/solr/build/solr-core/test-files/solr/collection1
[junit4:junit4]   2> 706 T2014 oasc.SolrResourceLoader.<init> new SolrResourceLoader for directory: '/mnt/ssd/jenkins/workspace/Lucene-Solr-trunk-Linux/solr/build/solr-core/test-files/solr/collection1/'
[junit4:junit4]   2> 706 T2014 oasc.SolrResourceLoader.replaceClassLoader Adding 'file:/mnt/ssd/jenkins/workspace/Lucene-Solr-trunk-Linux/solr/build/solr-core/test-files/solr/collection1/lib/README' to classloader
[junit4:junit4]   2> 707 T2014 oasc.SolrResourceLoader.replaceClassLoader Adding 'file:/mnt/ssd/jenkins/workspace/Lucene-Solr-trunk-Linux/solr/build/solr-core/test-files/solr/collection1/lib/classes/' to classloader
[junit4:junit4]   2> 735 T2014 oasc.SolrConfig.<init> Using Lucene MatchVersion: LUCENE_50
[junit4:junit4]   2> 778 T2014 oasc.SolrConfig.<init> Loaded SolrConfig: solrconfig.xml
[junit4:junit4]   2> 779 T2014 oass.IndexSchema.readSchema Reading Solr Schema
[junit4:junit4]   2> 782 T2014 oass.IndexSchema.readSchema Schema name=test
[junit4:junit4]   2> 1107 T2014 oass.OpenExchangeRatesOrgProvider.init Initialized with rates=open-exchange-rates.json, refreshInterval=1440.
[junit4:junit4]   2> 1112 T2014 oass.IndexSchema.readSchema default search field in schema is text
[junit4:junit4]   2> 1115 T2014 oass.IndexSchema.readSchema unique key field: id
[junit4:junit4]   2> 1120 T2014 oass.FileExchangeRateProvider.reload Reloading exchange rates from file currency.xml
[junit4:junit4]   2> 1122 T2014 oass.FileExchangeRateProvider.reload Reloading exchange rates from file currency.xml
[junit4:junit4]   2> 1125 T2014 oass.OpenExchangeRatesOrgProvider.reload Reloading exchange rates from open-exchange-rates.json
[junit4:junit4]   2> 1125 T2014 oass.OpenExchangeRatesOrgProvider.reload Reloading exchange rates from open-exchange-rates.json
[junit4:junit4]   2> 1126 T2014 oasc.SolrCore.<init> [collection1] Opening new SolrCore at /mnt/ssd/jenkins/workspace/Lucene-Solr-trunk-Linux/solr/build/solr-core/test-files/solr/collection1/, dataDir=/mnt/ssd/jenkins/workspace/Lucene-Solr-trunk-Linux/solr/build/solr-core/test/J1/./solrtest-SoftAutoCommitTest-1358858753631/
[junit4:junit4]   2> 1126 T2014 oasc.JmxMonitoredMap.<init> JMX monitoring is enabled. Adding Solr mbeans to JMX Server: com.sun.jmx.mbeanserver.JmxMBeanServer@1b2254c
[junit4:junit4]   2> 1126 T2014 oasc.CachingDirectoryFactory.close Releasing directory:/mnt/ssd/jenkins/workspace/Lucene-Solr-trunk-Linux/solr/build/solr-core/test/J1/./solrtest-SoftAutoCommitTest-1358858753631
[junit4:junit4]   2> 1127 T2014 oasc.SolrCore.getNewIndexDir New index directory detected: old=null new=/mnt/ssd/jenkins/workspace/Lucene-Solr-trunk-Linux/solr/build/solr-core/test/J1/./solrtest-SoftAutoCommitTest-1358858753631/index/
[junit4:junit4]   2> 1127 T2014 oasc.SolrCore.initWriters created xml: solr.XMLResponseWriter
[junit4:junit4]   2> 1129 T2014 oasup.UpdateRequestProcessorChain.init inserting DistributedUpdateProcessorFactory into updateRequestProcessorChain "dedupe"
[junit4:junit4]   2> 1129 T2014 oasup.UpdateRequestProcessorChain.init inserting DistributedUpdateProcessorFactory into updateRequestProcessorChain "dedupe-allfields"
[junit4:junit4]   2> 1129 T2014 oasup.UpdateRequestProcessorChain.init inserting DistributedUpdateProcessorFactory into updateRequestProcessorChain "stored_sig"
[junit4:junit4]   2> 1130 T2014 oasup.UpdateRequestProcessorChain.init inserting DistributedUpdateProcessorFactory into updateRequestProcessorChain "uniq-fields"
[junit4:junit4]   2> 1130 T2014 oasup.UpdateRequestProcessorChain.init inserting DistributedUpdateProcessorFactory into updateRequestProcessorChain "distrib-dup-test-chain-implicit"
[junit4:junit4]   2> 1130 T2014 oasc.RequestHandlers.initHandlersFromConfig adding lazy requestHandler: solr.ReplicationHandler
[junit4:junit4]   2> 1131 T2014 oasc.RequestHandlers.initHandlersFromConfig created /replication: solr.ReplicationHandler
[junit4:junit4]   2> 1131 T2014 oasc.RequestHandlers.initHandlersFromConfig created standard: solr.StandardRequestHandler
[junit4:junit4]   2> 1132 T2014 oasc.RequestHandlers.initHandlersFromConfig created /get: solr.RealTimeGetHandler
[junit4:junit4]   2> 1132 T2014 oasc.RequestHandlers.initHandlersFromConfig created dismax: solr.SearchHandler
[junit4:junit4]   2> 1133 T2014 oasc.RequestHandlers.initHandlersFromConfig created mock: org.apache.solr.core.MockQuerySenderListenerReqHandler
[junit4:junit4]   2> 1133 T2014 oasc.RequestHandlers.initHandlersFromConfig created /admin/: org.apache.solr.handler.admin.AdminHandlers
[junit4:junit4]   2> 1134 T2014 oasc.RequestHandlers.initHandlersFromConfig created defaults: solr.StandardRequestHandler
[junit4:junit4]   2> 1134 T2014 oasc.RequestHandlers.initHandlersFromConfig adding lazy requestHandler: solr.StandardRequestHandler
[junit4:junit4]   2> 1134 T2014 oasc.RequestHandlers.initHandlersFromConfig created lazy: solr.StandardRequestHandler
[junit4:junit4]   2> 1135 T2014 oasc.RequestHandlers.initHandlersFromConfig created /update: solr.UpdateRequestHandler
[junit4:junit4]   2> 1135 T2014 oasc.RequestHandlers.initHandlersFromConfig created /terms: org.apache.solr.handler.component.SearchHandler
[junit4:junit4]   2> 1136 T2014 oasc.RequestHandlers.initHandlersFromConfig created spellCheckCompRH: org.apache.solr.handler.component.SearchHandler
[junit4:junit4]   2> 1136 T2014 oasc.RequestHandlers.initHandlersFromConfig created spellCheckCompRH_Direct: org.apache.solr.handler.component.SearchHandler
[junit4:junit4]   2> 1137 T2014 oasc.RequestHandlers.initHandlersFromConfig created spellCheckWithWordbreak: org.apache.solr.handler.component.SearchHandler
[junit4:junit4]   2> 1137 T2014 oasc.RequestHandlers.initHandlersFromConfig created spellCheckWithWordbreak_Direct: org.apache.solr.handler.component.SearchHandler
[junit4:junit4]   2> 1138 T2014 oasc.RequestHandlers.initHandlersFromConfig created spellCheckCompRH1: org.apache.solr.handler.component.SearchHandler
[junit4:junit4]   2> 1138 T2014 oasc.RequestHandlers.initHandlersFromConfig created mltrh: org.apache.solr.handler.component.SearchHandler
[junit4:junit4]   2> 1139 T2014 oasc.RequestHandlers.initHandlersFromConfig created tvrh: org.apache.solr.handler.component.SearchHandler
[junit4:junit4]   2> 1139 T2014 oasc.RequestHandlers.initHandlersFromConfig created /mlt: solr.MoreLikeThisHandler
[junit4:junit4]   2> 1140 T2014 oasc.RequestHandlers.initHandlersFromConfig created /debug/dump: solr.DumpRequestHandler
[junit4:junit4]   2> 1141 T2014 oashl.XMLLoader.init xsltCacheLifetimeSeconds=60
[junit4:junit4]   2> 1142 T2014 oasc.SolrCore.initDeprecatedSupport WARNING solrconfig.xml uses deprecated <admin/gettableFiles>, Please update your config to use the ShowFileRequestHandler.
[junit4:junit4]   2> 1143 T2014 oasc.SolrCore.initDeprecatedSupport WARNING adding ShowFileRequestHandler with hidden files: [THROW.ERROR.ON.ADD.UPDATEPROCESSOR.JS, SOLRCONFIG-HIGHLIGHT.XML, SCHEMA-REQUIRED-FIELDS.XML, SCHEMA-REPLICATION2.XML, TRIVIAL.UPDATEPROCESSOR1.JS, BAD-SCHEMA-DUP-DYNAMICFIELD.XML, SCHEMA-MINIMAL.XML, SOLRCONFIG-CACHING.XML, SCHEMA-POSTINGSHIGHLIGHT.XML, SOLRCONFIG-REPEATER.XML, BAD-SCHEMA-NONTEXT-ANALYZER.XML, CURRENCY.XML, SOLRCONFIG-MERGEPOLICY.XML, SOLRCONFIG-TLOG.XML, SOLRCONFIG-MASTER.XML, SOLRCONFIG-COMPONENTS-NAME.XML, BAD-SCHEMA-UNIQUEKEY-MULTIVALUED.XML, SCHEMA11.XML, SOLRCONFIG-BASIC.XML, DA_COMPOUNDDICTIONARY.TXT, MISSLEADING.EXTENSION.UPDATEPROCESSOR.JS.TXT, SCHEMA-COPYFIELD-TEST.XML, SOLRCONFIG-SLAVE.XML, ELEVATE.XML, SOLRCONFIG-PROPINJECT-INDEXDEFAULT.XML, TRIVIAL.UPDATEPROCESSOR0.JS, BAD-SOLRCONFIG-BOGUS-SCRIPTENGINE-NAME.XML, SCHEMA-CHARFILTERS.XML, SCHEMA-IB.XML, SOLRCONFIG-QUERYSENDER.XML, SCHEMA-REPLICATION1.XML, SOLRCONFIG-SNIPPET-PROCESSOR.XML, DA_UTF8.XML, CONDITIONAL.UPDATEPROCESSOR.JS, MISSING.FUNCTIONS.UPDATEPROCESSOR.JS, HYPHENATION.DTD, SOLRCONFIG-ENABLEPLUGIN.XML, SCHEMA-PHRASESUGGEST.XML, STEMDICT.TXT, HUNSPELL-TEST.AFF, SCHEMA-SNIPPET-TYPE.XML, STOPTYPES-1.TXT, STOPWORDSWRONGENCODING.TXT, SCHEMA-NUMERIC.XML, SOLRCONFIG-TRANSFORMERS.XML, SOLRCONFIG-PROPINJECT.XML, BAD-SCHEMA-NOT-INDEXED-BUT-TF.XML, SOLRCONFIG-SIMPLELOCK.XML, WDFTYPES.TXT, SCHEMA-REVERSED.XML, STOPTYPES-2.TXT, BAD-SCHEMA-CURRENCY-FT-MULTIVALUED.XML, SOLRCONFIG-SPELLCHECKCOMPONENT.XML, BAD-SCHEMA-CURRENCY-MULTIVALUED.XML, SOLRCONFIG-PHRASESUGGEST.XML, SCHEMA-DFR.XML, BAD-SCHEMA-NOT-INDEXED-BUT-POS.XML, KEEP-1.TXT, OPEN-EXCHANGE-RATES.JSON, SCHEMA-SPATIAL.XML, STOPWITHBOM.TXT, SCHEMA-BINARYFIELD.XML, SOLRCONFIG-POSTINGSHIGHLIGHT.XML, SOLRCONFIG-SPELLCHECKER.XML, SOLRCONFIG-UPDATE-PROCESSOR-CHAINS.XML, BAD-SCHEMA-OMIT-TF-BUT-NOT-POS.XML, BAD-SCHEMA-DUP-FIELDTYPE.XML, SCHEMA-XINCLUDE.XML, SOLRCONFIG-MASTER1.XML, SCHEMA-BEHAVIOR.XML, SYNONYMS.TXT, BAD-SCHEMA-CURRENCY-DYNAMIC-MULTIVALUED.XML, SCHEMA_CODEC.XML, SCHEMA.XML, SOLRCONFIG-SOLR-749.XML, SOLRCONFIG-MASTER1-KEEPONEBACKUP.XML, SCHEMA-EFF.XML, SOLRCONFIG-FUNCTIONQUERY.XML, STOP-2.TXT, SCHEMA-LMDIRICHLET.XML, SOLRCONFIG-TERMINDEX.XML, SOLRCONFIG-ELEVATE.XML, SCHEMA-FOLDING.XML, STOPWORDS.TXT, SCHEMA-STOP-KEEP.XML, FUZZYSUGGEST.TXT, BAD-SCHEMA-NOT-INDEXED-BUT-NORMS.XML, SOLRCONFIG-SOLCOREPROPERTIES.XML, STOP-1.TXT, SOLRCONFIG-MASTER2.XML, SCHEMA-SPELLCHECKER.XML, SOLRCONFIG-RESPONSE-LOG-COMPONENT.XML, SOLRCONFIG-LAZYWRITER.XML, SCHEMA-LUCENEMATCHVERSION.XML, FRENCHARTICLES.TXT, BAD-MP-SOLRCONFIG.XML, SCHEMA15.XML, SOLRCONFIG-REQHANDLER.INCL, SCHEMASURROUND.XML, SOLRCONFIG-MASTER3.XML, HUNSPELL-TEST.DIC, SOLRCONFIG-XINCLUDE.XML, BAD-SCHEMA-CODEC-GLOBAL-VS-FT-MISMATCH.XML, SOLRCONFIG-DELPOLICY1.XML, SOLRCONFIG-SLAVE1.XML, SCHEMA-SIM.XML, SCHEMA-SNIPPET-FIELD.XML, SCHEMA-COLLATE.XML, STOP-SNOWBALL.TXT, BAD-SCHEMA-SIM-GLOBAL-VS-FT-MISMATCH.XML, PROTWORDS.TXT, SCHEMA-TRIE.XML, SOLRCONFIG_CODEC.XML, SCHEMA-SYNONYM-TOKENIZER.XML, BAD-SOLRCONFIG-INVALID-SCRIPTFILE.XML, JASUGGEST.TXT, SCHEMA-TFIDF.XML, SOLRCONFIG-SCRIPT-UPDATEPROCESSOR.XML, SCHEMA-LMJELINEKMERCER.XML, PHRASESUGGEST.TXT, BAD-SOLRCONFIG-MISSING-SCRIPTFILE.XML, BAD-SCHEMA-UNIQUEKEY-USES-DEFAULT.XML, OLD_SYNONYMS.TXT, SOLRCONFIG-DELPOLICY2.XML, XSLT, SOLRCONFIG-NATIVELOCK.XML, BAD-SCHEMA-DUP-FIELD.XML, SOLRCONFIG-NOCACHE.XML, SCHEMA-BM25.XML, ADDFIELDS.UPDATEPROCESSOR.JS, SOLRCONFIG-ALTDIRECTORY.XML, SOLRCONFIG-QUERYSENDER-NOQUERY.XML, COMPOUNDDICTIONARY.TXT, SOLRCONFIG_PERF.XML, SOLRCONFIG-INDEXCONFIG.XML, BAD-SCHEMA-ANALYZER-CLASS-AND-NESTED.XML, SCHEMA-NOT-REQUIRED-UNIQUE-KEY.XML, KEEP-2.TXT, BAD-SCHEMA-UNIQUEKEY-IS-COPYFIELD-DEST.XML, SCHEMA12.XML, MAPPING-ISOLATIN1ACCENT.TXT, BAD_SOLRCONFIG.XML, BAD-SCHEMA-EXTERNAL-FILEFIELD.XML]
[junit4:junit4]   2> 1145 T2014 oasc.CachingDirectoryFactory.close Releasing directory:/mnt/ssd/jenkins/workspace/Lucene-Solr-trunk-Linux/solr/build/solr-core/test/J1/./solrtest-SoftAutoCommitTest-1358858753631
[junit4:junit4]   2> 1146 T2014 oass.SolrIndexSearcher.<init> Opening Searcher@1f8e3f2 main
[junit4:junit4]   2> 1146 T2014 oasu.CommitTracker.<init> Hard AutoCommit: disabled
[junit4:junit4]   2> 1146 T2014 oasu.CommitTracker.<init> Soft AutoCommit: disabled
[junit4:junit4]   2> 1147 T2014 oashc.SpellCheckComponent.inform Initializing spell checkers
[junit4:junit4]   2> 1148 T2014 oass.DirectSolrSpellChecker.init init: {name=direct,classname=DirectSolrSpellChecker,field=lowerfilt,minQueryLength=3}
[junit4:junit4]   2> 1155 T2016 oasc.SolrCore.registerSearcher [collection1] Registered new searcher Searcher@1f8e3f2 main{StandardDirectoryReader(segments_1:1)}
[junit4:junit4]   2> 1159 T2014 oasc.CoreContainer.registerCore replacing core: collection1
[junit4:junit4]   2> 1160 T2014 oasc.SolrCore.close [collection1]  CLOSING SolrCore org.apache.solr.core.SolrCore@948b13
[junit4:junit4]   2> 1163 T2014 oasu.DirectUpdateHandler2.close closing DirectUpdateHandler2{commits=0,autocommits=0,soft autocommits=0,optimizes=0,rollbacks=0,expungeDeletes=0,docsPending=0,adds=0,deletesById=0,deletesByQuery=0,errors=0,cumulative_adds=0,cumulative_deletesById=0,cumulative_deletesByQuery=0,cumulative_errors=0}
[junit4:junit4]   2> 1164 T2014 oasc.SolrCore.closeSearcher [collection1] Closing main searcher on request.
[junit4:junit4]   2> 1164 T2014 oasc.CachingDirectoryFactory.close Releasing directory:/mnt/ssd/jenkins/workspace/Lucene-Solr-trunk-Linux/solr/build/solr-core/test/J1/./solrtest-SoftAutoCommitTest-1358858753631/index
[junit4:junit4]   2> ASYNC  NEW_CORE C122 name=collection1 org.apache.solr.core.SolrCore@1bc439
[junit4:junit4]   2> 1168 T2014 C122 oasc.CachingDirectoryFactory.close Releasing directory:/mnt/ssd/jenkins/workspace/Lucene-Solr-trunk-Linux/solr/build/solr-core/test/J1/./solrtest-SoftAutoCommitTest-1358858753631
[junit4:junit4]   2> 1170 T2014 C122 oasc.SolrDeletionPolicy.onInit SolrDeletionPolicy.onInit: commits:num=1
[junit4:junit4]   2> 		commit{dir=RateLimitedDirectoryWrapper(MockDirWrapper(org.apache.lucene.store.RAMDirectory@f953d7 lockFactory=org.apache.lucene.store.NativeFSLockFactory@1916f2c)),segFN=segments_1,generation=1,filenames=[segments_1]
[junit4:junit4]   2> 1170 T2014 C122 oasc.SolrDeletionPolicy.updateCommits newest commit = 1[segments_1]
[junit4:junit4]   2> 1172 T2014 C122 UPDATE [collection1] webapp=null path=null params={} {add=[5000]} 0 4
[junit4:junit4]   2> 1179 T2014 C122 UPDATE [collection1] webapp=null path=null params={} {add=[5001]} 0 1
[junit4:junit4]   2> 1187 T2014 C122 UPDATE [collection1] webapp=null path=null params={} {add=[5002]} 0 1
[junit4:junit4]   2> 1192 T2014 C122 UPDATE [collection1] webapp=null path=null params={} {add=[5003]} 0 0
[junit4:junit4]   2> 1197 T2014 C122 UPDATE [collection1] webapp=null path=null params={} {add=[5004]} 0 0
[junit4:junit4]   2> 1199 T2014 oas.SolrTestCaseJ4.tearDown ###Ending testSoftAndHardCommitMaxTimeRapidAdds
[junit4:junit4]   2> 1202 T2014 oas.SolrTestCaseJ4.setUp ###Starting testSoftAndHardCommitMaxTimeDelete
[junit4:junit4]   2> 1203 T2014 oasc.CoreContainer.reload Reloading SolrCore 'collection1' using instanceDir: /mnt/ssd/jenkins/workspace/Lucene-Solr-trunk-Linux/solr/build/solr-core/test-files/solr/collection1
[junit4:junit4]   2> 1203 T2014 oasc.SolrResourceLoader.<init> new SolrResourceLoader for directory: '/mnt/ssd/jenkins/workspace/Lucene-Solr-trunk-Linux/solr/build/solr-core/test-files/solr/collection1/'
[junit4:junit4]   2> 1204 T2014 oasc.SolrResourceLoader.replaceClassLoader Adding 'file:/mnt/ssd/jenkins/workspace/Lucene-Solr-trunk-Linux/solr/build/solr-core/test-files/solr/collection1/lib/README' to classloader
[junit4:junit4]   2> 1204 T2014 oasc.SolrResourceLoader.replaceClassLoader Adding 'file:/mnt/ssd/jenkins/workspace/Lucene-Solr-trunk-Linux/solr/build/solr-core/test-files/solr/collection1/lib/classes/' to classloader
[junit4:junit4]   2> 1231 T2014 oasc.SolrConfig.<init> Using Lucene MatchVersion: LUCENE_50
[junit4:junit4]   2> 1277 T2014 oasc.SolrConfig.<init> Loaded SolrConfig: solrconfig.xml
[junit4:junit4]   2> 1278 T2014 oass.IndexSchema.readSchema Reading Solr Schema
[junit4:junit4]   2> 1281 T2014 oass.IndexSchema.readSchema Schema name=test
[junit4:junit4]   2> 1619 T2014 oass.OpenExchangeRatesOrgProvider.init Initialized with rates=open-exchange-rates.json, refreshInterval=1440.
[junit4:junit4]   2> 1624 T2014 oass.IndexSchema.readSchema default search field in schema is text
[junit4:junit4]   2> 1626 T2014 oass.IndexSchema.readSchema unique key field: id
[junit4:junit4]   2> 1631 T2014 oass.FileExchangeRateProvider.reload Reloading exchange rates from file currency.xml
[junit4:junit4]   2> 1633 T2014 oass.FileExchangeRateProvider.reload Reloading exchange rates from file currency.xml
[junit4:junit4]   2> 1635 T2014 oass.OpenExchangeRatesOrgProvider.reload Reloading exchange rates from open-exchange-rates.json
[junit4:junit4]   2> 1635 T2014 oass.OpenExchangeRatesOrgProvider.reload Reloading exchange rates from open-exchange-rates.json
[junit4:junit4]   2> 1636 T2014 oasc.SolrCore.<init> [collection1] Opening new SolrCore at /mnt/ssd/jenkins/workspace/Lucene-Solr-trunk-Linux/solr/build/solr-core/test-files/solr/collection1/, dataDir=/mnt/ssd/jenkins/workspace/Lucene-Solr-trunk-Linux/solr/build/solr-core/test/J1/./solrtest-SoftAutoCommitTest-1358858753631/
[junit4:junit4]   2> 1636 T2014 oasc.JmxMonitoredMap.<init> JMX monitoring is enabled. Adding Solr mbeans to JMX Server: com.sun.jmx.mbeanserver.JmxMBeanServer@1b2254c
[junit4:junit4]   2> 1637 T2014 oasc.CachingDirectoryFactory.close Releasing directory:/mnt/ssd/jenkins/workspace/Lucene-Solr-trunk-Linux/solr/build/solr-core/test/J1/./solrtest-SoftAutoCommitTest-1358858753631
[junit4:junit4]   2> 1637 T2014 oasc.SolrCore.getNewIndexDir New index directory detected: old=null new=/mnt/ssd/jenkins/workspace/Lucene-Solr-trunk-Linux/solr/build/solr-core/test/J1/./solrtest-SoftAutoCommitTest-1358858753631/index/
[junit4:junit4]   2> 1637 T2014 oasc.SolrCore.initWriters created xml: solr.XMLResponseWriter
[junit4:junit4]   2> 1639 T2014 oasup.UpdateRequestProcessorChain.init inserting DistributedUpdateProcessorFactory into updateRequestProcessorChain "dedupe"
[junit4:junit4]   2> 1639 T2014 oasup.UpdateRequestProcessorChain.init inserting DistributedUpdateProcessorFactory into updateRequestProcessorChain "dedupe-allfields"
[junit4:junit4]   2> 1639 T2014 oasup.UpdateRequestProcessorChain.init inserting DistributedUpdateProcessorFactory into updateRequestProcessorChain "stored_sig"
[junit4:junit4]   2> 1640 T2014 oasup.UpdateRequestProcessorChain.init inserting DistributedUpdateProcessorFactory into updateRequestProcessorChain "uniq-fields"
[junit4:junit4]   2> 1640 T2014 oasup.UpdateRequestProcessorChain.init inserting DistributedUpdateProcessorFactory into updateRequestProcessorChain "distrib-dup-test-chain-implicit"
[junit4:junit4]   2> 1640 T2014 oasc.RequestHandlers.initHandlersFromConfig adding lazy requestHandler: solr.ReplicationHandler
[junit4:junit4]   2> 1641 T2014 oasc.RequestHandlers.initHandlersFromConfig created /replication: solr.ReplicationHandler
[junit4:junit4]   2> 1641 T2014 oasc.RequestHandlers.initHandlersFromConfig created standard: solr.StandardRequestHandler
[junit4:junit4]   2> 1642 T2014 oasc.RequestHandlers.initHandlersFromConfig created /get: solr.RealTimeGetHandler
[junit4:junit4]   2> 1642 T2014 oasc.RequestHandlers.initHandlersFromConfig created dismax: solr.SearchHandler
[junit4:junit4]   2> 1643 T2014 oasc.RequestHandlers.initHandlersFromConfig created mock: org.apache.solr.core.MockQuerySenderListenerReqHandler
[junit4:junit4]   2> 1643 T2014 oasc.RequestHandlers.initHandlersFromConfig created /admin/: org.apache.solr.handler.admin.AdminHandlers
[junit4:junit4]   2> 1643 T2014 oasc.RequestHandlers.initHandlersFromConfig created defaults: solr.StandardRequestHandler
[junit4:junit4]   2> 1644 T2014 oasc.RequestHandlers.initHandlersFromConfig adding lazy requestHandler: solr.StandardRequestHandler
[junit4:junit4]   2> 1644 T2014 oasc.RequestHandlers.initHandlersFromConfig created lazy: solr.StandardRequestHandler
[junit4:junit4]   2> 1644 T2014 oasc.RequestHandlers.initHandlersFromConfig created /update: solr.UpdateRequestHandler
[junit4:junit4]   2> 1645 T2014 oasc.RequestHandlers.initHandlersFromConfig created /terms: org.apache.solr.handler.component.SearchHandler
[junit4:junit4]   2> 1645 T2014 oasc.RequestHandlers.initHandlersFromConfig created spellCheckCompRH: org.apache.solr.handler.component.SearchHandler
[junit4:junit4]   2> 1646 T2014 oasc.RequestHandlers.initHandlersFromConfig created spellCheckCompRH_Direct: org.apache.solr.handler.component.SearchHandler
[junit4:junit4]   2> 1646 T2014 oasc.RequestHandlers.initHandlersFromConfig created spellCheckWithWordbreak: org.apache.solr.handler.component.SearchHandler
[junit4:junit4]   2> 1647 T2014 oasc.RequestHandlers.initHandlersFromConfig created spellCheckWithWordbreak_Direct: org.apache.solr.handler.component.SearchHandler
[junit4:junit4]   2> 1647 T2014 oasc.RequestHandlers.initHandlersFromConfig created spellCheckCompRH1: org.apache.solr.handler.component.SearchHandler
[junit4:junit4]   2> 1647 T2014 oasc.RequestHandlers.initHandlersFromConfig created mltrh: org.apache.solr.handler.component.SearchHandler
[junit4:junit4]   2> 1648 T2014 oasc.RequestHandlers.initHandlersFromConfig created tvrh: org.apache.solr.handler.component.SearchHandler
[junit4:junit4]   2> 1648 T2014 oasc.RequestHandlers.initHandlersFromConfig created /mlt: solr.MoreLikeThisHandler
[junit4:junit4]   2> 1649 T2014 oasc.RequestHandlers.initHandlersFromConfig created /debug/dump: solr.DumpRequestHandler
[junit4:junit4]   2> 1650 T2014 oashl.XMLLoader.init xsltCacheLifetimeSeconds=60
[junit4:junit4]   2> 1651 T2014 oasc.SolrCore.initDeprecatedSupport WARNING solrconfig.xml uses deprecated <admin/gettableFiles>, Please update your config to use the ShowFileRequestHandler.
[junit4:junit4]   2> 1652 T2014 oasc.SolrCore.initDeprecatedSupport WARNING adding ShowFileRequestHandler with hidden files: [THROW.ERROR.ON.ADD.UPDATEPROCESSOR.JS, SOLRCONFIG-HIGHLIGHT.XML, SCHEMA-REQUIRED-FIELDS.XML, SCHEMA-REPLICATION2.XML, TRIVIAL.UPDATEPROCESSOR1.JS, BAD-SCHEMA-DUP-DYNAMICFIELD.XML, SCHEMA-MINIMAL.XML, SOLRCONFIG-CACHING.XML, SCHEMA-POSTINGSHIGHLIGHT.XML, SOLRCONFIG-REPEATER.XML, BAD-SCHEMA-NONTEXT-ANALYZER.XML, CURRENCY.XML, SOLRCONFIG-MERGEPOLICY.XML, SOLRCONFIG-TLOG.XML, SOLRCONFIG-MASTER.XML, SOLRCONFIG-COMPONENTS-NAME.XML, BAD-SCHEMA-UNIQUEKEY-MULTIVALUED.XML, SCHEMA11.XML, SOLRCONFIG-BASIC.XML, DA_COMPOUNDDICTIONARY.TXT, MISSLEADING.EXTENSION.UPDATEPROCESSOR.JS.TXT, SCHEMA-COPYFIELD-TEST.XML, SOLRCONFIG-SLAVE.XML, ELEVATE.XML, SOLRCONFIG-PROPINJECT-INDEXDEFAULT.XML, TRIVIAL.UPDATEPROCESSOR0.JS, BAD-SOLRCONFIG-BOGUS-SCRIPTENGINE-NAME.XML, SCHEMA-CHARFILTERS.XML, SCHEMA-IB.XML, SOLRCONFIG-QUERYSENDER.XML, SCHEMA-REPLICATION1.XML, SOLRCONFIG-SNIPPET-PROCESSOR.XML, DA_UTF8.XML, CONDITIONAL.UPDATEPROCESSOR.JS, MISSING.FUNCTIONS.UPDATEPROCESSOR.JS, HYPHENATION.DTD, SOLRCONFIG-ENABLEPLUGIN.XML, SCHEMA-PHRASESUGGEST.XML, STEMDICT.TXT, HUNSPELL-TEST.AFF, SCHEMA-SNIPPET-TYPE.XML, STOPTYPES-1.TXT, STOPWORDSWRONGENCODING.TXT, SCHEMA-NUMERIC.XML, SOLRCONFIG-TRANSFORMERS.XML, SOLRCONFIG-PROPINJECT.XML, BAD-SCHEMA-NOT-INDEXED-BUT-TF.XML, SOLRCONFIG-SIMPLELOCK.XML, WDFTYPES.TXT, SCHEMA-REVERSED.XML, STOPTYPES-2.TXT, BAD-SCHEMA-CURRENCY-FT-MULTIVALUED.XML, SOLRCONFIG-SPELLCHECKCOMPONENT.XML, BAD-SCHEMA-CURRENCY-MULTIVALUED.XML, SOLRCONFIG-PHRASESUGGEST.XML, SCHEMA-DFR.XML, BAD-SCHEMA-NOT-INDEXED-BUT-POS.XML, KEEP-1.TXT, OPEN-EXCHANGE-RATES.JSON, SCHEMA-SPATIAL.XML, STOPWITHBOM.TXT, SCHEMA-BINARYFIELD.XML, SOLRCONFIG-POSTINGSHIGHLIGHT.XML, SOLRCONFIG-SPELLCHECKER.XML, SOLRCONFIG-UPDATE-PROCESSOR-CHAINS.XML, BAD-SCHEMA-OMIT-TF-BUT-NOT-POS.XML, BAD-SCHEMA-DUP-FIELDTYPE.XML, SCHEMA-XINCLUDE.XML, SOLRCONFIG-MASTER1.XML, SCHEMA-BEHAVIOR.XML, SYNONYMS.TXT, BAD-SCHEMA-CURRENCY-DYNAMIC-MULTIVALUED.XML, SCHEMA_CODEC.XML, SCHEMA.XML, SOLRCONFIG-SOLR-749.XML, SOLRCONFIG-MASTER1-KEEPONEBACKUP.XML, SCHEMA-EFF.XML, SOLRCONFIG-FUNCTIONQUERY.XML, STOP-2.TXT, SCHEMA-LMDIRICHLET.XML, SOLRCONFIG-TERMINDEX.XML, SOLRCONFIG-ELEVATE.XML, SCHEMA-FOLDING.XML, STOPWORDS.TXT, SCHEMA-STOP-KEEP.XML, FUZZYSUGGEST.TXT, BAD-SCHEMA-NOT-INDEXED-BUT-NORMS.XML, SOLRCONFIG-SOLCOREPROPERTIES.XML, STOP-1.TXT, SOLRCONFIG-MASTER2.XML, SCHEMA-SPELLCHECKER.XML, SOLRCONFIG-RESPONSE-LOG-COMPONENT.XML, SOLRCONFIG-LAZYWRITER.XML, SCHEMA-LUCENEMATCHVERSION.XML, FRENCHARTICLES.TXT, BAD-MP-SOLRCONFIG.XML, SCHEMA15.XML, SOLRCONFIG-REQHANDLER.INCL, SCHEMASURROUND.XML, SOLRCONFIG-MASTER3.XML, HUNSPELL-TEST.DIC, SOLRCONFIG-XINCLUDE.XML, BAD-SCHEMA-CODEC-GLOBAL-VS-FT-MISMATCH.XML, SOLRCONFIG-DELPOLICY1.XML, SOLRCONFIG-SLAVE1.XML, SCHEMA-SIM.XML, SCHEMA-SNIPPET-FIELD.XML, SCHEMA-COLLATE.XML, STOP-SNOWBALL.TXT, BAD-SCHEMA-SIM-GLOBAL-VS-FT-MISMATCH.XML, PROTWORDS.TXT, SCHEMA-TRIE.XML, SOLRCONFIG_CODEC.XML, SCHEMA-SYNONYM-TOKENIZER.XML, BAD-SOLRCONFIG-INVALID-SCRIPTFILE.XML, JASUGGEST.TXT, SCHEMA-TFIDF.XML, SOLRCONFIG-SCRIPT-UPDATEPROCESSOR.XML, SCHEMA-LMJELINEKMERCER.XML, PHRASESUGGEST.TXT, BAD-SOLRCONFIG-MISSING-SCRIPTFILE.XML, BAD-SCHEMA-UNIQUEKEY-USES-DEFAULT.XML, OLD_SYNONYMS.TXT, SOLRCONFIG-DELPOLICY2.XML, XSLT, SOLRCONFIG-NATIVELOCK.XML, BAD-SCHEMA-DUP-FIELD.XML, SOLRCONFIG-NOCACHE.XML, SCHEMA-BM25.XML, ADDFIELDS.UPDATEPROCESSOR.JS, SOLRCONFIG-ALTDIRECTORY.XML, SOLRCONFIG-QUERYSENDER-NOQUERY.XML, COMPOUNDDICTIONARY.TXT, SOLRCONFIG_PERF.XML, SOLRCONFIG-INDEXCONFIG.XML, BAD-SCHEMA-ANALYZER-CLASS-AND-NESTED.XML, SCHEMA-NOT-REQUIRED-UNIQUE-KEY.XML, KEEP-2.TXT, BAD-SCHEMA-UNIQUEKEY-IS-COPYFIELD-DEST.XML, SCHEMA12.XML, MAPPING-ISOLATIN1ACCENT.TXT, BAD_SOLRCONFIG.XML, BAD-SCHEMA-EXTERNAL-FILEFIELD.XML]
[junit4:junit4]   2> 1654 T2014 oasc.CachingDirectoryFactory.close Releasing directory:/mnt/ssd/jenkins/workspace/Lucene-Solr-trunk-Linux/solr/build/solr-core/test/J1/./solrtest-SoftAutoCommitTest-1358858753631
[junit4:junit4]   2> 1656 T2014 oass.SolrIndexSearcher.<init> Opening Searcher@d6c47 main
[junit4:junit4]   2> 1657 T2014 oasu.CommitTracker.<init> Hard AutoCommit: disabled
[junit4:junit4]   2> 1657 T2014 oasu.CommitTracker.<init> Soft AutoCommit: disabled
[junit4:junit4]   2> 1657 T2014 oashc.SpellCheckComponent.inform Initializing spell checkers
[junit4:junit4]   2> 1658 T2014 oass.DirectSolrSpellChecker.init init: {name=direct,classname=DirectSolrSpellChecker,field=lowerfilt,minQueryLength=3}
[junit4:junit4]   2> 1664 T2019 oasc.SolrCore.registerSearcher [collection1] Registered new searcher Searcher@d6c47 main{StandardDirectoryReader(segments_1:3:nrt _0(5.0):C5)}
[junit4:junit4]   2> 1668 T2014 oasc.CoreContainer.registerCore replacing core: collection1
[junit4:junit4]   2> 1668 T2014 oasc.SolrCore.close [collection1]  CLOSING SolrCore org.apache.solr.core.SolrCore@1bc439
[junit4:junit4]   2> 1672 T2014 oasu.DirectUpdateHandler2.close closing DirectUpdateHandler2{commits=0,autocommit maxTime=1200ms,autocommits=0,soft autocommit maxTime=500ms,soft autocommits=0,optimizes=0,rollbacks=0,expungeDeletes=0,docsPending=5,adds=5,deletesById=0,deletesByQuery=0,errors=0,cumulative_adds=5,cumulative_deletesById=0,cumulative_deletesByQuery=0,cumulative_errors=0}
[junit4:junit4]   2> 1672 T2018 oasu.DirectUpdateHandler2.commit start commit{,optimize=false,openSearcher=true,waitSearcher=true,expungeDeletes=false,softCommit=true}
[junit4:junit4]   2> 1672 T2014 oasc.SolrCore.closeSearcher [collection1] Closing main searcher on request.
[junit4:junit4]   2> 1673 T2018 oasc.CachingDirectoryFactory.close Releasing directory:/mnt/ssd/jenkins/workspace/Lucene-Solr-trunk-Linux/solr/build/solr-core/test/J1/./solrtest-SoftAutoCommitTest-1358858753631
[junit4:junit4]   2> 1673 T2014 oasc.CachingDirectoryFactory.close Releasing directory:/mnt/ssd/jenkins/workspace/Lucene-Solr-trunk-Linux/solr/build/solr-core/test/J1/./solrtest-SoftAutoCommitTest-1358858753631/index
[junit4:junit4]   2> 1674 T2018 oass.SolrIndexSearcher.<init> Opening Searcher@1cf9780 main
[junit4:junit4]   2> 1677 T2018 oasc.SolrException.log SEVERE auto commit error...:org.apache.solr.common.SolrException: java.util.concurrent.RejectedExecutionException: Task java.util.concurrent.FutureTask@9ca84 rejected from java.util.concurrent.ThreadPoolExecutor@cec71c[Terminated, pool size = 0, active threads = 0, queued tasks = 0, completed tasks = 2]
[junit4:junit4]   2> 		at org.apache.solr.core.SolrCore.getSearcher(SolrCore.java:1660)
[junit4:junit4]   2> 		at org.apache.solr.update.DirectUpdateHandler2.commit(DirectUpdateHandler2.java:550)
[junit4:junit4]   2> 		at org.apache.solr.update.CommitTracker.run(CommitTracker.java:216)
[junit4:junit4]   2> 		at java.util.concurrent.Executors$RunnableAdapter.call(Executors.java:471)
[junit4:junit4]   2> 		at java.util.concurrent.FutureTask$Sync.innerRun(FutureTask.java:334)
[junit4:junit4]   2> 		at java.util.concurrent.FutureTask.run(FutureTask.java:166)
[junit4:junit4]   2> 		at java.util.concurrent.ScheduledThreadPoolExecutor$ScheduledFutureTask.access$201(ScheduledThreadPoolExecutor.java:178)
[junit4:junit4]   2> 		at java.util.concurrent.ScheduledThreadPoolExecutor$ScheduledFutureTask.run(ScheduledThreadPoolExecutor.java:292)
[junit4:junit4]   2> 		at java.util.concurrent.ThreadPoolExecutor.runWorker(ThreadPoolExecutor.java:1110)
[junit4:junit4]   2> 		at java.util.concurrent.ThreadPoolExecutor$Worker.run(ThreadPoolExecutor.java:603)
[junit4:junit4]   2> 		at java.lang.Thread.run(Thread.java:722)
[junit4:junit4]   2> 	Caused by: java.util.concurrent.RejectedExecutionException: Task java.util.concurrent.FutureTask@9ca84 rejected from java.util.concurrent.ThreadPoolExecutor@cec71c[Terminated, pool size = 0, active threads = 0, queued tasks = 0, completed tasks = 2]
[junit4:junit4]   2> 		at java.util.concurrent.ThreadPoolExecutor$AbortPolicy.rejectedExecution(ThreadPoolExecutor.java:2013)
[junit4:junit4]   2> 		at java.util.concurrent.ThreadPoolExecutor.reject(ThreadPoolExecutor.java:816)
[junit4:junit4]   2> 		at java.util.concurrent.ThreadPoolExecutor.execute(ThreadPoolExecutor.java:1337)
[junit4:junit4]   2> 		at java.util.concurrent.AbstractExecutorService.submit(AbstractExecutorService.java:132)
[junit4:junit4]   2> 		at java.util.concurrent.Executors$DelegatedExecutorService.submit(Executors.java:641)
[junit4:junit4]   2> 		at org.apache.solr.core.SolrCore.getSearcher(SolrCore.java:1588)
[junit4:junit4]   2> 		... 10 more
[junit4:junit4]   2> 	
[junit4:junit4]   2> ASYNC  NEW_CORE C123 name=collection1 org.apache.solr.core.SolrCore@7b8ad8
[junit4:junit4]   2> 1678 T2014 C123 UPDATE [collection1] webapp=null path=null params={} {add=[529]} 0 1
[junit4:junit4]   2> 1682 T2014 C123 oasu.DirectUpdateHandler2.commit start commit{,optimize=false,openSearcher=true,waitSearcher=true,expungeDeletes=false,softCommit=false}
[junit4:junit4]   2> 1696 T2014 C123 oasc.SolrDeletionPolicy.onCommit SolrDeletionPolicy.onCommit: commits:num=2
[junit4:junit4]   2> 		commit{dir=RateLimitedDirectoryWrapper(MockDirWrapper(org.apache.lucene.store.RAMDirectory@f953d7 lockFactory=org.apache.lucene.store.NativeFSLockFactory@1916f2c)),segFN=segments_1,generation=1,filenames=[segments_1]
[junit4:junit4]   2> 		commit{dir=RateLimitedDirectoryWrapper(MockDirWrapper(org.apache.lucene.store.RAMDirectory@f953d7 lockFactory=org.apache.lucene.store.NativeFSLockFactory@1916f2c)),segFN=segments_2,generation=2,filenames=[_1_1.len, _1.fld, _0_1.len, _0_6.len, _0_5.len, _0_7.len, _1.inf, _0.pst, _1_4.len, _0.fld, _0_4.len, _1.pst, _1_3.len, _0_3.len, _1_6.len, _1.si, segments_2, _1_7.len, _0.inf, _0.si, _1_5.len]
[junit4:junit4]   2> 1696 T2014 C123 oasc.SolrDeletionPolicy.updateCommits newest commit = 2[_1_1.len, _1.fld, _0_1.len, _0_6.len, _0_5.len, _0_7.len, _1.inf, _0.pst, _1_4.len, _0.fld, _0_4.len, _1.pst, _1_3.len, _0_3.len, _1_6.len, _1.si, segments_2, _1_7.len, _0.inf, _0.si, _1_5.len]
[junit4:junit4]   2> 1697 T2014 C123 oasc.CachingDirectoryFactory.close Releasing directory:/mnt/ssd/jenkins/workspace/Lucene-Solr-trunk-Linux/solr/build/solr-core/test/J1/./solrtest-SoftAutoCommitTest-1358858753631
[junit4:junit4]   2> 1698 T2014 C123 oass.SolrIndexSearcher.<init> Opening Searcher@b83ed6 main
[junit4:junit4]   2> 1699 T2014 C123 oasu.DirectUpdateHandler2.commit end_commit_flush
[junit4:junit4]   2> 1700 T2019 oasc.SolrCore.registerSearcher [collection1] Registered new searcher Searcher@b83ed6 main{StandardDirectoryReader(segments_2:5:nrt _0(5.0):C5 _1(5.0):C1)}
[junit4:junit4]   2> 1700 T2019 oasc.CachingDirectoryFactory.close Releasing directory:/mnt/ssd/jenkins/workspace/Lucene-Solr-trunk-Linux/solr/build/solr-core/test/J1/./solrtest-SoftAutoCommitTest-1358858753631/index
[junit4:junit4]   2> 1700 T2014 C123 UPDATE [collection1] webapp=null path=null params={} {commit=} 0 18
[junit4:junit4]   2> 1708 T2014 C123 UPDATE [collection1] webapp=null path=null params={} {delete=[529]} 0 0
[junit4:junit4]   2> 2209 T2021 oasu.DirectUpdateHandler2.commit start commit{,optimize=false,openSearcher=true,waitSearcher=true,expungeDeletes=false,softCommit=true}
[junit4:junit4]   2> 2210 T2021 oasc.CachingDirectoryFactory.close Releasing directory:/mnt/ssd/jenkins/workspace/Lucene-Solr-trunk-Linux/solr/build/solr-core/test/J1/./solrtest-SoftAutoCommitTest-1358858753631
[junit4:junit4]   2> 2216 T2021 oass.SolrIndexSearcher.<init> Opening Searcher@bcb102 main
[junit4:junit4]   2> 2217 T2021 oasu.DirectUpdateHandler2.commit end_commit_flush
[junit4:junit4]   2> 2218 T2019 oasc.SolrCore.registerSearcher [collection1] Registered new searcher Searcher@bcb102 main{StandardDirectoryReader(segments_2:7:nrt _0(5.0):C5)}
[junit4:junit4]   2> 2219 T2019 oasc.CachingDirectoryFactory.close Releasing directory:/mnt/ssd/jenkins/workspace/Lucene-Solr-trunk-Linux/solr/build/solr-core/test/J1/./solrtest-SoftAutoCommitTest-1358858753631/index
[junit4:junit4]   2> 2225 T2014 C123 UPDATE [collection1] webapp=null path=null params={} {add=[550]} 0 1
[junit4:junit4]   2> 2725 T2021 oasu.DirectUpdateHandler2.commit start commit{,optimize=false,openSearcher=true,waitSearcher=true,expungeDeletes=false,softCommit=true}
[junit4:junit4]   2> 2726 T2021 oasc.CachingDirectoryFactory.close Releasing directory:/mnt/ssd/jenkins/workspace/Lucene-Solr-trunk-Linux/solr/build/solr-core/test/J1/./solrtest-SoftAutoCommitTest-1358858753631
[junit4:junit4]   2> 2729 T2021 oass.SolrIndexSearcher.<init> Opening Searcher@17d4074 main
[junit4:junit4]   2> 2730 T2021 oasu.DirectUpdateHandler2.commit end_commit_flush
[junit4:junit4]   2> 2732 T2019 oasc.SolrCore.registerSearcher [collection1] Registered new searcher Searcher@17d4074 main{StandardDirectoryReader(segments_2:9:nrt _0(5.0):C5 _2(5.0):C1)}
[junit4:junit4]   2> 2732 T2019 oasc.CachingDirectoryFactory.close Releasing directory:/mnt/ssd/jenkins/workspace/Lucene-Solr-trunk-Linux/solr/build/solr-core/test/J1/./solrtest-SoftAutoCommitTest-1358858753631/index
[junit4:junit4]   2> 2908 T2020 oasu.DirectUpdateHandler2.commit start commit{,optimize=false,openSearcher=true,waitSearcher=true,expungeDeletes=false,softCommit=false}
[junit4:junit4]   2> 2909 T2020 oasc.SolrDeletionPolicy.onCommit SolrDeletionPolicy.onCommit: commits:num=2
[junit4:junit4]   2> 		commit{dir=RateLimitedDirectoryWrapper(MockDirWrapper(org.apache.lucene.store.RAMDirectory@f953d7 lockFactory=org.apache.lucene.store.NativeFSLockFactory@1916f2c)),segFN=segments_2,generation=2,filenames=[_1_1.len, _1.fld, _0_1.len, _0_6.len, _0_5.len, _0_7.len, _1.inf, _0.pst, _1_4.len, _0.fld, _0_4.len, _1.pst, _1_3.len, _0_3.len, _1_6.len, _1.si, segments_2, _1_7.len, _0.inf, _0.si, _1_5.len]
[junit4:junit4]   2> 		commit{dir=RateLimitedDirectoryWrapper(MockDirWrapper(org.apache.lucene.store.RAMDirectory@f953d7 lockFactory=org.apache.lucene.store.NativeFSLockFactory@1916f2c)),segFN=segments_3,generation=3,filenames=[_2.si, _2.fld, _0_1.len, _0_6.len, _0_5.len, _2.inf, _0_7.len, _2_3.len, _2_6.len, _2_1.len, _0.pst, _0.fld, _2_7.len, _0_4.len, _2.pst, _2_5.len, _0_3.len, _0.inf, _0.si, _2_4.len, segments_3]
[junit4:junit4]   2> 2910 T2020 oasc.SolrDeletionPolicy.updateCommits newest commit = 3[_2.si, _2.fld, _0_1.len, _0_6.len, _0_5.len, _2.inf, _0_7.len, _2_3.len, _2_6.len, _2_1.len, _0.pst, _0.fld, _2_7.len, _0_4.len, _2.pst, _2_5.len, _0_3.len, _0.inf, _0.si, _2_4.len, segments_3]
[junit4:junit4]   2> 2911 T2020 oasc.CachingDirectoryFactory.close Releasing directory:/mnt/ssd/jenkins/workspace/Lucene-Solr-trunk-Linux/solr/build/solr-core/test/J1/./solrtest-SoftAutoCommitTest-1358858753631
[junit4:junit4]   2> 2912 T2020 oass.SolrIndexSearcher.<init> Opening Searcher@1eea8c9 main
[junit4:junit4]   2> 2912 T2020 oasu.DirectUpdateHandler2.commit end_commit_flush
[junit4:junit4]   2> 2914 T2019 oasc.SolrCore.registerSearcher [collection1] Registered new searcher Searcher@1eea8c9 main{StandardDirectoryReader(segments_2:9:nrt _0(5.0):C5 _2(5.0):C1)}
[junit4:junit4]   2> 2914 T2019 oasc.CachingDirectoryFactory.close Releasing directory:/mnt/ssd/jenkins/workspace/Lucene-Solr-trunk-Linux/solr/build/solr-core/test/J1/./solrtest-SoftAutoCommitTest-1358858753631/index
[junit4:junit4]   2> 4912 T2014 oas.SolrTestCaseJ4.tearDown ###Ending testSoftAndHardCommitMaxTimeDelete
[junit4:junit4]   2> 4919 T2014 oas.SolrTestCaseJ4.setUp ###Starting testSoftAndHardCommitMaxTimeMixedAdds
[junit4:junit4]   2> 4919 T2014 oasc.CoreContainer.reload Reloading SolrCore 'collection1' using instanceDir: /mnt/ssd/jenkins/workspace/Lucene-Solr-trunk-Linux/solr/build/solr-core/test-files/solr/collection1
[junit4:junit4]   2> 4920 T2014 oasc.SolrResourceLoader.<init> new SolrResourceLoader for directory: '/mnt/ssd/jenkins/workspace/Lucene-Solr-trunk-Linux/solr/build/solr-core/test-files/solr/collection1/'
[junit4:junit4]   2> 4921 T2014 oasc.SolrResourceLoader.replaceClassLoader Adding 'file:/mnt/ssd/jenkins/workspace/Lucene-Solr-trunk-Linux/solr/build/solr-core/test-files/solr/collection1/lib/README' to classloader
[junit4:junit4]   2> 4921 T2014 oasc.SolrResourceLoader.replaceClassLoader Adding 'file:/mnt/ssd/jenkins/workspace/Lucene-Solr-trunk-Linux/solr/build/solr-core/test-files/solr/collection1/lib/classes/' to classloader
[junit4:junit4]   2> 4961 T2014 oasc.SolrConfig.<init> Using Lucene MatchVersion: LUCENE_50
[junit4:junit4]   2> 4996 T2014 oasc.SolrConfig.<init> Loaded SolrConfig: solrconfig.xml
[junit4:junit4]   2> 4997 T2014 oass.IndexSchema.readSchema Reading Solr Schema
[junit4:junit4]   2> 5000 T2014 oass.IndexSchema.readSchema Schema name=test
[junit4:junit4]   2> 5240 T3 oasu.ConcurrentLRUCache.finalize SEVERE ConcurrentLRUCache was not destroyed prior to finalize(), indicates a bug -- POSSIBLE RESOURCE LEAK!!!
[junit4:junit4]   2> 5240 T3 oasu.ConcurrentLRUCache.finalize SEVERE ConcurrentLRUCache was not destroyed prior to finalize(), indicates a bug -- POSSIBLE RESOURCE LEAK!!!
[junit4:junit4]   2> 5335 T2014 oass.OpenExchangeRatesOrgProvider.init Initialized with rates=open-exchange-rates.json, refreshInterval=1440.
[junit4:junit4]   2> 5340 T2014 oass.IndexSchema.readSchema default search field in schema is text
[junit4:junit4]   2> 5343 T2014 oass.IndexSchema.readSchema unique key field: id
[junit4:junit4]   2> 5348 T2014 oass.FileExchangeRateProvider.reload Reloading exchange rates from file currency.xml
[junit4:junit4]   2> 5351 T2014 oass.FileExchangeRateProvider.reload Reloading exchange rates from file currency.xml
[junit4:junit4]   2> 5353 T2014 oass.OpenExchangeRatesOrgProvider.reload Reloading exchange rates from open-exchange-rates.json
[junit4:junit4]   2> 5353 T2014 oass.OpenExchangeRatesOrgProvider.reload Reloading exchange rates from open-exchange-rates.json
[junit4:junit4]   2> 5354 T2014 oasc.SolrCore.<init> [collection1] Opening new SolrCore at /mnt/ssd/jenkins/workspace/Lucene-Solr-trunk-Linux/solr/build/solr-core/test-files/solr/collection1/, dataDir=/mnt/ssd/jenkins/workspace/Lucene-Solr-trunk-Linux/solr/build/solr-core/test/J1/./solrtest-SoftAutoCommitTest-1358858753631/
[junit4:junit4]   2> 5354 T2014 oasc.JmxMonitoredMap.<init> JMX monitoring is enabled. Adding Solr mbeans to JMX Server: com.sun.jmx.mbeanserver.JmxMBeanServer@1b2254c
[junit4:junit4]   2> 5355 T2014 oasc.CachingDirectoryFactory.close Releasing directory:/mnt/ssd/jenkins/workspace/Lucene-Solr-trunk-Linux/solr/build/solr-core/test/J1/./solrtest-SoftAutoCommitTest-1358858753631
[junit4:junit4]   2> 5355 T2014 oasc.SolrCore.getNewIndexDir New index directory detected: old=null new=/mnt/ssd/jenkins/workspace/Lucene-Solr-trunk-Linux/solr/build/solr-core/test/J1/./solrtest-SoftAutoCommitTest-1358858753631/index/
[junit4:junit4]   2> 5355 T2014 oasc.SolrCore.initWriters created xml: solr.XMLResponseWriter
[junit4:junit4]   2> 5357 T2014 oasup.UpdateRequestProcessorChain.init inserting DistributedUpdateProcessorFactory into updateRequestProcessorChain "dedupe"
[junit4:junit4]   2> 5357 T2014 oasup.UpdateRequestProcessorChain.init inserting DistributedUpdateProcessorFactory into updateRequestProcessorChain "dedupe-allfields"
[junit4:junit4]   2> 5358 T2014 oasup.UpdateRequestProcessorChain.init inserting DistributedUpdateProcessorFactory into updateRequestProcessorChain "stored_sig"
[junit4:junit4]   2> 5358 T2014 oasup.UpdateRequestProcessorChain.init inserting DistributedUpdateProcessorFactory into updateRequestProcessorChain "uniq-fields"
[junit4:junit4]   2> 5359 T2014 oasup.UpdateRequestProcessorChain.init inserting DistributedUpdateProcessorFactory into updateRequestProcessorChain "distrib-dup-test-chain-implicit"
[junit4:junit4]   2> 5359 T2014 oasc.RequestHandlers.initHandlersFromConfig adding lazy requestHandler: solr.ReplicationHandler
[junit4:junit4]   2> 5359 T2014 oasc.RequestHandlers.initHandlersFromConfig created /replication: solr.ReplicationHandler
[junit4:junit4]   2> 5360 T2014 oasc.RequestHandlers.initHandlersFromConfig created standard: solr.StandardRequestHandler
[junit4:junit4]   2> 5360 T2014 oasc.RequestHandlers.initHandlersFromConfig created /get: solr.RealTimeGetHandler
[junit4:junit4]   2> 5361 T2014 oasc.RequestHandlers.initHandlersFromConfig created dismax: solr.SearchHandler
[junit4:junit4]   2> 5361 T2014 oasc.RequestHandlers.initHandlersFromConfig created mock: org.apache.solr.core.MockQuerySenderListenerReqHandler
[junit4:junit4]   2> 5362 T2014 oasc.RequestHandlers.initHandlersFromConfig created /admin/: org.apache.solr.handler.admin.AdminHandlers
[junit4:junit4]   2> 5362 T2014 oasc.RequestHandlers.initHandlersFromConfig created defaults: solr.StandardRequestHandler
[junit4:junit4]   2> 5362 T2014 oasc.RequestHandlers.initHandlersFromConfig adding lazy requestHandler: solr.StandardRequestHandler
[junit4:junit4]   2> 5363 T2014 oasc.RequestHandlers.initHandlersFromConfig created lazy: solr.StandardRequestHandler
[junit4:junit4]   2> 5363 T2014 oasc.RequestHandlers.initHandlersFromConfig created /update: solr.UpdateRequestHandler
[junit4:junit4]   2> 5364 T2014 oasc.RequestHandlers.initHandlersFromConfig created /terms: org.apache.solr.handler.component.SearchHandler
[junit4:junit4]   2> 5364 T2014 oasc.RequestHandlers.initHandlersFromConfig created spellCheckCompRH: org.apache.solr.handler.component.SearchHandler
[junit4:junit4]   2> 5365 T2014 oasc.RequestHandlers.initHandlersFromConfig created spellCheckCompRH_Direct: org.apache.solr.handler.component.SearchHandler
[junit4:junit4]   2> 5365 T2014 oasc.RequestHandlers.initHandlersFromConfig created spellCheckWithWordbreak: org.apache.solr.handler.component.SearchHandler
[junit4:junit4]   2> 5366 T2014 oasc.RequestHandlers.initHandlersFromConfig created spellCheckWithWordbreak_Direct: org.apache.solr.handler.component.SearchHandler
[junit4:junit4]   2> 5366 T2014 oasc.RequestHandlers.initHandlersFromConfig created spellCheckCompRH1: org.apache.solr.handler.component.SearchHandler
[junit4:junit4]   2> 5366 T2014 oasc.RequestHandlers.initHandlersFromConfig created mltrh: org.apache.solr.handler.component.SearchHandler
[junit4:junit4]   2> 5367 T2014 oasc.RequestHandlers.initHandlersFromConfig created tvrh: org.apache.solr.handler.component.SearchHandler
[junit4:junit4]   2> 5368 T2014 oasc.RequestHandlers.initHandlersFromConfig created /mlt: solr.MoreLikeThisHandler
[junit4:junit4]   2> 5368 T2014 oasc.RequestHandlers.initHandlersFromConfig created /debug/dump: solr.DumpRequestHandler
[junit4:junit4]   2> 5371 T2014 oashl.XMLLoader.init xsltCacheLifetimeSeconds=60
[junit4:junit4]   2> 5372 T2014 oasc.SolrCore.initDeprecatedSupport WARNING solrconfig.xml uses deprecated <admin/gettableFiles>, Please update your config to use the ShowFileRequestHandler.
[junit4:junit4]   2> 5373 T2014 oasc.SolrCore.initDeprecatedSupport WARNING adding ShowFileRequestHandler with hidden files: [THROW.ERROR.ON.ADD.UPDATEPROCESSOR.JS, SOLRCONFIG-HIGHLIGHT.XML, SCHEMA-REQUIRED-FIELDS.XML, SCHEMA-REPLICATION2.XML, TRIVIAL.UPDATEPROCESSOR1.JS, BAD-SCHEMA-DUP-DYNAMICFIELD.XML, SCHEMA-MINIMAL.XML, SOLRCONFIG-CACHING.XML, SCHEMA-POSTINGSHIGHLIGHT.XML, SOLRCONFIG-REPEATER.XML, BAD-SCHEMA-NONTEXT-ANALYZER.XML, CURRENCY.XML, SOLRCONFIG-MERGEPOLICY.XML, SOLRCONFIG-TLOG.XML, SOLRCONFIG-MASTER.XML, SOLRCONFIG-COMPONENTS-NAME.XML, BAD-SCHEMA-UNIQUEKEY-MULTIVALUED.XML, SCHEMA11.XML, SOLRCONFIG-BASIC.XML, DA_COMPOUNDDICTIONARY.TXT, MISSLEADING.EXTENSION.UPDATEPROCESSOR.JS.TXT, SCHEMA-COPYFIELD-TEST.XML, SOLRCONFIG-SLAVE.XML, ELEVATE.XML, SOLRCONFIG-PROPINJECT-INDEXDEFAULT.XML, TRIVIAL.UPDATEPROCESSOR0.JS, BAD-SOLRCONFIG-BOGUS-SCRIPTENGINE-NAME.XML, SCHEMA-CHARFILTERS.XML, SCHEMA-IB.XML, SOLRCONFIG-QUERYSENDER.XML, SCHEMA-REPLICATION1.XML, SOLRCONFIG-SNIPPET-PROCESSOR.XML, DA_UTF8.XML, CONDITIONAL.UPDATEPROCESSOR.JS, MISSING.FUNCTIONS.UPDATEPROCESSOR.JS, HYPHENATION.DTD, SOLRCONFIG-ENABLEPLUGIN.XML, SCHEMA-PHRASESUGGEST.XML, STEMDICT.TXT, HUNSPELL-TEST.AFF, SCHEMA-SNIPPET-TYPE.XML, STOPTYPES-1.TXT, STOPWORDSWRONGENCODING.TXT, SCHEMA-NUMERIC.XML, SOLRCONFIG-TRANSFORMERS.XML, SOLRCONFIG-PROPINJECT.XML, BAD-SCHEMA-NOT-INDEXED-BUT-TF.XML, SOLRCONFIG-SIMPLELOCK.XML, WDFTYPES.TXT, SCHEMA-REVERSED.XML, STOPTYPES-2.TXT, BAD-SCHEMA-CURRENCY-FT-MULTIVALUED.XML, SOLRCONFIG-SPELLCHECKCOMPONENT.XML, BAD-SCHEMA-CURRENCY-MULTIVALUED.XML, SOLRCONFIG-PHRASESUGGEST.XML, SCHEMA-DFR.XML, BAD-SCHEMA-NOT-INDEXED-BUT-POS.XML, KEEP-1.TXT, OPEN-EXCHANGE-RATES.JSON, SCHEMA-SPATIAL.XML, STOPWITHBOM.TXT, SCHEMA-BINARYFIELD.XML, SOLRCONFIG-POSTINGSHIGHLIGHT.XML, SOLRCONFIG-SPELLCHECKER.XML, SOLRCONFIG-UPDATE-PROCESSOR-CHAINS.XML, BAD-SCHEMA-OMIT-TF-BUT-NOT-POS.XML, BAD-SCHEMA-DUP-FIELDTYPE.XML, SCHEMA-XINCLUDE.XML, SOLRCONFIG-MASTER1.XML, SCHEMA-BEHAVIOR.XML, SYNONYMS.TXT, BAD-SCHEMA-CURRENCY-DYNAMIC-MULTIVALUED.XML, SCHEMA_CODEC.XML, SCHEMA.XML, SOLRCONFIG-SOLR-749.XML, SOLRCONFIG-MASTER1-KEEPONEBACKUP.XML, SCHEMA-EFF.XML, SOLRCONFIG-FUNCTIONQUERY.XML, STOP-2.TXT, SCHEMA-LMDIRICHLET.XML, SOLRCONFIG-TERMINDEX.XML, SOLRCONFIG-ELEVATE.XML, SCHEMA-FOLDING.XML, STOPWORDS.TXT, SCHEMA-STOP-KEEP.XML, FUZZYSUGGEST.TXT, BAD-SCHEMA-NOT-INDEXED-BUT-NORMS.XML, SOLRCONFIG-SOLCOREPROPERTIES.XML, STOP-1.TXT, SOLRCONFIG-MASTER2.XML, SCHEMA-SPELLCHECKER.XML, SOLRCONFIG-RESPONSE-LOG-COMPONENT.XML, SOLRCONFIG-LAZYWRITER.XML, SCHEMA-LUCENEMATCHVERSION.XML, FRENCHARTICLES.TXT, BAD-MP-SOLRCONFIG.XML, SCHEMA15.XML, SOLRCONFIG-REQHANDLER.INCL, SCHEMASURROUND.XML, SOLRCONFIG-MASTER3.XML, HUNSPELL-TEST.DIC, SOLRCONFIG-XINCLUDE.XML, BAD-SCHEMA-CODEC-GLOBAL-VS-FT-MISMATCH.XML, SOLRCONFIG-DELPOLICY1.XML, SOLRCONFIG-SLAVE1.XML, SCHEMA-SIM.XML, SCHEMA-SNIPPET-FIELD.XML, SCHEMA-COLLATE.XML, STOP-SNOWBALL.TXT, BAD-SCHEMA-SIM-GLOBAL-VS-FT-MISMATCH.XML, PROTWORDS.TXT, SCHEMA-TRIE.XML, SOLRCONFIG_CODEC.XML, SCHEMA-SYNONYM-TOKENIZER.XML, BAD-SOLRCONFIG-INVALID-SCRIPTFILE.XML, JASUGGEST.TXT, SCHEMA-TFIDF.XML, SOLRCONFIG-SCRIPT-UPDATEPROCESSOR.XML, SCHEMA-LMJELINEKMERCER.XML, PHRASESUGGEST.TXT, BAD-SOLRCONFIG-MISSING-SCRIPTFILE.XML, BAD-SCHEMA-UNIQUEKEY-USES-DEFAULT.XML, OLD_SYNONYMS.TXT, SOLRCONFIG-DELPOLICY2.XML, XSLT, SOLRCONFIG-NATIVELOCK.XML, BAD-SCHEMA-DUP-FIELD.XML, SOLRCONFIG-NOCACHE.XML, SCHEMA-BM25.XML, ADDFIELDS.UPDATEPROCESSOR.JS, SOLRCONFIG-ALTDIRECTORY.XML, SOLRCONFIG-QUERYSENDER-NOQUERY.XML, COMPOUNDDICTIONARY.TXT, SOLRCONFIG_PERF.XML, SOLRCONFIG-INDEXCONFIG.XML, BAD-SCHEMA-ANALYZER-CLASS-AND-NESTED.XML, SCHEMA-NOT-REQUIRED-UNIQUE-KEY.XML, KEEP-2.TXT, BAD-SCHEMA-UNIQUEKEY-IS-COPYFIELD-DEST.XML, SCHEMA12.XML, MAPPING-ISOLATIN1ACCENT.TXT, BAD_SOLRCONFIG.XML, BAD-SCHEMA-EXTERNAL-FILEFIELD.XML]
[junit4:junit4]   2> 5375 T2014 oasc.CachingDirectoryFactory.close Releasing directory:/mnt/ssd/jenkins/workspace/Lucene-Solr-trunk-Linux/solr/build/solr-core/test/J1/./solrtest-SoftAutoCommitTest-1358858753631
[junit4:junit4]   2> 5375 T2014 oass.SolrIndexSearcher.<init> Opening Searcher@cd8f8d main
[junit4:junit4]   2> 5376 T2014 oasu.CommitTracker.<init> Hard AutoCommit: disabled
[junit4:junit4]   2> 5376 T2014 oasu.CommitTracker.<init> Soft AutoCommit: disabled
[junit4:junit4]   2> 5377 T2014 oashc.SpellCheckComponent.inform Initializing spell checkers
[junit4:junit4]   2> 5378 T2014 oass.DirectSolrSpellChecker.init init: {name=direct,classname=DirectSolrSpellChecker,field=lowerfilt,minQueryLength=3}
[junit4:junit4]   2> 5385 T2022 oasc.SolrCore.registerSearcher [collection1] Registered new searcher Searcher@cd8f8d main{StandardDirectoryReader(segments_3:9:nrt _0(5.0):C5 _2(5.0):C1)}
[junit4:junit4]   2> 5389 T2014 oasc.CoreContainer.registerCore replacing core: collection1
[junit4:junit4]   2> 5389 T2014 oasc.SolrCore.close [collection1]  CLOSING SolrCore org.apache.solr.core.SolrCore@7b8ad8
[junit4:junit4]   2> 5393 T2014 oasu.DirectUpdateHandler2.close closing DirectUpdateHandler2{commits=4,autocommit maxTime=1200ms,autocommits=1,soft autocommit maxTime=500ms,soft autocommits=2,optimizes=0,rollbacks=0,expungeDeletes=0,docsPending=0,adds=0,deletesById=0,deletesByQuery=0,errors=0,cumulative_adds=2,cumulative_deletesById=1,cumulative_deletesByQuery=0,cumulative_errors=0}
[junit4:junit4]   2> 5394 T2014 oasc.SolrCore.closeSearcher [collection1] Closing main searcher on request.
[junit4:junit4]   2> 5394 T2014 oasc.CachingDirectoryFactory.close Releasing directory:/mnt/ssd/jenkins/workspace/Lucene-Solr-trunk-Linux/solr/build/solr-core/test/J1/./solrtest-SoftAutoCommitTest-1358858753631/index
[junit4:junit4]   2> ASYNC  NEW_CORE C124 name=collection1 org.apache.solr.core.SolrCore@14d3638
[junit4:junit4]   2> 5399 T2014 C124 UPDATE [collection1] webapp=null path=null params={} {add=[529]} 0 1
[junit4:junit4]   2> 5900 T2024 oasu.DirectUpdateHandler2.commit start commit{,optimize=false,openSearcher=true,waitSearcher=true,expungeDeletes=false,softCommit=true}
[junit4:junit4]   2> 5901 T2024 oasc.CachingDirectoryFactory.close Releasing directory:/mnt/ssd/jenkins/workspace/Lucene-Solr-trunk-Linux/solr/build/solr-core/test/J1/./solrtest-SoftAutoCommitTest-1358858753631
[junit4:junit4]   2> 5903 T2024 oass.SolrIndexSearcher.<init> Opening Searcher@11d7813 main
[junit4:junit4]   2> 5904 T2024 oasu.DirectUpdateHandler2.commit end_commit_flush
[junit4:junit4]   2> 5905 T2022 oasc.SolrCore.registerSearcher [collection1] Registered new searcher Searcher@11d7813 main{StandardDirectoryReader(segments_3:11:nrt _0(5.0):C5 _2(5.0):C1 _3(5.0):C1)}
[junit4:junit4]   2> 5906 T2022 oasc.CachingDirectoryFactory.close Releasing directory:/mnt/ssd/jenkins/workspace/Lucene-Solr-trunk-Linux/solr/build/solr-core/test/J1/./solrtest-SoftAutoCommitTest-1358858753631/index
[junit4:junit4]   2> 5911 T2014 C124 UPDATE [collection1] webapp=null path=null params={} {add=[530]} 0 1
[junit4:junit4]   2> 6411 T2024 oasu.DirectUpdateHandler2.commit start commit{,optimize=false,openSearcher=true,waitSearcher=true,expungeDeletes=false,softCommit=true}
[junit4:junit4]   2> 6411 T2024 oasc.CachingDirectoryFactory.close Releasing directory:/mnt/ssd/jenkins/workspace/Lucene-Solr-trunk-Linux/solr/build/solr-core/test/J1/./solrtest-SoftAutoCommitTest-1358858753631
[junit4:junit4]   2> 6414 T2024 oass.SolrIndexSearcher.<init> Opening Searcher@abf10d main
[junit4:junit4]   2> 6415 T2024 oasu.DirectUpdateHandler2.commit end_commit_flush
[junit4:junit4]   2> 6417 T2022 oasc.SolrCore.registerSearcher [collection1] Registered new searcher Searcher@abf10d main{StandardDirectoryReader(segments_3:13:nrt _0(5.0):C5 _2(5.0):C1 _3(5.0):C1 _4(5.0):C1)}
[junit4:junit4]   2> 6418 T2022 oasc.CachingDirectoryFactory.close Releasing directory:/mnt/ssd/jenkins/workspace/Lucene-Solr-trunk-Linux/solr/build/solr-core/test/J1/./solrtest-SoftAutoCommitTest-1358858753631/index
[junit4:junit4]   2> 6600 T2023 oasu.DirectUpdateHandler2.commit start commit{,optimize=false,openSearcher=true,waitSearcher=true,expungeDeletes=false,softCommit=false}
[junit4:junit4]   2> 6600 T2023 oasc.SolrDeletionPolicy.onCommit SolrDeletionPolicy.onCommit: commits:num=2
[junit4:junit4]   2> 		commit{dir=RateLimitedDirectoryWrapper(MockDirWrapper(org.apache.lucene.store.RAMDirectory@f953d7 lockFactory=org.apache.lucene.store.NativeFSLockFactory@1916f2c)),segFN=segments_3,generation=3,filenames=[_2.si, _2.fld, _0_1.len, _0_6.len, _0_5.len, _2.inf, _0_7.len, _2_3.len, _2_6.len, _2_1.len, _0.pst, _0.fld, _2_7.len, _0_4.len, _2.pst, _2_5.len, _0_3.len, _0.inf, _0.si, _2_4.len, segments_3]
[junit4:junit4]   2> 		commit{dir=RateLimitedDirectoryWrapper(MockDirWrapper(org.apache.lucene.store.RAMDirectory@f953d7 lockFactory=org.apache.lucene.store.NativeFSLockFactory@1916f2c)),segFN=segments_4,generation=4,filenames=[_2.si, _3.fld, _3_5.len, _4.fld, _0_1.len, _3_7.len, _0_7.len, _2.inf, _3_4.len, _3_6.len, _4_7.len, _2_6.len, _3.pst, _2_7.len, _2_5.len, _4_5.len, _0.si, _3_3.len, _2_4.len, _4_6.len, _2.fld, _4_3.len, _0_5.len, _0_6.len, _4.si, _4_1.len, _4.inf, _2_3.len, _4_4.len, _0.pst, _2_1.len, _0.fld, _3_1.len, _4.pst, _2.pst, _0_4.len, _3.inf, _0_3.len, _3.si, _0.inf, segments_4]
[junit4:junit4]   2> 6601 T2023 oasc.SolrDeletionPolicy.updateCommits newest commit = 4[_2.si, _3.fld, _3_5.len, _4.fld, _0_1.len, _3_7.len, _0_7.len, _2.inf, _3_4.len, _3_6.len, _4_7.len, _2_6.len, _3.pst, _2_7.len, _2_5.len, _4_5.len, _0.si, _3_3.len, _2_4.len, _4_6.len, _2.fld, _4_3.len, _0_5.len, _0_6.len, _4.si, _4_1.len, _4.inf, _2_3.len, _4_4.len, _0.pst, _2_1.len, _0.fld, _3_1.len, _4.pst, _2.pst, _0_4.len, _3.inf, _0_3.len, _3.si, _0.inf, segments_4]
[junit4:junit4]   2> 6601 T2023 oasc.CachingDirectoryFactory.close Releasing directory:/mnt/ssd/jenkins/workspace/Lucene-Solr-trunk-Linux/solr/build/solr-core/test/J1/./solrtest-SoftAutoCommitTest-1358858753631
[junit4:junit4]   2> 6601 T2023 oass.SolrIndexSearcher.<init> Opening Searcher@1a3c975 main
[junit4:junit4]   2> 6602 T2023 oasu.DirectUpdateHandler2.commit end_commit_flush
[junit4:junit4]   2> 6603 T2022 oasc.SolrCore.registerSearcher [collection1] Registered new searcher Searcher@1a3c975 main{StandardDirectoryReader(segments_3:13:nrt _0(5.0):C5 _2(5.0):C1 _3(5.0):C1 _4(5.0):C1)}
[junit4:junit4]   2> 6603 T2022 oasc.CachingDirectoryFactory.close Releasing directory:/mnt/ssd/jenkins/workspace/Lucene-Solr-trunk-Linux/solr/build/solr-core/test/J1/./solrtest-SoftAutoCommitTest-1358858753631/index
[junit4:junit4]   2> 9802 T2014 oas.SolrTestCaseJ4.tearDown ###Ending testSoftAndHardCommitMaxTimeMixedAdds
[junit4:junit4]   2> 9803 T2014 oas.SolrTestCaseJ4.deleteCore ###deleteCore
[junit4:junit4]   2> 9803 T2014 oasc.CoreContainer.shutdown Shutting down CoreContainer instance=13961794
[junit4:junit4]   2> 9804 T2014 oasc.SolrCore.close [collection1]  CLOSING SolrCore org.apache.solr.core.SolrCore@14d3638
[junit4:junit4]   2> 9812 T2014 oasu.DirectUpdateHandler2.close closing DirectUpdateHandler2{commits=3,autocommit maxTime=1200ms,autocommits=1,soft autocommit maxTime=500ms,soft autocommits=2,optimizes=0,rollbacks=0,expungeDeletes=0,docsPending=0,adds=0,deletesById=0,deletesByQuery=0,errors=0,cumulative_adds=2,cumulative_deletesById=0,cumulative_deletesByQuery=0,cumulative_errors=0}
[junit4:junit4]   2> 9812 T2014 oasc.SolrCore.decrefSolrCoreState Closing SolrCoreState
[junit4:junit4]   2> 9812 T2014 oasu.DefaultSolrCoreState.closeIndexWriter SolrCoreState ref count has reached 0 - closing IndexWriter
[junit4:junit4]   2> 9813 T2014 oasu.DefaultSolrCoreState.closeIndexWriter closing IndexWriter with IndexWriterCloser
[junit4:junit4]   2> 9813 T2014 C124 oasc.CachingDirectoryFactory.close Releasing directory:/mnt/ssd/jenkins/workspace/Lucene-Solr-trunk-Linux/solr/build/solr-core/test/J1/./solrtest-SoftAutoCommitTest-1358858753631/index
[junit4:junit4]   2> 9813 T2014 oasc.SolrCore.closeSearcher [collection1] Closing main searcher on request.
[junit4:junit4]   2> 9814 T2014 oasc.CachingDirectoryFactory.close Releasing directory:/mnt/ssd/jenkins/workspace/Lucene-Solr-trunk-Linux/solr/build/solr-core/test/J1/./solrtest-SoftAutoCommitTest-1358858753631/index
[junit4:junit4]   2> 9814 T2014 oasc.CachingDirectoryFactory.close Closing directory when closing factory:/mnt/ssd/jenkins/workspace/Lucene-Solr-trunk-Linux/solr/build/solr-core/test/J1/./solrtest-SoftAutoCommitTest-1358858753631
[junit4:junit4]   2> 9814 T2014 oasc.CachingDirectoryFactory.closeDirectory Closing directory:/mnt/ssd/jenkins/workspace/Lucene-Solr-trunk-Linux/solr/build/solr-core/test/J1/./solrtest-SoftAutoCommitTest-1358858753631
[junit4:junit4]   2> 130039 T2014 oasc.CachingDirectoryFactory.close SEVERE Timeout waiting for all directory ref counts to be released
[junit4:junit4]   2> 130040 T2014 oasc.SolrException.log SEVERE Error closing directory:java.lang.AssertionError: 1
[junit4:junit4]   2> 		at org.apache.solr.core.CachingDirectoryFactory.close(CachingDirectoryFactory.java:139)
[junit4:junit4]   2> 		at org.apache.solr.core.SolrCore.close(SolrCore.java:1011)
[junit4:junit4]   2> 		at org.apache.solr.core.CoreContainer.shutdown(CoreContainer.java:753)
[junit4:junit4]   2> 		at org.apache.solr.util.TestHarness.close(TestHarness.java:449)
[junit4:junit4]   2> 		at org.apache.solr.SolrTestCaseJ4.deleteCore(SolrTestCaseJ4.java:418)
[junit4:junit4]   2> 		at org.apache.solr.SolrTestCaseJ4.afterClass(SolrTestCaseJ4.java:95)
[junit4:junit4]   2> 		at sun.reflect.GeneratedMethodAccessor17.invoke(Unknown Source)
[junit4:junit4]   2> 		at sun.reflect.DelegatingMethodAccessorImpl.invoke(DelegatingMethodAccessorImpl.java:43)
[junit4:junit4]   2> 		at java.lang.reflect.Method.invoke(Method.java:601)
[junit4:junit4]   2> 		at com.carrotsearch.randomizedtesting.RandomizedRunner.invoke(RandomizedRunner.java:1559)
[junit4:junit4]   2> 		at com.carrotsearch.randomizedtesting.RandomizedRunner.access$600(RandomizedRunner.java:79)
[junit4:junit4]   2> 		at com.carrotsearch.randomizedtesting.RandomizedRunner$5.evaluate(RandomizedRunner.java:700)
[junit4:junit4]   2> 		at com.carrotsearch.randomizedtesting.rules.StatementAdapter.evaluate(StatementAdapter.java:36)
[junit4:junit4]   2> 		at com.carrotsearch.randomizedtesting.rules.SystemPropertiesRestoreRule$1.evaluate(SystemPropertiesRestoreRule.java:53)
[junit4:junit4]   2> 		at org.apache.lucene.util.AbstractBeforeAfterRule$1.evaluate(AbstractBeforeAfterRule.java:46)
[junit4:junit4]   2> 		at org.apache.lucene.util.TestRuleStoreClassName$1.evaluate(TestRuleStoreClassName.java:42)
[junit4:junit4]   2> 		at com.carrotsearch.randomizedtesting.rules.SystemPropertiesInvariantRule$1.evaluate(SystemPropertiesInvariantRule.java:55)
[junit4:junit4]   2> 		at com.carrotsearch.randomizedtesting.rules.NoShadowingOrOverridesOnMethodsRule$1.evaluate(NoShadowingOrOverridesOnMethodsRule.java:39)
[junit4:junit4]   2> 		at com.carrotsearch.randomizedtesting.rules.NoShadowingOrOverridesOnMethodsRule$1.evaluate(NoShadowingOrOverridesOnMethodsRule.java:39)
[junit4:junit4]   2> 		at com.carrotsearch.randomizedtesting.rules.StatementAdapter.evaluate(StatementAdapter.java:36)
[junit4:junit4]   2> 		at org.apache.lucene.util.TestRuleAssertionsRequired$1.evaluate(TestRuleAssertionsRequired.java:43)
[junit4:junit4]   2> 		at org.apache.lucene.util.TestRuleMarkFailure$1.evaluate(TestRuleMarkFailure.java:48)
[junit4:junit4]   2> 		at org.apache.lucene.util.TestRuleIgnoreAfterMaxFailures$1.evaluate(TestRuleIgnoreAfterMaxFailures.java:70)
[junit4:junit4]   2> 		at org.apache.lucene.util.TestRuleIgnoreTestSuites$1.evaluate(TestRuleIgnoreTestSuites.java:55)
[junit4:junit4]   2> 		at com.carrotsearch.randomizedtesting.rules.StatementAdapter.evaluate(StatementAdapter.java:36)
[junit4:junit4]   2> 		at com.carrotsearch.randomizedtesting.ThreadLeakControl$StatementRunner.run(ThreadLeakControl.java:358)
[junit4:junit4]   2> 		at java.lang.Thread.run(Thread.java:722)
[junit4:junit4]   2> 	
[junit4:junit4]   2> 251056 T2014 oas.SolrTestCaseJ4.endTrackingSearchers SEVERE ERROR: SolrIndexSearcher opens=12 closes=11
[junit4:junit4]   2> NOTE: test params are: codec=SimpleText, sim=DefaultSimilarity, locale=tr_TR, timezone=Etc/UCT
[junit4:junit4]   2> NOTE: Linux 3.2.0-36-generic i386/Oracle Corporation 1.7.0_10 (32-bit)/cpus=8,threads=1,free=276927536,total=433061888
[junit4:junit4]   2> NOTE: All tests run in this JVM: [XsltUpdateRequestHandlerTest, ZkCLITest, DebugComponentTest, ClusterStateTest, FullSolrCloudDistribCmdsTest, TestTrie, XmlUpdateRequestHandlerTest, TermVectorComponentTest, SolrIndexConfigTest, TestDFRSimilarityFactory, TestPropInject, TestRealTimeGet, TestRTGBase, URLClassifyProcessorTest, BasicZkTest, TestValueSourceCache, SchemaVersionSpecificBehaviorTest, TestDocSet, TestComponentsName, TestReplicationHandler, OverseerCollectionProcessorTest, TestRemoteStreaming, StandardRequestHandlerTest, TestHashPartitioner, ZkSolrClientTest, AnalysisAfterCoreReloadTest, DocumentAnalysisRequestHandlerTest, SolrInfoMBeanTest, RequiredFieldsTest, SpellingQueryConverterTest, UpdateParamsTest, TestFoldingMultitermQuery, ExternalFileFieldSortTest, TestArbitraryIndexDir, TestBinaryField, SuggesterTSTTest, TestLRUCache, IndexReaderFactoryTest, ShardRoutingTest, TestOmitPositions, StatelessScriptUpdateProcessorFactoryTest, ConvertedLegacyTest, ReturnFieldsTest, TestStressLucene, TestMergePolicyConfig, TestCSVResponseWriter, TimeZoneUtilsTest, TestSolrJ, DOMUtilTest, TestSolrCoreProperties, SuggesterTest, LeaderElectionTest, TestSolrXMLSerializer, BasicFunctionalityTest, TestCodecSupport, PingRequestHandlerTest, TermVectorComponentDistributedTest, BasicDistributedZkTest, TestDistributedSearch, SoftAutoCommitTest]
[junit4:junit4]   2> NOTE: reproduce with: ant test  -Dtestcase=SoftAutoCommitTest -Dtests.seed=E7CE84C9EC40FB1F -Dtests.multiplier=3 -Dtests.slow=true -Dtests.locale=tr_TR -Dtests.timezone=Etc/UCT -Dtests.file.encoding=UTF-8
[junit4:junit4] ERROR   0.00s J1 | SoftAutoCommitTest (suite) <<<
[junit4:junit4]    > Throwable #1: java.lang.AssertionError: ERROR: SolrIndexSearcher opens=12 closes=11
[junit4:junit4]    > 	at __randomizedtesting.SeedInfo.seed([E7CE84C9EC40FB1F]:0)
[junit4:junit4]    > 	at org.junit.Assert.fail(Assert.java:93)
[junit4:junit4]    > 	at org.apache.solr.SolrTestCaseJ4.endTrackingSearchers(SolrTestCaseJ4.java:246)
[junit4:junit4]    > 	at org.apache.solr.SolrTestCaseJ4.afterClass(SolrTestCaseJ4.java:97)
[junit4:junit4]    > 	at sun.reflect.GeneratedMethodAccessor17.invoke(Unknown Source)
[junit4:junit4]    > 	at sun.reflect.DelegatingMethodAccessorImpl.invoke(DelegatingMethodAccessorImpl.java:43)
[junit4:junit4]    > 	at java.lang.reflect.Method.invoke(Method.java:601)
[junit4:junit4]    > 	at com.carrotsearch.randomizedtesting.RandomizedRunner.invoke(RandomizedRunner.java:1559)
[junit4:junit4]    > 	at com.carrotsearch.randomizedtesting.RandomizedRunner.access$600(RandomizedRunner.java:79)
[junit4:junit4]    > 	at com.carrotsearch.randomizedtesting.RandomizedRunner$5.evaluate(RandomizedRunner.java:700)
[junit4:junit4]    > 	at com.carrotsearch.randomizedtesting.rules.StatementAdapter.evaluate(StatementAdapter.java:36)
[junit4:junit4]    > 	at com.carrotsearch.randomizedtesting.rules.SystemPropertiesRestoreRule$1.evaluate(SystemPropertiesRestoreRule.java:53)
[junit4:junit4]    > 	at org.apache.lucene.util.AbstractBeforeAfterRule$1.evaluate(AbstractBeforeAfterRule.java:46)
[junit4:junit4]    > 	at org.apache.lucene.util.TestRuleStoreClassName$1.evaluate(TestRuleStoreClassName.java:42)
[junit4:junit4]    > 	at com.carrotsearch.randomizedtesting.rules.SystemPropertiesInvariantRule$1.evaluate(SystemPropertiesInvariantRule.java:55)
[junit4:junit4]    > 	at com.carrotsearch.randomizedtesting.rules.NoShadowingOrOverridesOnMethodsRule$1.evaluate(NoShadowingOrOverridesOnMethodsRule.java:39)
[junit4:junit4]    > 	at com.carrotsearch.randomizedtesting.rules.NoShadowingOrOverridesOnMethodsRule$1.evaluate(NoShadowingOrOverridesOnMethodsRule.java:39)
[junit4:junit4]    > 	at com.carrotsearch.randomizedtesting.rules.StatementAdapter.evaluate(StatementAdapter.java:36)
[junit4:junit4]    > 	at org.apache.lucene.util.TestRuleAssertionsRequired$1.evaluate(TestRuleAssertionsRequired.java:43)
[junit4:junit4]    > 	at org.apache.lucene.util.TestRuleMarkFailure$1.evaluate(TestRuleMarkFailure.java:48)
[junit4:junit4]    > 	at org.apache.lucene.util.TestRuleIgnoreAfterMaxFailures$1.evaluate(TestRuleIgnoreAfterMaxFailures.java:70)
[junit4:junit4]    > 	at org.apache.lucene.util.TestRuleIgnoreTestSuites$1.evaluate(TestRuleIgnoreTestSuites.java:55)
[junit4:junit4]    > 	at com.carrotsearch.randomizedtesting.rules.StatementAdapter.evaluate(StatementAdapter.java:36)
[junit4:junit4]    > 	at com.carrotsearch.randomizedtesting.ThreadLeakControl$StatementRunner.run(ThreadLeakControl.java:358)
[junit4:junit4]    > 	at java.lang.Thread.run(Thread.java:722)
[junit4:junit4] Completed on J1 in 251.20s, 3 tests, 1 failure <<< FAILURES!

[...truncated 51 lines...]
BUILD FAILED
/mnt/ssd/jenkins/workspace/Lucene-Solr-trunk-Linux/build.xml:344: The following error occurred while executing this line:
/mnt/ssd/jenkins/workspace/Lucene-Solr-trunk-Linux/build.xml:39: The following error occurred while executing this line:
/mnt/ssd/jenkins/workspace/Lucene-Solr-trunk-Linux/solr/build.xml:178: The following error occurred while executing this line:
/mnt/ssd/jenkins/workspace/Lucene-Solr-trunk-Linux/solr/common-build.xml:428: The following error occurred while executing this line:
/mnt/ssd/jenkins/workspace/Lucene-Solr-trunk-Linux/lucene/common-build.xml:1176: The following error occurred while executing this line:
/mnt/ssd/jenkins/workspace/Lucene-Solr-trunk-Linux/lucene/common-build.xml:841: There were test failures: 247 suites, 1032 tests, 1 suite-level error, 9 ignored (4 assumptions)

Total time: 32 minutes 6 seconds
Build step 'Invoke Ant' marked build as failure
Archiving artifacts
Recording test results
Description set: Java: 32bit/jdk1.7.0_10 -server -XX:+UseG1GC
Email was triggered for: Failure
Sending email for trigger: Failure