You are viewing a plain text version of this content. The canonical link for it is here.
Posted to builds@beam.apache.org by Apache Jenkins Server <je...@builds.apache.org> on 2023/09/22 13:35:29 UTC
Build failed in Jenkins: beam_PerformanceTests_Kafka_IO #4076
See <https://ci-beam.apache.org/job/beam_PerformanceTests_Kafka_IO/4076/display/redirect>
Changes:
------------------------------------------
[...truncated 812.60 KB...]
at org.apache.beam.sdk.io.kafka.KafkaWriter.checkForFailures(KafkaWriter.java:149)
at org.apache.beam.sdk.io.kafka.KafkaWriter.processElement(KafkaWriter.java:62)
Caused by: org.apache.kafka.common.errors.UnknownTopicOrPartitionException: This server does not host this topic-partition.
Sep 22, 2023 1:11:11 PM org.apache.beam.runners.dataflow.util.MonitoringUtil$LoggingHandler process
SEVERE: 2023-09-22T13:11:08.227Z: java.io.IOException: KafkaWriter : failed to send 148 records (since last report)
at org.apache.beam.sdk.io.kafka.KafkaWriter.checkForFailures(KafkaWriter.java:149)
at org.apache.beam.sdk.io.kafka.KafkaWriter.processElement(KafkaWriter.java:62)
Caused by: org.apache.kafka.common.errors.UnknownTopicOrPartitionException: This server does not host this topic-partition.
Sep 22, 2023 1:11:11 PM org.apache.beam.runners.dataflow.util.MonitoringUtil$LoggingHandler process
SEVERE: 2023-09-22T13:11:08.431Z: java.io.IOException: KafkaWriter : failed to send 148 records (since last report)
at org.apache.beam.sdk.io.kafka.KafkaWriter.checkForFailures(KafkaWriter.java:149)
at org.apache.beam.sdk.io.kafka.KafkaWriter.processElement(KafkaWriter.java:62)
Caused by: org.apache.kafka.common.errors.UnknownTopicOrPartitionException: This server does not host this topic-partition.
Sep 22, 2023 1:11:11 PM org.apache.beam.runners.dataflow.util.MonitoringUtil$LoggingHandler process
SEVERE: 2023-09-22T13:11:08.455Z: java.io.IOException: KafkaWriter : failed to send 148 records (since last report)
at org.apache.beam.sdk.io.kafka.KafkaWriter.checkForFailures(KafkaWriter.java:149)
at org.apache.beam.sdk.io.kafka.KafkaWriter.processElement(KafkaWriter.java:62)
Caused by: org.apache.kafka.common.errors.UnknownTopicOrPartitionException: This server does not host this topic-partition.
Sep 22, 2023 1:11:11 PM org.apache.beam.runners.dataflow.util.MonitoringUtil$LoggingHandler process
SEVERE: 2023-09-22T13:11:08.596Z: java.io.IOException: KafkaWriter : failed to send 148 records (since last report)
at org.apache.beam.sdk.io.kafka.KafkaWriter.checkForFailures(KafkaWriter.java:149)
at org.apache.beam.sdk.io.kafka.KafkaWriter.processElement(KafkaWriter.java:62)
Caused by: org.apache.kafka.common.errors.UnknownTopicOrPartitionException: This server does not host this topic-partition.
Sep 22, 2023 1:11:11 PM org.apache.beam.runners.dataflow.util.MonitoringUtil$LoggingHandler process
SEVERE: 2023-09-22T13:11:08.635Z: java.io.IOException: KafkaWriter : failed to send 148 records (since last report)
at org.apache.beam.sdk.io.kafka.KafkaWriter.checkForFailures(KafkaWriter.java:149)
at org.apache.beam.sdk.io.kafka.KafkaWriter.processElement(KafkaWriter.java:62)
Caused by: org.apache.kafka.common.errors.UnknownTopicOrPartitionException: This server does not host this topic-partition.
Sep 22, 2023 1:12:18 PM org.apache.beam.runners.dataflow.util.MonitoringUtil$LoggingHandler process
INFO: 2023-09-22T13:12:17.000Z: Finished operation Generate records+Measure write time+Write to Kafka/Kafka ProducerRecord/Map+Write to Kafka/KafkaIO.WriteRecords/ParDo(KafkaWriter)
Sep 22, 2023 1:12:18 PM org.apache.beam.runners.dataflow.util.MonitoringUtil$LoggingHandler process
INFO: 2023-09-22T13:12:17.142Z: Cleaning up.
Sep 22, 2023 1:12:18 PM org.apache.beam.runners.dataflow.util.MonitoringUtil$LoggingHandler process
INFO: 2023-09-22T13:12:17.206Z: Stopping **** pool...
Sep 22, 2023 1:14:44 PM org.apache.beam.runners.dataflow.util.MonitoringUtil$LoggingHandler process
INFO: 2023-09-22T13:14:43.020Z: Autoscaling: Resized **** pool from 5 to 0.
Sep 22, 2023 1:14:44 PM org.apache.beam.runners.dataflow.util.MonitoringUtil$LoggingHandler process
INFO: 2023-09-22T13:14:43.094Z: Worker pool stopped.
Sep 22, 2023 1:14:48 PM org.apache.beam.runners.dataflow.DataflowPipelineJob logTerminalState
INFO: Job 2023-09-22_06_05_40-8798646580656953548 finished with status DONE.
Sep 22, 2023 1:14:48 PM org.apache.beam.runners.dataflow.DataflowRunner validateSdkContainerImageOptions
WARNING: Prefer --sdkContainerImage over deprecated legacy option --****HarnessContainerImage.
Sep 22, 2023 1:14:48 PM org.apache.beam.sdk.extensions.gcp.options.GcpOptions$GcpTempLocationFactory tryCreateDefaultBucket
INFO: No tempLocation specified, attempting to use default bucket: dataflow-staging-us-central1-844138762903
Sep 22, 2023 1:14:49 PM org.apache.beam.sdk.extensions.gcp.util.RetryHttpRequestInitializer$LoggingHttpBackOffHandler handleResponse
WARNING: Request failed with code 409, performed 0 retries due to IOExceptions, performed 0 retries due to unsuccessful status codes, HTTP framework says request can be retried, (caller responsible for retrying): https://storage.googleapis.com/storage/v1/b?predefinedAcl=projectPrivate&predefinedDefaultObjectAcl=projectPrivate&project=apache-beam-testing.
Sep 22, 2023 1:14:49 PM org.apache.beam.runners.dataflow.options.DataflowPipelineOptions$StagingLocationFactory create
INFO: No stagingLocation provided, falling back to gcpTempLocation
Sep 22, 2023 1:14:49 PM org.apache.beam.runners.dataflow.DataflowRunner fromOptions
INFO: PipelineOptions.filesToStage was not specified. Defaulting to files from the classpath: will stage 286 files. Enable logging at DEBUG level to see which files will be staged.
Sep 22, 2023 1:14:49 PM org.apache.beam.runners.dataflow.DataflowRunner run
INFO: Executing pipeline on the Dataflow Service, which will have billing implications related to Google Compute Engine usage and other Google Cloud Services.
Sep 22, 2023 1:14:52 PM org.apache.beam.runners.dataflow.util.PackageUtil stageClasspathElements
INFO: Uploading 287 files from PipelineOptions.filesToStage to staging location to prepare for execution.
Sep 22, 2023 1:14:52 PM org.apache.beam.runners.dataflow.util.PackageUtil$PackageAttributes forFileToStage
INFO: Staging custom dataflow-****.jar as beam-runners-google-cloud-dataflow-java-legacy-****-2.52.0-SNAPSHOT-glfbcrBR9BTDZ-lH4VvVl2hCZIK35Tfrdy17DkL9CaI.jar
Sep 22, 2023 1:14:53 PM org.apache.beam.runners.dataflow.util.PackageUtil stageClasspathElements
INFO: Staging files complete: 287 files cached, 0 files newly uploaded in 0 seconds
Sep 22, 2023 1:14:53 PM org.apache.beam.runners.dataflow.DataflowRunner run
INFO: Staging portable pipeline proto to gs://dataflow-staging-us-central1-844138762903/temp/staging/
Sep 22, 2023 1:14:53 PM org.apache.beam.runners.dataflow.util.PackageUtil tryStagePackage
INFO: Uploading <218227 bytes, hash 1d46559c6c8a0da660f1a0bf787baa49e7075f547898d7ef1678c708b90d7101> to gs://dataflow-staging-us-central1-844138762903/temp/staging/pipeline-HUZVnGyKDaZg8aC_eHuqSecHX1R4mNfvFnjHCLkNcQE.pb
Sep 22, 2023 1:14:56 PM org.apache.beam.runners.dataflow.DataflowPipelineTranslator$Translator addStep
INFO: Adding Read from bounded Kafka/KafkaIO.Read.ReadFromKafkaViaUnbounded/Read(KafkaUnboundedSource)/Create/Impulse as step s1
Sep 22, 2023 1:14:56 PM org.apache.beam.runners.dataflow.DataflowPipelineTranslator$Translator addStep
INFO: Adding Read from bounded Kafka/KafkaIO.Read.ReadFromKafkaViaUnbounded/Read(KafkaUnboundedSource)/Create/MapElements/Map as step s2
Sep 22, 2023 1:14:56 PM org.apache.beam.runners.dataflow.DataflowPipelineTranslator$Translator addStep
INFO: Adding Read from bounded Kafka/KafkaIO.Read.ReadFromKafkaViaUnbounded/Read(KafkaUnboundedSource)/Split as step s3
Sep 22, 2023 1:14:56 PM org.apache.beam.runners.dataflow.DataflowPipelineTranslator$Translator addStep
INFO: Adding Read from bounded Kafka/KafkaIO.Read.ReadFromKafkaViaUnbounded/Read(KafkaUnboundedSource)/Reshuffle/Pair with random key as step s4
Sep 22, 2023 1:14:56 PM org.apache.beam.runners.dataflow.DataflowPipelineTranslator$Translator addStep
INFO: Adding Read from bounded Kafka/KafkaIO.Read.ReadFromKafkaViaUnbounded/Read(KafkaUnboundedSource)/Reshuffle/Reshuffle/Window.Into()/Window.Assign as step s5
Sep 22, 2023 1:14:56 PM org.apache.beam.runners.dataflow.DataflowPipelineTranslator$Translator addStep
INFO: Adding Read from bounded Kafka/KafkaIO.Read.ReadFromKafkaViaUnbounded/Read(KafkaUnboundedSource)/Reshuffle/Reshuffle/GroupByKey as step s6
Sep 22, 2023 1:14:56 PM org.apache.beam.runners.dataflow.DataflowPipelineTranslator$Translator addStep
INFO: Adding Read from bounded Kafka/KafkaIO.Read.ReadFromKafkaViaUnbounded/Read(KafkaUnboundedSource)/Reshuffle/Reshuffle/ExpandIterable as step s7
Sep 22, 2023 1:14:56 PM org.apache.beam.runners.dataflow.DataflowPipelineTranslator$Translator addStep
INFO: Adding Read from bounded Kafka/KafkaIO.Read.ReadFromKafkaViaUnbounded/Read(KafkaUnboundedSource)/Reshuffle/Values/Values/Map as step s8
Sep 22, 2023 1:14:56 PM org.apache.beam.runners.dataflow.DataflowPipelineTranslator$Translator addStep
INFO: Adding Read from bounded Kafka/KafkaIO.Read.ReadFromKafkaViaUnbounded/Read(KafkaUnboundedSource)/Read as step s9
Sep 22, 2023 1:14:56 PM org.apache.beam.runners.dataflow.DataflowPipelineTranslator$Translator addStep
INFO: Adding Read from bounded Kafka/KafkaIO.Read.ReadFromKafkaViaUnbounded/Read(KafkaUnboundedSource)/StripIds as step s10
Sep 22, 2023 1:14:56 PM org.apache.beam.runners.dataflow.DataflowPipelineTranslator$Translator addStep
INFO: Adding Measure read time as step s11
Sep 22, 2023 1:14:56 PM org.apache.beam.runners.dataflow.DataflowPipelineTranslator$Translator addStep
INFO: Adding Counting element/WithKeys/AddKeys/Map as step s12
Sep 22, 2023 1:14:56 PM org.apache.beam.runners.dataflow.DataflowPipelineTranslator$Translator addStep
INFO: Adding Counting element/Combine.perKey(Count)/GroupByKey as step s13
Sep 22, 2023 1:14:56 PM org.apache.beam.runners.dataflow.DataflowPipelineTranslator$Translator addStep
INFO: Adding Counting element/Combine.perKey(Count)/Combine.GroupedValues as step s14
Sep 22, 2023 1:14:56 PM org.apache.beam.runners.dataflow.DataflowPipelineTranslator$Translator addStep
INFO: Adding Counting element/Values/Values/Map as step s15
Sep 22, 2023 1:14:56 PM org.apache.beam.runners.dataflow.DataflowPipelineTranslator$Translator addStep
INFO: Adding Counting element/View.AsIterable/ParDo(ToIsmRecordForGlobalWindow) as step s16
Sep 22, 2023 1:14:56 PM org.apache.beam.runners.dataflow.DataflowPipelineTranslator$Translator addStep
INFO: Adding Counting element/View.AsIterable/CreateDataflowView as step s17
Sep 22, 2023 1:14:56 PM org.apache.beam.runners.dataflow.DataflowPipelineTranslator$Translator addStep
INFO: Adding Counting element/CreateVoid/Impulse as step s18
Sep 22, 2023 1:14:56 PM org.apache.beam.runners.dataflow.DataflowPipelineTranslator$Translator addStep
INFO: Adding Counting element/CreateVoid/MapElements/Map as step s19
Sep 22, 2023 1:14:56 PM org.apache.beam.runners.dataflow.DataflowPipelineTranslator$Translator addStep
INFO: Adding Counting element/ProduceDefault as step s20
Sep 22, 2023 1:14:56 PM org.apache.beam.runners.dataflow.DataflowPipelineTranslator$Translator addStep
INFO: Adding Counting element/Flatten.PCollections as step s21
Sep 22, 2023 1:14:56 PM org.apache.beam.runners.dataflow.DataflowPipelineTranslator$Translator addStep
INFO: Adding PAssert$0/GroupGlobally/Reify.Window/ParDo(Anonymous) as step s22
Sep 22, 2023 1:14:56 PM org.apache.beam.runners.dataflow.DataflowPipelineTranslator$Translator addStep
INFO: Adding PAssert$0/GroupGlobally/ParDo(ToSingletonIterables) as step s23
Sep 22, 2023 1:14:56 PM org.apache.beam.runners.dataflow.DataflowPipelineTranslator$Translator addStep
INFO: Adding PAssert$0/GroupGlobally/Create.Values/Impulse as step s24
Sep 22, 2023 1:14:56 PM org.apache.beam.runners.dataflow.DataflowPipelineTranslator$Translator addStep
INFO: Adding PAssert$0/GroupGlobally/Create.Values/MapElements/Map as step s25
Sep 22, 2023 1:14:56 PM org.apache.beam.runners.dataflow.DataflowPipelineTranslator$Translator addStep
INFO: Adding PAssert$0/GroupGlobally/Flatten.PCollections as step s26
Sep 22, 2023 1:14:56 PM org.apache.beam.runners.dataflow.DataflowPipelineTranslator$Translator addStep
INFO: Adding PAssert$0/GroupGlobally/Window.Into()/Flatten.PCollections as step s27
Sep 22, 2023 1:14:56 PM org.apache.beam.runners.dataflow.DataflowPipelineTranslator$Translator addStep
INFO: Adding PAssert$0/GroupGlobally/WithKeys/AddKeys/Map as step s28
Sep 22, 2023 1:14:56 PM org.apache.beam.runners.dataflow.DataflowPipelineTranslator$Translator addStep
INFO: Adding PAssert$0/GroupGlobally/GroupByKey as step s29
Sep 22, 2023 1:14:56 PM org.apache.beam.runners.dataflow.DataflowPipelineTranslator$Translator addStep
INFO: Adding PAssert$0/GroupGlobally/Values/Values/Map as step s30
Sep 22, 2023 1:14:56 PM org.apache.beam.runners.dataflow.DataflowPipelineTranslator$Translator addStep
INFO: Adding PAssert$0/GroupGlobally/ParDo(Concat) as step s31
Sep 22, 2023 1:14:56 PM org.apache.beam.runners.dataflow.DataflowPipelineTranslator$Translator addStep
INFO: Adding PAssert$0/GetPane/Map as step s32
Sep 22, 2023 1:14:56 PM org.apache.beam.runners.dataflow.DataflowPipelineTranslator$Translator addStep
INFO: Adding PAssert$0/RunChecks as step s33
Sep 22, 2023 1:14:56 PM org.apache.beam.runners.dataflow.DataflowPipelineTranslator$Translator addStep
INFO: Adding PAssert$0/VerifyAssertions/ParDo(DefaultConclude) as step s34
Sep 22, 2023 1:14:56 PM org.apache.beam.runners.dataflow.DataflowRunner run
INFO: Dataflow SDK version: 2.52.0-SNAPSHOT
Sep 22, 2023 1:14:57 PM org.apache.beam.runners.dataflow.DataflowRunner run
INFO: To access the Dataflow monitoring console, please navigate to https://console.cloud.google.com/dataflow/jobs/us-central1/2023-09-22_06_14_56-3221124926172536763?project=apache-beam-testing
Sep 22, 2023 1:14:57 PM org.apache.beam.runners.dataflow.DataflowRunner run
INFO: Submitted job: 2023-09-22_06_14_56-3221124926172536763
Sep 22, 2023 1:14:57 PM org.apache.beam.runners.dataflow.DataflowRunner run
INFO: To cancel the job using the 'gcloud' tool, run:
> gcloud dataflow jobs --project=apache-beam-testing cancel --region=us-central1 2023-09-22_06_14_56-3221124926172536763
Sep 22, 2023 1:15:47 PM org.apache.beam.sdk.metrics.MetricsEnvironment getCurrentContainer
WARNING: Reporting metrics are not supported in the current execution environment.
Sep 22, 2023 1:35:24 PM org.apache.beam.runners.dataflow.DataflowPipelineJob logTerminalState
INFO: Job 2023-09-22_06_14_56-3221124926172536763 failed with status FAILED.
Sep 22, 2023 1:35:24 PM org.apache.kafka.common.config.AbstractConfig logAll
INFO: AdminClientConfig values:
bootstrap.servers = [104.155.166.159:32407, 35.188.87.216:32408, 104.198.150.142:32409]
client.dns.lookup = default
client.id =
connections.max.idle.ms = 300000
metadata.max.age.ms = 300000
metric.reporters = []
metrics.num.samples = 2
metrics.recording.level = INFO
metrics.sample.window.ms = 30000
receive.buffer.bytes = 65536
reconnect.backoff.max.ms = 1000
reconnect.backoff.ms = 50
request.timeout.ms = 120000
retries = 5
retry.backoff.ms = 100
sasl.client.callback.handler.class = null
sasl.jaas.config = null
sasl.kerberos.kinit.cmd = /usr/bin/kinit
sasl.kerberos.min.time.before.relogin = 60000
sasl.kerberos.service.name = null
sasl.kerberos.ticket.renew.jitter = 0.05
sasl.kerberos.ticket.renew.window.factor = 0.8
sasl.login.callback.handler.class = null
sasl.login.class = null
sasl.login.refresh.buffer.seconds = 300
sasl.login.refresh.min.period.seconds = 60
sasl.login.refresh.window.factor = 0.8
sasl.login.refresh.window.jitter = 0.05
sasl.mechanism = GSSAPI
security.protocol = PLAINTEXT
security.providers = null
send.buffer.bytes = 131072
ssl.cipher.suites = null
ssl.enabled.protocols = [TLSv1.2, TLSv1.1, TLSv1]
ssl.endpoint.identification.algorithm = https
ssl.key.password = null
ssl.keymanager.algorithm = SunX509
ssl.keystore.location = null
ssl.keystore.password = null
ssl.keystore.type = JKS
ssl.protocol = TLS
ssl.provider = null
ssl.secure.random.implementation = null
ssl.trustmanager.algorithm = PKIX
ssl.truststore.location = null
ssl.truststore.password = null
ssl.truststore.type = JKS
Sep 22, 2023 1:35:24 PM org.apache.kafka.common.utils.AppInfoParser$AppInfo <init>
INFO: Kafka version: 2.4.1
Sep 22, 2023 1:35:24 PM org.apache.kafka.common.utils.AppInfoParser$AppInfo <init>
INFO: Kafka commitId: c57222ae8cd7866b
Sep 22, 2023 1:35:24 PM org.apache.kafka.common.utils.AppInfoParser$AppInfo <init>
INFO: Kafka startTimeMs: 1695389724960
Gradle Test Executor 1 finished executing tests.
> Task :sdks:java:io:kafka:integrationTest FAILED
org.apache.beam.sdk.io.kafka.KafkaIOIT > testKafkaIOReadsAndWritesCorrectlyInBatch FAILED
java.lang.AssertionError: Values should be different. Actual: FAILED
at org.junit.Assert.fail(Assert.java:89)
at org.junit.Assert.failEquals(Assert.java:187)
at org.junit.Assert.assertNotEquals(Assert.java:163)
at org.junit.Assert.assertNotEquals(Assert.java:177)
at org.apache.beam.sdk.io.kafka.KafkaIOIT.testKafkaIOReadsAndWritesCorrectlyInBatch(KafkaIOIT.java:260)
1 test completed, 1 failed
Finished generating test XML results (0.065 secs) into: <https://ci-beam.apache.org/job/beam_PerformanceTests_Kafka_IO/ws/src/sdks/java/io/kafka/build/test-results/integrationTest>
Generating HTML test report...
Finished generating test html results (0.113 secs) into: <https://ci-beam.apache.org/job/beam_PerformanceTests_Kafka_IO/ws/src/sdks/java/io/kafka/build/reports/tests/integrationTest>
FAILURE: Build failed with an exception.
* What went wrong:
Execution failed for task ':sdks:java:io:kafka:integrationTest'.
> There were failing tests. See the report at: file://<https://ci-beam.apache.org/job/beam_PerformanceTests_Kafka_IO/ws/src/sdks/java/io/kafka/build/reports/tests/integrationTest/index.html>
* Try:
> Run with --stacktrace option to get the stack trace.
> Run with --debug option to get more log output.
* Get more help at https://help.gradle.org
Deprecated Gradle features were used in this build, making it incompatible with Gradle 8.0.
You can use '--warning-mode all' to show the individual deprecation warnings and determine if they come from your own scripts or plugins.
See https://docs.gradle.org/7.6.2/userguide/command_line_interface.html#sec:command_line_warnings
BUILD FAILED in 30m 25s
148 actionable tasks: 1 executed, 147 up-to-date
Publishing build scan...
https://ge.apache.org/s/472v4irod5yhe
Build step 'Invoke Gradle script' changed build result to FAILURE
Build step 'Invoke Gradle script' marked build as failure
---------------------------------------------------------------------
To unsubscribe, e-mail: builds-unsubscribe@beam.apache.org
For additional commands, e-mail: builds-help@beam.apache.org
Jenkins build is back to normal : beam_PerformanceTests_Kafka_IO #4077
Posted by Apache Jenkins Server <je...@builds.apache.org>.
See <https://ci-beam.apache.org/job/beam_PerformanceTests_Kafka_IO/4077/display/redirect?page=changes>
---------------------------------------------------------------------
To unsubscribe, e-mail: builds-unsubscribe@beam.apache.org
For additional commands, e-mail: builds-help@beam.apache.org