You are viewing a plain text version of this content. The canonical link for it is here.
Posted to notifications@maven.apache.org by Apache Jenkins Server <je...@builds.apache.org> on 2017/12/17 10:54:54 UTC

Build unstable in Jenkins: Maven TLP » maven-pmd-plugin » master #4

See https://builds.apache.org/job/maven-box/job/maven-pmd-plugin/job/master/4/

Changes:

* [MPMD-245] targetJdk property should use maven.compiler.source by
* [MPMD-245] targetJdk property should use maven.compiler.source by
* [MPMD-245] targetJdk property should use maven.compiler.source by
* [MPMD-245] targetJdk property should use maven.compiler.source by
* [MPMD-245] targetJdk property should use maven.compiler.source by
* [MPMD-245] targetJdk property should use maven.compiler.source by

2 tests failed.
FAILED:  org.apache.maven.plugins.pmd.PmdReportTest.testFileURL

Error Message:
java.lang.RuntimeException: java.net.BindException: Address already in use

Stack Trace:
com.github.tomakehurst.wiremock.common.FatalStartupException: java.lang.RuntimeException: java.net.BindException: Address already in use
	at org.apache.maven.plugins.pmd.PmdReportTest.testFileURL(PmdReportTest.java:151)
Caused by: java.lang.RuntimeException: java.net.BindException: Address already in use
	at org.apache.maven.plugins.pmd.PmdReportTest.testFileURL(PmdReportTest.java:151)
Caused by: java.net.BindException: Address already in use
	at org.apache.maven.plugins.pmd.PmdReportTest.testFileURL(PmdReportTest.java:151)


FAILED:  org.apache.maven.plugins.pmd.PmdReportTest.testEmptyReportConfiguration

Error Message:
File f:\jenkins\jenkins-slave\workspace\box_maven-pmd-plugin_master-723XUI4HKC5A6CYF5JA2PBPNJGNR6SKD4M55XBOMRDY4Z3ISJGVQ\m\target\test\unit\default-configuration\target\cpd.xml unable to be deleted.

Stack Trace:
java.io.IOException: File f:\jenkins\jenkins-slave\workspace\box_maven-pmd-plugin_master-723XUI4HKC5A6CYF5JA2PBPNJGNR6SKD4M55XBOMRDY4Z3ISJGVQ\m\target\test\unit\default-configuration\target\cpd.xml unable to be deleted.
	at org.apache.maven.plugins.pmd.PmdReportTest.setUp(PmdReportTest.java:52)




Build log:
[...truncated 2.05 MB...]
[windows-jdk8] [withMaven] junitPublisher - Jenkins JUnit Attachments Plugin not found, can't publish test attachments.Recording test results
[windows-jdk8] None of the test reports contained any result
[windows-jdk8] [withMaven] Skip 'Findbugs Publisher' disabled by configuration
[windows-jdk8] [withMaven] Skip 'Open Task Scanner Publisher' disabled by configuration
[windows-jdk8] [withMaven] Skip 'Generated Artifacts Publisher' disabled by configuration
[windows-jdk8] [withMaven] junitPublisher - Archive test results for Maven artifact org.apache.maven.plugins.pmd.its:MPMD-205-pmd-js-check:1.0-SNAPSHOT generated by maven-surefire-plugin:test (default-test): m\target\it\MPMD-205-pmd-js-check\target\surefire-reports\*.xml
[windows-jdk8] [withMaven] junitPublisher - Jenkins JUnit Attachments Plugin not found, can't publish test attachments.Recording test results
[windows-jdk8] None of the test reports contained any result
[windows-jdk8] [withMaven] Skip 'Findbugs Publisher' disabled by configuration
[windows-jdk8] [withMaven] Skip 'Open Task Scanner Publisher' disabled by configuration
[windows-jdk8] [withMaven] Skip 'Generated Artifacts Publisher' disabled by configuration
[windows-jdk8] [withMaven] junitPublisher - Archive test results for Maven artifact org.apache.maven.plugins.pmd.its:MPMD-206-pmd-sourceDirectories-js:1.0-SNAPSHOT generated by maven-surefire-plugin:test (default-test): m\target\it\MPMD-206-sourceDirectories-js\target\surefire-reports\*.xml
[windows-jdk8] [withMaven] junitPublisher - Jenkins JUnit Attachments Plugin not found, can't publish test attachments.Recording test results
[windows-jdk8] None of the test reports contained any result
[windows-jdk8] [withMaven] Skip 'Findbugs Publisher' disabled by configuration
[windows-jdk8] [withMaven] Skip 'Open Task Scanner Publisher' disabled by configuration
[windows-jdk8] [withMaven] Skip 'Generated Artifacts Publisher' disabled by configuration
[windows-jdk8] [withMaven] Skip 'Findbugs Publisher' disabled by configuration
[windows-jdk8] [withMaven] Skip 'Open Task Scanner Publisher' disabled by configuration
[windows-jdk8] [withMaven] Skip 'Generated Artifacts Publisher' disabled by configuration
[windows-jdk8] [withMaven] junitPublisher - Archive test results for Maven artifact org.apache.maven.plugins.pmd.its.MPMD-234-analysis-cache:no-analysis-cache:1.0-SNAPSHOT generated by maven-surefire-plugin:test (default-test): m\target\it\MPMD-234-analysis-cache\no-analysis-cache\target\surefire-reports\*.xml
[windows-jdk8] [withMaven] junitPublisher - Jenkins JUnit Attachments Plugin not found, can't publish test attachments.Recording test results
[windows-jdk8] None of the test reports contained any result
[windows-jdk8] [withMaven] junitPublisher - Archive test results for Maven artifact org.apache.maven.plugins.pmd.its.MPMD-234-analysis-cache:default-analysis-cache:1.0-SNAPSHOT generated by maven-surefire-plugin:test (default-test): m\target\it\MPMD-234-analysis-cache\default-analysis-cache\target\surefire-reports\*.xml
[windows-jdk8] [withMaven] junitPublisher - Jenkins JUnit Attachments Plugin not found, can't publish test attachments.Recording test results
[windows-jdk8] None of the test reports contained any result
[windows-jdk8] [withMaven] junitPublisher - Archive test results for Maven artifact org.apache.maven.plugins.pmd.its.MPMD-234-analysis-cache:custom-analysis-cache:1.0-SNAPSHOT generated by maven-surefire-plugin:test (default-test): m\target\it\MPMD-234-analysis-cache\custom-analysis-cache\target\surefire-reports\*.xml
[windows-jdk8] [withMaven] junitPublisher - Jenkins JUnit Attachments Plugin not found, can't publish test attachments.Recording test results
[windows-jdk8] None of the test reports contained any result
[windows-jdk8] [withMaven] Skip 'Findbugs Publisher' disabled by configuration
[windows-jdk8] [withMaven] Skip 'Open Task Scanner Publisher' disabled by configuration
[windows-jdk8] [withMaven] Skip 'Generated Artifacts Publisher' disabled by configuration
[windows-jdk8] [withMaven] Skip 'Findbugs Publisher' disabled by configuration
[windows-jdk8] [withMaven] Skip 'Open Task Scanner Publisher' disabled by configuration
[windows-jdk8] [withMaven] Skip 'Generated Artifacts Publisher' disabled by configuration
[windows-jdk8] [withMaven] Skip 'Findbugs Publisher' disabled by configuration
[windows-jdk8] [withMaven] Skip 'Open Task Scanner Publisher' disabled by configuration
[windows-jdk8] [withMaven] Skip 'Generated Artifacts Publisher' disabled by configuration
[windows-jdk8] [withMaven] Skip 'Findbugs Publisher' disabled by configuration
[windows-jdk8] [withMaven] Skip 'Open Task Scanner Publisher' disabled by configuration
[windows-jdk8] [withMaven] Skip 'Generated Artifacts Publisher' disabled by configuration
[windows-jdk8] [withMaven] Skip 'Findbugs Publisher' disabled by configuration
[windows-jdk8] [withMaven] Skip 'Open Task Scanner Publisher' disabled by configuration
[Pipeline] [windows-jdk7] // node
[Pipeline] [windows-jdk8] // withMaven
[Pipeline] [windows-jdk7] }
[Pipeline] [windows-jdk8] }
[Pipeline] [windows-jdk8] // stage
[Pipeline] [windows-jdk8] }
[Pipeline] [windows-jdk8] // node
[Pipeline] [windows-jdk8] }
[windows-jdk9] [INFO] run script verify.groovy
[windows-jdk9] [INFO] ..SUCCESS (9.6 s)
[windows-jdk9] [INFO] Building: multi-module\pom.xml
[windows-jdk9] [INFO] run script verify.bsh
[windows-jdk9] [INFO] ..SUCCESS (15.6 s)
[windows-jdk9] [INFO] 
[windows-jdk9] [INFO] --- maven-checkstyle-plugin:2.15:check (checkstyle-check) @ maven-pmd-plugin ---
[windows-jdk9] [INFO] Downloading: https://repo.maven.apache.org/maven2/org/apache/maven/shared/maven-shared-resources/2/maven-shared-resources-2.pom
[windows-jdk9] [INFO] Downloaded: https://repo.maven.apache.org/maven2/org/apache/maven/shared/maven-shared-resources/2/maven-shared-resources-2.pom (3.0 kB at 156 kB/s)
[windows-jdk9] [INFO] Downloading: https://repo.maven.apache.org/maven2/org/codehaus/plexus/plexus-utils/3.0.10/plexus-utils-3.0.10.pom
[windows-jdk9] [INFO] Downloaded: https://repo.maven.apache.org/maven2/org/codehaus/plexus/plexus-utils/3.0.10/plexus-utils-3.0.10.pom (3.1 kB at 314 kB/s)
[windows-jdk9] [INFO] Downloading: https://repo.maven.apache.org/maven2/org/apache/maven/doxia/doxia-integration-tools/1.6/doxia-integration-tools-1.6.pom
[windows-jdk9] [INFO] Downloaded: https://repo.maven.apache.org/maven2/org/apache/maven/doxia/doxia-integration-tools/1.6/doxia-integration-tools-1.6.pom (7.0 kB at 696 kB/s)
[windows-jdk9] [INFO] Downloading: https://repo.maven.apache.org/maven2/org/apache/maven/doxia/doxia-tools/3/doxia-tools-3.pom
[windows-jdk9] [INFO] Downloaded: https://repo.maven.apache.org/maven2/org/apache/maven/doxia/doxia-tools/3/doxia-tools-3.pom (9.9 kB at 993 kB/s)
[windows-jdk9] [INFO] Downloading: https://repo.maven.apache.org/maven2/org/apache/maven/doxia/doxia-logging-api/1.6/doxia-logging-api-1.6.pom
[windows-jdk9] [INFO] Downloaded: https://repo.maven.apache.org/maven2/org/apache/maven/doxia/doxia-logging-api/1.6/doxia-logging-api-1.6.pom (1.5 kB at 140 kB/s)
[windows-jdk9] [INFO] Downloading: https://repo.maven.apache.org/maven2/org/apache/maven/doxia/doxia/1.6/doxia-1.6.pom
[windows-jdk9] [INFO] Downloaded: https://repo.maven.apache.org/maven2/org/apache/maven/doxia/doxia/1.6/doxia-1.6.pom (19 kB at 1.7 MB/s)
[windows-jdk9] [INFO] Downloading: https://repo.maven.apache.org/maven2/org/apache/maven/doxia/doxia-decoration-model/1.6/doxia-decoration-model-1.6.pom
[windows-jdk9] [INFO] Downloaded: https://repo.maven.apache.org/maven2/org/apache/maven/doxia/doxia-decoration-model/1.6/doxia-decoration-model-1.6.pom (3.0 kB at 333 kB/s)
[windows-jdk9] [INFO] Downloading: https://repo.maven.apache.org/maven2/org/apache/maven/doxia/doxia-sitetools/1.6/doxia-sitetools-1.6.pom
[windows-jdk9] [INFO] Downloaded: https://repo.maven.apache.org/maven2/org/apache/maven/doxia/doxia-sitetools/1.6/doxia-sitetools-1.6.pom (18 kB at 2.0 MB/s)
[windows-jdk9] [INFO] Downloading: https://repo.maven.apache.org/maven2/com/puppycrawl/tools/checkstyle/6.1.1/checkstyle-6.1.1.pom
[windows-jdk9] [INFO] Downloaded: https://repo.maven.apache.org/maven2/com/puppycrawl/tools/checkstyle/6.1.1/checkstyle-6.1.1.pom (30 kB at 2.5 MB/s)
[windows-jdk9] [INFO] Downloading: https://repo.maven.apache.org/maven2/org/antlr/antlr4-runtime/4.3/antlr4-runtime-4.3.pom
[windows-jdk9] [INFO] Downloaded: https://repo.maven.apache.org/maven2/org/antlr/antlr4-runtime/4.3/antlr4-runtime-4.3.pom (4.8 kB at 599 kB/s)
[windows-jdk9] [INFO] Downloading: https://repo.maven.apache.org/maven2/org/antlr/antlr4-master/4.3/antlr4-master-4.3.pom
[windows-jdk9] [INFO] Downloaded: https://repo.maven.apache.org/maven2/org/antlr/antlr4-master/4.3/antlr4-master-4.3.pom (7.9 kB at 793 kB/s)
[windows-jdk9] [INFO] Downloading: https://repo.maven.apache.org/maven2/org/abego/treelayout/org.abego.treelayout.core/1.0.1/org.abego.treelayout.core-1.0.1.pom
[windows-jdk9] [INFO] Downloaded: https://repo.maven.apache.org/maven2/org/abego/treelayout/org.abego.treelayout.core/1.0.1/org.abego.treelayout.core-1.0.1.pom (3.1 kB at 310 kB/s)
[windows-jdk9] [INFO] Downloading: https://repo.maven.apache.org/maven2/org/antlr/antlr4-annotations/4.3/antlr4-annotations-4.3.pom
[windows-jdk9] [INFO] Downloaded: https://repo.maven.apache.org/maven2/org/antlr/antlr4-annotations/4.3/antlr4-annotations-4.3.pom (1.3 kB at 159 kB/s)
[windows-jdk9] [INFO] Downloading: https://repo.maven.apache.org/maven2/commons-beanutils/commons-beanutils-core/1.8.3/commons-beanutils-core-1.8.3.pom
[windows-jdk9] [INFO] Downloaded: https://repo.maven.apache.org/maven2/commons-beanutils/commons-beanutils-core/1.8.3/commons-beanutils-core-1.8.3.pom (1.6 kB at 234 kB/s)
[windows-jdk9] [INFO] Downloading: https://repo.maven.apache.org/maven2/org/apache/maven/shared/maven-shared-resources/2/maven-shared-resources-2.jar
[windows-jdk9] [INFO] Downloading: https://repo.maven.apache.org/maven2/com/puppycrawl/tools/checkstyle/6.1.1/checkstyle-6.1.1.jar
[windows-jdk9] [INFO] Downloading: https://repo.maven.apache.org/maven2/org/apache/maven/doxia/doxia-integration-tools/1.6/doxia-integration-tools-1.6.jar
[windows-jdk9] [INFO] Downloading: https://repo.maven.apache.org/maven2/org/antlr/antlr4-runtime/4.3/antlr4-runtime-4.3.jar
[windows-jdk9] [INFO] Downloading: https://repo.maven.apache.org/maven2/org/abego/treelayout/org.abego.treelayout.core/1.0.1/org.abego.treelayout.core-1.0.1.jar
[windows-jdk9] [INFO] Downloaded: https://repo.maven.apache.org/maven2/org/apache/maven/shared/maven-shared-resources/2/maven-shared-resources-2.jar (13 kB at 353 kB/s)
[windows-jdk9] [INFO] Downloading: https://repo.maven.apache.org/maven2/org/antlr/antlr4-annotations/4.3/antlr4-annotations-4.3.jar
[windows-jdk9] [INFO] Downloaded: https://repo.maven.apache.org/maven2/org/apache/maven/doxia/doxia-integration-tools/1.6/doxia-integration-tools-1.6.jar (45 kB at 1.1 MB/s)
[windows-jdk9] [INFO] Downloading: https://repo.maven.apache.org/maven2/commons-beanutils/commons-beanutils-core/1.8.3/commons-beanutils-core-1.8.3.jar
[windows-jdk9] [INFO] Downloaded: https://repo.maven.apache.org/maven2/org/antlr/antlr4-runtime/4.3/antlr4-runtime-4.3.jar (345 kB at 8.0 MB/s)
[windows-jdk9] [INFO] Downloading: https://repo.maven.apache.org/maven2/commons-lang/commons-lang/2.1/commons-lang-2.1.jar
[windows-jdk9] [INFO] Downloaded: https://repo.maven.apache.org/maven2/org/abego/treelayout/org.abego.treelayout.core/1.0.1/org.abego.treelayout.core-1.0.1.jar (26 kB at 425 kB/s)
[windows-jdk9] [INFO] Downloaded: https://repo.maven.apache.org/maven2/com/puppycrawl/tools/checkstyle/6.1.1/checkstyle-6.1.1.jar (1.0 MB at 16 MB/s)
[windows-jdk9] [INFO] Downloaded: https://repo.maven.apache.org/maven2/commons-lang/commons-lang/2.1/commons-lang-2.1.jar (208 kB at 3.1 MB/s)
[windows-jdk9] [INFO] Downloaded: https://repo.maven.apache.org/maven2/commons-beanutils/commons-beanutils-core/1.8.3/commons-beanutils-core-1.8.3.jar (207 kB at 3.1 MB/s)
[windows-jdk9] [INFO] Downloaded: https://repo.maven.apache.org/maven2/org/antlr/antlr4-annotations/4.3/antlr4-annotations-4.3.jar (10 kB at 147 kB/s)
[windows-jdk9] [INFO] 
[windows-jdk9] [INFO] --- maven-invoker-plugin:2.0.0:verify (integration-test) @ maven-pmd-plugin ---
[windows-jdk9] [INFO] -------------------------------------------------
[windows-jdk9] [INFO] Build Summary:
[windows-jdk9] [INFO]   Passed: 20, Failed: 0, Errors: 0, Skipped: 0
[windows-jdk9] [INFO] -------------------------------------------------
[windows-jdk9] [INFO] ------------------------------------------------------------------------
[windows-jdk9] [INFO] BUILD SUCCESS
[windows-jdk9] [INFO] ------------------------------------------------------------------------
[windows-jdk9] [INFO] Total time: 05:37 min
[windows-jdk9] [INFO] Finished at: 2017-12-17T10:54:47Z
[windows-jdk9] [INFO] Final Memory: 51M/172M
[windows-jdk9] [INFO] ------------------------------------------------------------------------
[windows-jdk9] [jenkins-maven-event-spy] INFO generated F:\jenkins\jenkins-slave\workspace\box_maven-pmd-plugin_master-723XUI4HKC5A6CYF5JA2PBPNJGNR6SKD4M55XBOMRDY4Z3ISJGVQ@tmp\withMaven4c81581d\maven-spy-20171217-104909-1893780440466939452929.log
[Pipeline] [windows-jdk9] }
[Pipeline] [windows-jdk9] // dir
[Pipeline] [windows-jdk9] }
[windows-jdk9] [withMaven] Skip 'Generated Artifacts Publisher' disabled by configuration
[windows-jdk9] [withMaven] junitPublisher - Archive test results for Maven artifact org.apache.maven.plugins:maven-pmd-plugin:3.9.0-SNAPSHOT generated by maven-surefire-plugin:test (default-test): m\target\surefire-reports\*.xml
[windows-jdk9] [withMaven] junitPublisher - Jenkins JUnit Attachments Plugin not found, can't publish test attachments.Recording test results
[windows-jdk9] [withMaven] Skip 'Findbugs Publisher' disabled by configuration
[windows-jdk9] [withMaven] Skip 'Open Task Scanner Publisher' disabled by configuration
[windows-jdk9] [withMaven] Skip 'Generated Artifacts Publisher' disabled by configuration
[windows-jdk9] [withMaven] junitPublisher - Archive test results for Maven artifact org.apache.maven.plugins.pmd.it:empty-rulests:1.0-SNAPSHOT generated by maven-surefire-plugin:test (default-test): m\target\it\empty-rulesets\target\surefire-reports\*.xml
[windows-jdk9] [withMaven] junitPublisher - Jenkins JUnit Attachments Plugin not found, can't publish test attachments.Recording test results
[windows-jdk9] None of the test reports contained any result
[windows-jdk9] [withMaven] Skip 'Findbugs Publisher' disabled by configuration
[windows-jdk9] [withMaven] Skip 'Open Task Scanner Publisher' disabled by configuration
[windows-jdk9] [withMaven] Skip 'Generated Artifacts Publisher' disabled by configuration
[windows-jdk9] [withMaven] junitPublisher - Archive test results for Maven artifact org.apache.maven.plugins.pmd.its:mpmd-138-mod-1:1.0-SNAPSHOT generated by maven-surefire-plugin:test (default-test): m\target\it\mpmd-138\mod-1\target\surefire-reports\*.xml
[windows-jdk9] [withMaven] junitPublisher - Jenkins JUnit Attachments Plugin not found, can't publish test attachments.Recording test results
[windows-jdk9] None of the test reports contained any result
[windows-jdk9] [withMaven] junitPublisher - Archive test results for Maven artifact org.apache.maven.plugins.pmd.its:mpmd-138-mod-2:1.0-SNAPSHOT generated by maven-surefire-plugin:test (default-test): m\target\it\mpmd-138\mod-2\target\surefire-reports\*.xml
[windows-jdk9] [withMaven] junitPublisher - Jenkins JUnit Attachments Plugin not found, can't publish test attachments.Recording test results
[windows-jdk9] None of the test reports contained any result
[windows-jdk9] [withMaven] junitPublisher - Archive test results for Maven artifact org.apache.maven.plugins.pmd.its:mpmd-138-mod-3:1.0-SNAPSHOT generated by maven-surefire-plugin:test (default-test): m\target\it\mpmd-138\mod-3\target\surefire-reports\*.xml
[windows-jdk9] [withMaven] junitPublisher - Jenkins JUnit Attachments Plugin not found, can't publish test attachments.Recording test results
[windows-jdk9] None of the test reports contained any result
[windows-jdk9] [withMaven] junitPublisher - Archive test results for Maven artifact org.apache.maven.plugins.pmd.its:mpmd-138-mod-4:1.0-SNAPSHOT generated by maven-surefire-plugin:test (default-test): m\target\it\mpmd-138\mod-4\target\surefire-reports\*.xml
[windows-jdk9] [withMaven] junitPublisher - Jenkins JUnit Attachments Plugin not found, can't publish test attachments.Recording test results
[windows-jdk9] None of the test reports contained any result
[windows-jdk9] [withMaven] Skip 'Findbugs Publisher' disabled by configuration
[windows-jdk9] [withMaven] Skip 'Open Task Scanner Publisher' disabled by configuration
[windows-jdk9] [withMaven] Skip 'Generated Artifacts Publisher' disabled by configuration
[windows-jdk9] [withMaven] Skip 'Findbugs Publisher' disabled by configuration
[windows-jdk9] [withMaven] Skip 'Open Task Scanner Publisher' disabled by configuration
[windows-jdk9] [withMaven] Skip 'Generated Artifacts Publisher' disabled by configuration
[windows-jdk9] [withMaven] Skip 'Findbugs Publisher' disabled by configuration
[windows-jdk9] [withMaven] Skip 'Open Task Scanner Publisher' disabled by configuration
[windows-jdk9] [withMaven] Skip 'Generated Artifacts Publisher' disabled by configuration
[windows-jdk9] [withMaven] Skip 'Findbugs Publisher' disabled by configuration
[windows-jdk9] [withMaven] Skip 'Open Task Scanner Publisher' disabled by configuration
[windows-jdk9] [withMaven] Skip 'Generated Artifacts Publisher' disabled by configuration
[windows-jdk9] [withMaven] junitPublisher - Archive test results for Maven artifact org.apache.maven.plugins.pmd.its:mpmd-168-empty-report-skipped:1.0-SNAPSHOT generated by maven-surefire-plugin:test (default-test): m\target\it\mpmd-168\target\surefire-reports\*.xml
[windows-jdk9] [withMaven] junitPublisher - Jenkins JUnit Attachments Plugin not found, can't publish test attachments.Recording test results
[windows-jdk9] None of the test reports contained any result
[windows-jdk9] [withMaven] Skip 'Findbugs Publisher' disabled by configuration
[windows-jdk9] [withMaven] Skip 'Open Task Scanner Publisher' disabled by configuration
[windows-jdk9] [withMaven] Skip 'Generated Artifacts Publisher' disabled by configuration
[windows-jdk9] [withMaven] junitPublisher - Archive test results for Maven artifact org.apache.maven.plugins.pmd.its:mpmd-168-empty-report:1.0-SNAPSHOT generated by maven-surefire-plugin:test (default-test): m\target\it\mpmd-168-empty-report\target\surefire-reports\*.xml
[windows-jdk9] [withMaven] junitPublisher - Jenkins JUnit Attachments Plugin not found, can't publish test attachments.Recording test results
[windows-jdk9] None of the test reports contained any result
[windows-jdk9] [withMaven] Skip 'Findbugs Publisher' disabled by configuration
[windows-jdk9] [withMaven] Skip 'Open Task Scanner Publisher' disabled by configuration
[windows-jdk9] [withMaven] Skip 'Generated Artifacts Publisher' disabled by configuration
[windows-jdk9] [withMaven] junitPublisher - Archive test results for Maven artifact org.apache.maven.plugins.pmd.its:MPMD-172:1.0-SNAPSHOT generated by maven-surefire-plugin:test (default-test): m\target\it\MPMD-172\target\surefire-reports\*.xml
[windows-jdk9] [withMaven] junitPublisher - Jenkins JUnit Attachments Plugin not found, can't publish test attachments.Recording test results
[windows-jdk9] None of the test reports contained any result
[windows-jdk9] [withMaven] Skip 'Findbugs Publisher' disabled by configuration
[windows-jdk9] [withMaven] Skip 'Open Task Scanner Publisher' disabled by configuration
[windows-jdk9] [withMaven] Skip 'Generated Artifacts Publisher' disabled by configuration
[windows-jdk9] [withMaven] junitPublisher - Archive test results for Maven artifact org.apache.maven.plugins.pmd.its:MPMD-181-benchmark:1.0-SNAPSHOT generated by maven-surefire-plugin:test (default-test): m\target\it\MPMD-181-benchmark\target\surefire-reports\*.xml
[windows-jdk9] [withMaven] junitPublisher - Jenkins JUnit Attachments Plugin not found, can't publish test attachments.Recording test results
[windows-jdk9] None of the test reports contained any result
[windows-jdk9] [withMaven] Skip 'Findbugs Publisher' disabled by configuration
[windows-jdk9] [withMaven] Skip 'Open Task Scanner Publisher' disabled by configuration
[windows-jdk9] [withMaven] Skip 'Generated Artifacts Publisher' disabled by configuration
[windows-jdk9] [withMaven] junitPublisher - Archive test results for Maven artifact org.apache.maven.plugins.pmd.its:MPMD-181-no-benchmark:1.0-SNAPSHOT generated by maven-surefire-plugin:test (default-test): m\target\it\MPMD-181-no-benchmark\target\surefire-reports\*.xml
[windows-jdk9] [withMaven] junitPublisher - Jenkins JUnit Attachments Plugin not found, can't publish test attachments.Recording test results
[windows-jdk9] None of the test reports contained any result
[windows-jdk9] [withMaven] Skip 'Findbugs Publisher' disabled by configuration
[windows-jdk9] [withMaven] Skip 'Open Task Scanner Publisher' disabled by configuration
[windows-jdk9] [withMaven] Skip 'Generated Artifacts Publisher' disabled by configuration
[windows-jdk9] [withMaven] junitPublisher - Archive test results for Maven artifact org.apache.maven.plugins.pmd.its:MPMD-182:1.0-SNAPSHOT generated by maven-surefire-plugin:test (default-test): m\target\it\MPMD-182\target\surefire-reports\*.xml
[windows-jdk9] [withMaven] junitPublisher - Jenkins JUnit Attachments Plugin not found, can't publish test attachments.Recording test results
[windows-jdk9] None of the test reports contained any result
[windows-jdk9] [withMaven] Skip 'Findbugs Publisher' disabled by configuration
[windows-jdk9] [withMaven] Skip 'Open Task Scanner Publisher' disabled by configuration
[windows-jdk9] [withMaven] Skip 'Generated Artifacts Publisher' disabled by configuration
[windows-jdk9] [withMaven] junitPublisher - Archive test results for Maven artifact org.apache.maven.plugins.pmd.its:MPMD-187:1.0-SNAPSHOT generated by maven-surefire-plugin:test (default-test): m\target\it\MPMD-187\target\surefire-reports\*.xml
[windows-jdk9] [withMaven] junitPublisher - Jenkins JUnit Attachments Plugin not found, can't publish test attachments.Recording test results
[windows-jdk9] None of the test reports contained any result
[windows-jdk9] [withMaven] Skip 'Findbugs Publisher' disabled by configuration
[windows-jdk9] [withMaven] Skip 'Open Task Scanner Publisher' disabled by configuration
[windows-jdk9] [withMaven] Skip 'Generated Artifacts Publisher' disabled by configuration
[windows-jdk9] [withMaven] junitPublisher - Archive test results for Maven artifact org.apache.maven.plugins.pmd.its:MPMD-205-pmd-js-check:1.0-SNAPSHOT generated by maven-surefire-plugin:test (default-test): m\target\it\MPMD-205-pmd-js-check\target\surefire-reports\*.xml
[windows-jdk9] [withMaven] junitPublisher - Jenkins JUnit Attachments Plugin not found, can't publish test attachments.Recording test results
[windows-jdk9] None of the test reports contained any result
[windows-jdk9] [withMaven] Skip 'Findbugs Publisher' disabled by configuration
[windows-jdk9] [withMaven] Skip 'Open Task Scanner Publisher' disabled by configuration
[windows-jdk9] [withMaven] Skip 'Generated Artifacts Publisher' disabled by configuration
[windows-jdk9] [withMaven] junitPublisher - Archive test results for Maven artifact org.apache.maven.plugins.pmd.its:MPMD-206-pmd-sourceDirectories-js:1.0-SNAPSHOT generated by maven-surefire-plugin:test (default-test): m\target\it\MPMD-206-sourceDirectories-js\target\surefire-reports\*.xml
[windows-jdk9] [withMaven] junitPublisher - Jenkins JUnit Attachments Plugin not found, can't publish test attachments.Recording test results
[windows-jdk9] None of the test reports contained any result
[windows-jdk9] [withMaven] Skip 'Findbugs Publisher' disabled by configuration
[windows-jdk9] [withMaven] Skip 'Open Task Scanner Publisher' disabled by configuration
[windows-jdk9] [withMaven] Skip 'Generated Artifacts Publisher' disabled by configuration
[windows-jdk9] [withMaven] Skip 'Findbugs Publisher' disabled by configuration
[windows-jdk9] [withMaven] Skip 'Open Task Scanner Publisher' disabled by configuration
[windows-jdk9] [withMaven] Skip 'Generated Artifacts Publisher' disabled by configuration
[windows-jdk9] [withMaven] junitPublisher - Archive test results for Maven artifact org.apache.maven.plugins.pmd.its.MPMD-234-analysis-cache:no-analysis-cache:1.0-SNAPSHOT generated by maven-surefire-plugin:test (default-test): m\target\it\MPMD-234-analysis-cache\no-analysis-cache\target\surefire-reports\*.xml
[windows-jdk9] [withMaven] junitPublisher - Jenkins JUnit Attachments Plugin not found, can't publish test attachments.Recording test results
[windows-jdk9] None of the test reports contained any result
[windows-jdk9] [withMaven] junitPublisher - Archive test results for Maven artifact org.apache.maven.plugins.pmd.its.MPMD-234-analysis-cache:default-analysis-cache:1.0-SNAPSHOT generated by maven-surefire-plugin:test (default-test): m\target\it\MPMD-234-analysis-cache\default-analysis-cache\target\surefire-reports\*.xml
[windows-jdk9] [withMaven] junitPublisher - Jenkins JUnit Attachments Plugin not found, can't publish test attachments.Recording test results
[windows-jdk9] None of the test reports contained any result
[windows-jdk9] [withMaven] junitPublisher - Archive test results for Maven artifact org.apache.maven.plugins.pmd.its.MPMD-234-analysis-cache:custom-analysis-cache:1.0-SNAPSHOT generated by maven-surefire-plugin:test (default-test): m\target\it\MPMD-234-analysis-cache\custom-analysis-cache\target\surefire-reports\*.xml
[windows-jdk9] [withMaven] junitPublisher - Jenkins JUnit Attachments Plugin not found, can't publish test attachments.Recording test results
[windows-jdk9] None of the test reports contained any result
[windows-jdk9] [withMaven] Skip 'Findbugs Publisher' disabled by configuration
[windows-jdk9] [withMaven] Skip 'Open Task Scanner Publisher' disabled by configuration
[windows-jdk9] [withMaven] Skip 'Generated Artifacts Publisher' disabled by configuration
[windows-jdk9] [withMaven] Skip 'Findbugs Publisher' disabled by configuration
[windows-jdk9] [withMaven] Skip 'Open Task Scanner Publisher' disabled by configuration
[windows-jdk9] [withMaven] Skip 'Generated Artifacts Publisher' disabled by configuration
[windows-jdk9] [withMaven] Skip 'Findbugs Publisher' disabled by configuration
[windows-jdk9] [withMaven] Skip 'Open Task Scanner Publisher' disabled by configuration
[windows-jdk9] [withMaven] Skip 'Generated Artifacts Publisher' disabled by configuration
[windows-jdk9] [withMaven] Skip 'Findbugs Publisher' disabled by configuration
[windows-jdk9] [withMaven] Skip 'Open Task Scanner Publisher' disabled by configuration
[windows-jdk9] [withMaven] Skip 'Generated Artifacts Publisher' disabled by configuration
[windows-jdk9] [withMaven] Skip 'Findbugs Publisher' disabled by configuration
[windows-jdk9] [withMaven] Skip 'Open Task Scanner Publisher' disabled by configuration
[Pipeline] [windows-jdk9] // withMaven
[Pipeline] [windows-jdk9] }
[Pipeline] [windows-jdk9] // stage
[Pipeline] [windows-jdk9] }
[Pipeline] [windows-jdk9] // node
[Pipeline] [windows-jdk9] }
[Pipeline] // parallel
[Pipeline] stage
[Pipeline] { (Notifications)
[Pipeline] echo
Build result: UNSTABLE
[Pipeline] jiraIssueSelector
[Pipeline] jiraComment
[Pipeline] emailext

Build succeeded in Jenkins: Maven TLP » maven-pmd-plugin » master #8

Posted by Apache Jenkins Server <je...@builds.apache.org>.
See https://builds.apache.org/job/maven-box/job/maven-pmd-plugin/job/master/8/

Changes:

* [MPMD-248] cpd-check goal leaks file handle
* [MPMD-248] cpd-check goal leaks file handle
* [MPMD-248] cpd-check goal leaks file handle
* [MPMD-248] cpd-check goal leaks file handle
* [MPMD-248] cpd-check goal leaks file handle
* [MPMD-248] cpd-check goal leaks file handle

All tests passed

Build unstable in Jenkins: Maven TLP » maven-pmd-plugin » master #7

Posted by Apache Jenkins Server <je...@builds.apache.org>.
See https://builds.apache.org/job/maven-box/job/maven-pmd-plugin/job/master/7/

Changes:

* Now really find a free port. Wiremock internally just uses port 8080 if
* Now really find a free port. Wiremock internally just uses port 8080 if
* Now really find a free port. Wiremock internally just uses port 8080 if
* Now really find a free port. Wiremock internally just uses port 8080 if
* Now really find a free port. Wiremock internally just uses port 8080 if

2 tests failed.
FAILED:  org.apache.maven.plugins.pmd.PmdReportTest.testEmptyReportConfiguration

Error Message:
File f:\jenkins\jenkins-slave\workspace\box_maven-pmd-plugin_master-723XUI4HKC5A6CYF5JA2PBPNJGNR6SKD4M55XBOMRDY4Z3ISJGVQ\m\target\test\unit\default-configuration\target\cpd.xml unable to be deleted.

Stack Trace:
java.io.IOException: File f:\jenkins\jenkins-slave\workspace\box_maven-pmd-plugin_master-723XUI4HKC5A6CYF5JA2PBPNJGNR6SKD4M55XBOMRDY4Z3ISJGVQ\m\target\test\unit\default-configuration\target\cpd.xml unable to be deleted.
	at org.apache.maven.plugins.pmd.PmdReportTest.setUp(PmdReportTest.java:53)


FAILED:  org.apache.maven.plugins.pmd.PmdReportTest.testEmptyReportConfiguration

Error Message:
File f:\jenkins\jenkins-slave\workspace\box_maven-pmd-plugin_master-723XUI4HKC5A6CYF5JA2PBPNJGNR6SKD4M55XBOMRDY4Z3ISJGVQ@2\m\target\test\unit\default-configuration\target\cpd.xml unable to be deleted.

Stack Trace:
java.io.IOException: File f:\jenkins\jenkins-slave\workspace\box_maven-pmd-plugin_master-723XUI4HKC5A6CYF5JA2PBPNJGNR6SKD4M55XBOMRDY4Z3ISJGVQ@2\m\target\test\unit\default-configuration\target\cpd.xml unable to be deleted.
	at org.apache.maven.plugins.pmd.PmdReportTest.setUp(PmdReportTest.java:53)




Build log:
[...truncated 320.79 KB...]
[windows-jdk9] [withMaven] Skip 'Generated Artifacts Publisher' disabled by configuration
[windows-jdk9] [withMaven] junitPublisher - Archive test results for Maven artifact org.apache.maven.plugins.pmd.its:mpmd-138-mod-1:1.0-SNAPSHOT generated by maven-surefire-plugin:test (default-test): m\target\it\mpmd-138\mod-1\target\surefire-reports\*.xml
[windows-jdk9] [withMaven] junitPublisher - Jenkins JUnit Attachments Plugin not found, can't publish test attachments.Recording test results
[windows-jdk9] None of the test reports contained any result
[windows-jdk9] [withMaven] junitPublisher - Archive test results for Maven artifact org.apache.maven.plugins.pmd.its:mpmd-138-mod-2:1.0-SNAPSHOT generated by maven-surefire-plugin:test (default-test): m\target\it\mpmd-138\mod-2\target\surefire-reports\*.xml
[windows-jdk9] [withMaven] junitPublisher - Jenkins JUnit Attachments Plugin not found, can't publish test attachments.Recording test results
[windows-jdk9] None of the test reports contained any result
[windows-jdk9] [withMaven] junitPublisher - Archive test results for Maven artifact org.apache.maven.plugins.pmd.its:mpmd-138-mod-3:1.0-SNAPSHOT generated by maven-surefire-plugin:test (default-test): m\target\it\mpmd-138\mod-3\target\surefire-reports\*.xml
[windows-jdk9] [withMaven] junitPublisher - Jenkins JUnit Attachments Plugin not found, can't publish test attachments.Recording test results
[windows-jdk9] None of the test reports contained any result
[windows-jdk9] [withMaven] junitPublisher - Archive test results for Maven artifact org.apache.maven.plugins.pmd.its:mpmd-138-mod-4:1.0-SNAPSHOT generated by maven-surefire-plugin:test (default-test): m\target\it\mpmd-138\mod-4\target\surefire-reports\*.xml
[windows-jdk9] [withMaven] junitPublisher - Jenkins JUnit Attachments Plugin not found, can't publish test attachments.Recording test results
[windows-jdk9] None of the test reports contained any result
[windows-jdk9] [withMaven] Skip 'Findbugs Publisher' disabled by configuration
[windows-jdk9] [withMaven] Skip 'Open Task Scanner Publisher' disabled by configuration
[windows-jdk9] [withMaven] Skip 'Generated Artifacts Publisher' disabled by configuration
[windows-jdk9] [withMaven] Skip 'Findbugs Publisher' disabled by configuration
[windows-jdk9] [withMaven] Skip 'Open Task Scanner Publisher' disabled by configuration
[windows-jdk9] [withMaven] Skip 'Generated Artifacts Publisher' disabled by configuration
[windows-jdk9] [withMaven] Skip 'Findbugs Publisher' disabled by configuration
[windows-jdk9] [withMaven] Skip 'Open Task Scanner Publisher' disabled by configuration
[windows-jdk9] [withMaven] Skip 'Generated Artifacts Publisher' disabled by configuration
[windows-jdk9] [withMaven] Skip 'Findbugs Publisher' disabled by configuration
[windows-jdk9] [withMaven] Skip 'Open Task Scanner Publisher' disabled by configuration
[windows-jdk9] [withMaven] Skip 'Generated Artifacts Publisher' disabled by configuration
[windows-jdk9] [withMaven] junitPublisher - Archive test results for Maven artifact org.apache.maven.plugins.pmd.its:mpmd-168-empty-report-skipped:1.0-SNAPSHOT generated by maven-surefire-plugin:test (default-test): m\target\it\mpmd-168\target\surefire-reports\*.xml
[windows-jdk9] [withMaven] junitPublisher - Jenkins JUnit Attachments Plugin not found, can't publish test attachments.Recording test results
[windows-jdk9] None of the test reports contained any result
[windows-jdk9] [withMaven] Skip 'Findbugs Publisher' disabled by configuration
[windows-jdk9] [withMaven] Skip 'Open Task Scanner Publisher' disabled by configuration
[windows-jdk9] [withMaven] Skip 'Generated Artifacts Publisher' disabled by configuration
[windows-jdk9] [withMaven] junitPublisher - Archive test results for Maven artifact org.apache.maven.plugins.pmd.its:mpmd-168-empty-report:1.0-SNAPSHOT generated by maven-surefire-plugin:test (default-test): m\target\it\mpmd-168-empty-report\target\surefire-reports\*.xml
[windows-jdk9] [withMaven] junitPublisher - Jenkins JUnit Attachments Plugin not found, can't publish test attachments.Recording test results
[windows-jdk9] None of the test reports contained any result
[windows-jdk9] [withMaven] Skip 'Findbugs Publisher' disabled by configuration
[windows-jdk9] [withMaven] Skip 'Open Task Scanner Publisher' disabled by configuration
[windows-jdk9] [withMaven] Skip 'Generated Artifacts Publisher' disabled by configuration
[windows-jdk9] [withMaven] junitPublisher - Archive test results for Maven artifact org.apache.maven.plugins.pmd.its:MPMD-172:1.0-SNAPSHOT generated by maven-surefire-plugin:test (default-test): m\target\it\MPMD-172\target\surefire-reports\*.xml
[windows-jdk9] [withMaven] junitPublisher - Jenkins JUnit Attachments Plugin not found, can't publish test attachments.Recording test results
[windows-jdk9] None of the test reports contained any result
[windows-jdk9] [withMaven] Skip 'Findbugs Publisher' disabled by configuration
[windows-jdk9] [withMaven] Skip 'Open Task Scanner Publisher' disabled by configuration
[windows-jdk9] [withMaven] Skip 'Generated Artifacts Publisher' disabled by configuration
[windows-jdk9] [withMaven] junitPublisher - Archive test results for Maven artifact org.apache.maven.plugins.pmd.its:MPMD-181-benchmark:1.0-SNAPSHOT generated by maven-surefire-plugin:test (default-test): m\target\it\MPMD-181-benchmark\target\surefire-reports\*.xml
[windows-jdk9] [withMaven] junitPublisher - Jenkins JUnit Attachments Plugin not found, can't publish test attachments.Recording test results
[windows-jdk9] None of the test reports contained any result
[windows-jdk9] [withMaven] Skip 'Findbugs Publisher' disabled by configuration
[windows-jdk9] [withMaven] Skip 'Open Task Scanner Publisher' disabled by configuration
[windows-jdk9] [withMaven] Skip 'Generated Artifacts Publisher' disabled by configuration
[windows-jdk9] [withMaven] junitPublisher - Archive test results for Maven artifact org.apache.maven.plugins.pmd.its:MPMD-181-no-benchmark:1.0-SNAPSHOT generated by maven-surefire-plugin:test (default-test): m\target\it\MPMD-181-no-benchmark\target\surefire-reports\*.xml
[windows-jdk9] [withMaven] junitPublisher - Jenkins JUnit Attachments Plugin not found, can't publish test attachments.Recording test results
[windows-jdk9] None of the test reports contained any result
[windows-jdk9] [withMaven] Skip 'Findbugs Publisher' disabled by configuration
[windows-jdk9] [withMaven] Skip 'Open Task Scanner Publisher' disabled by configuration
[windows-jdk9] [withMaven] Skip 'Generated Artifacts Publisher' disabled by configuration
[windows-jdk9] [withMaven] junitPublisher - Archive test results for Maven artifact org.apache.maven.plugins.pmd.its:MPMD-182:1.0-SNAPSHOT generated by maven-surefire-plugin:test (default-test): m\target\it\MPMD-182\target\surefire-reports\*.xml
[windows-jdk9] [withMaven] junitPublisher - Jenkins JUnit Attachments Plugin not found, can't publish test attachments.Recording test results
[windows-jdk9] None of the test reports contained any result
[windows-jdk9] [withMaven] Skip 'Findbugs Publisher' disabled by configuration
[windows-jdk9] [withMaven] Skip 'Open Task Scanner Publisher' disabled by configuration
[windows-jdk9] [withMaven] Skip 'Generated Artifacts Publisher' disabled by configuration
[windows-jdk9] [withMaven] junitPublisher - Archive test results for Maven artifact org.apache.maven.plugins.pmd.its:MPMD-187:1.0-SNAPSHOT generated by maven-surefire-plugin:test (default-test): m\target\it\MPMD-187\target\surefire-reports\*.xml
[windows-jdk9] [withMaven] junitPublisher - Jenkins JUnit Attachments Plugin not found, can't publish test attachments.Recording test results
[windows-jdk9] None of the test reports contained any result
[windows-jdk9] [withMaven] Skip 'Findbugs Publisher' disabled by configuration
[windows-jdk9] [withMaven] Skip 'Open Task Scanner Publisher' disabled by configuration
[windows-jdk9] [withMaven] Skip 'Generated Artifacts Publisher' disabled by configuration
[windows-jdk9] [withMaven] junitPublisher - Archive test results for Maven artifact org.apache.maven.plugins.pmd.its:MPMD-205-pmd-js-check:1.0-SNAPSHOT generated by maven-surefire-plugin:test (default-test): m\target\it\MPMD-205-pmd-js-check\target\surefire-reports\*.xml
[windows-jdk9] [withMaven] junitPublisher - Jenkins JUnit Attachments Plugin not found, can't publish test attachments.Recording test results
[windows-jdk9] None of the test reports contained any result
[windows-jdk9] [withMaven] Skip 'Findbugs Publisher' disabled by configuration
[windows-jdk9] [withMaven] Skip 'Open Task Scanner Publisher' disabled by configuration
[windows-jdk9] [withMaven] Skip 'Generated Artifacts Publisher' disabled by configuration
[windows-jdk9] [withMaven] junitPublisher - Archive test results for Maven artifact org.apache.maven.plugins.pmd.its:MPMD-206-pmd-sourceDirectories-js:1.0-SNAPSHOT generated by maven-surefire-plugin:test (default-test): m\target\it\MPMD-206-sourceDirectories-js\target\surefire-reports\*.xml
[windows-jdk9] [withMaven] junitPublisher - Jenkins JUnit Attachments Plugin not found, can't publish test attachments.Recording test results
[windows-jdk9] None of the test reports contained any result
[windows-jdk9] [withMaven] Skip 'Findbugs Publisher' disabled by configuration
[windows-jdk9] [withMaven] Skip 'Open Task Scanner Publisher' disabled by configuration
[windows-jdk9] [withMaven] Skip 'Generated Artifacts Publisher' disabled by configuration
[windows-jdk9] [withMaven] Skip 'Findbugs Publisher' disabled by configuration
[windows-jdk9] [withMaven] Skip 'Open Task Scanner Publisher' disabled by configuration
[windows-jdk9] [withMaven] Skip 'Generated Artifacts Publisher' disabled by configuration
[windows-jdk9] [withMaven] junitPublisher - Archive test results for Maven artifact org.apache.maven.plugins.pmd.its.MPMD-234-analysis-cache:no-analysis-cache:1.0-SNAPSHOT generated by maven-surefire-plugin:test (default-test): m\target\it\MPMD-234-analysis-cache\no-analysis-cache\target\surefire-reports\*.xml
[windows-jdk9] [withMaven] junitPublisher - Jenkins JUnit Attachments Plugin not found, can't publish test attachments.Recording test results
[windows-jdk9] None of the test reports contained any result
[windows-jdk9] [withMaven] junitPublisher - Archive test results for Maven artifact org.apache.maven.plugins.pmd.its.MPMD-234-analysis-cache:default-analysis-cache:1.0-SNAPSHOT generated by maven-surefire-plugin:test (default-test): m\target\it\MPMD-234-analysis-cache\default-analysis-cache\target\surefire-reports\*.xml
[windows-jdk9] [withMaven] junitPublisher - Jenkins JUnit Attachments Plugin not found, can't publish test attachments.Recording test results
[windows-jdk9] None of the test reports contained any result
[windows-jdk9] [withMaven] junitPublisher - Archive test results for Maven artifact org.apache.maven.plugins.pmd.its.MPMD-234-analysis-cache:custom-analysis-cache:1.0-SNAPSHOT generated by maven-surefire-plugin:test (default-test): m\target\it\MPMD-234-analysis-cache\custom-analysis-cache\target\surefire-reports\*.xml
[windows-jdk9] [withMaven] junitPublisher - Jenkins JUnit Attachments Plugin not found, can't publish test attachments.Recording test results
[windows-jdk9] None of the test reports contained any result
[windows-jdk9] [withMaven] Skip 'Findbugs Publisher' disabled by configuration
[windows-jdk9] [withMaven] Skip 'Open Task Scanner Publisher' disabled by configuration
[windows-jdk9] [withMaven] Skip 'Generated Artifacts Publisher' disabled by configuration
[windows-jdk9] [withMaven] Skip 'Findbugs Publisher' disabled by configuration
[windows-jdk9] [withMaven] Skip 'Open Task Scanner Publisher' disabled by configuration
[windows-jdk9] [withMaven] Skip 'Generated Artifacts Publisher' disabled by configuration
[windows-jdk9] [withMaven] Skip 'Findbugs Publisher' disabled by configuration
[windows-jdk9] [withMaven] Skip 'Open Task Scanner Publisher' disabled by configuration
[windows-jdk9] [withMaven] Skip 'Generated Artifacts Publisher' disabled by configuration
[windows-jdk9] [withMaven] Skip 'Findbugs Publisher' disabled by configuration
[windows-jdk9] [withMaven] Skip 'Open Task Scanner Publisher' disabled by configuration
[windows-jdk9] [withMaven] Skip 'Generated Artifacts Publisher' disabled by configuration
[windows-jdk9] [withMaven] Skip 'Findbugs Publisher' disabled by configuration
[windows-jdk9] [withMaven] Skip 'Open Task Scanner Publisher' disabled by configuration
[Pipeline] [windows-jdk7] // withMaven
[Pipeline] [windows-jdk9] // withMaven
[Pipeline] [windows-jdk7] }
[Pipeline] [windows-jdk8] }
[Pipeline] [windows-jdk9] }
[Pipeline] [windows-jdk7] // stage
[Pipeline] [windows-jdk8] // dir
[Pipeline] [windows-jdk9] // stage
[Pipeline] [windows-jdk7] }
[Pipeline] [windows-jdk9] }
[Pipeline] [windows-jdk8] }
[windows-jdk8] [withMaven] Skip 'Generated Artifacts Publisher' disabled by configuration
[windows-jdk8] [withMaven] junitPublisher - Archive test results for Maven artifact org.apache.maven.plugins:maven-pmd-plugin:3.9.0-SNAPSHOT generated by maven-surefire-plugin:test (default-test): m\target\surefire-reports\*.xml
[windows-jdk8] [withMaven] junitPublisher - Jenkins JUnit Attachments Plugin not found, can't publish test attachments.Recording test results
[windows-jdk8] [withMaven] Skip 'Findbugs Publisher' disabled by configuration
[windows-jdk8] [withMaven] Skip 'Open Task Scanner Publisher' disabled by configuration
[windows-jdk8] [withMaven] Skip 'Generated Artifacts Publisher' disabled by configuration
[windows-jdk8] [withMaven] junitPublisher - Archive test results for Maven artifact org.apache.maven.plugins.pmd.it:empty-rulests:1.0-SNAPSHOT generated by maven-surefire-plugin:test (default-test): m\target\it\empty-rulesets\target\surefire-reports\*.xml
[windows-jdk8] [withMaven] junitPublisher - Jenkins JUnit Attachments Plugin not found, can't publish test attachments.Recording test results
[windows-jdk8] None of the test reports contained any result
[windows-jdk8] [withMaven] Skip 'Findbugs Publisher' disabled by configuration
[windows-jdk8] [withMaven] Skip 'Open Task Scanner Publisher' disabled by configuration
[windows-jdk8] [withMaven] Skip 'Generated Artifacts Publisher' disabled by configuration
[windows-jdk8] [withMaven] junitPublisher - Archive test results for Maven artifact org.apache.maven.plugins.pmd.its:mpmd-138-mod-1:1.0-SNAPSHOT generated by maven-surefire-plugin:test (default-test): m\target\it\mpmd-138\mod-1\target\surefire-reports\*.xml
[windows-jdk8] [withMaven] junitPublisher - Jenkins JUnit Attachments Plugin not found, can't publish test attachments.Recording test results
[windows-jdk8] None of the test reports contained any result
[windows-jdk8] [withMaven] junitPublisher - Archive test results for Maven artifact org.apache.maven.plugins.pmd.its:mpmd-138-mod-2:1.0-SNAPSHOT generated by maven-surefire-plugin:test (default-test): m\target\it\mpmd-138\mod-2\target\surefire-reports\*.xml
[windows-jdk8] [withMaven] junitPublisher - Jenkins JUnit Attachments Plugin not found, can't publish test attachments.Recording test results
[windows-jdk8] None of the test reports contained any result
[windows-jdk8] [withMaven] junitPublisher - Archive test results for Maven artifact org.apache.maven.plugins.pmd.its:mpmd-138-mod-3:1.0-SNAPSHOT generated by maven-surefire-plugin:test (default-test): m\target\it\mpmd-138\mod-3\target\surefire-reports\*.xml
[windows-jdk8] [withMaven] junitPublisher - Jenkins JUnit Attachments Plugin not found, can't publish test attachments.Recording test results
[windows-jdk8] None of the test reports contained any result
[windows-jdk8] [withMaven] junitPublisher - Archive test results for Maven artifact org.apache.maven.plugins.pmd.its:mpmd-138-mod-4:1.0-SNAPSHOT generated by maven-surefire-plugin:test (default-test): m\target\it\mpmd-138\mod-4\target\surefire-reports\*.xml
[windows-jdk8] [withMaven] junitPublisher - Jenkins JUnit Attachments Plugin not found, can't publish test attachments.Recording test results
[windows-jdk8] None of the test reports contained any result
[windows-jdk8] [withMaven] Skip 'Findbugs Publisher' disabled by configuration
[windows-jdk8] [withMaven] Skip 'Open Task Scanner Publisher' disabled by configuration
[windows-jdk8] [withMaven] Skip 'Generated Artifacts Publisher' disabled by configuration
[windows-jdk8] [withMaven] Skip 'Findbugs Publisher' disabled by configuration
[windows-jdk8] [withMaven] Skip 'Open Task Scanner Publisher' disabled by configuration
[windows-jdk8] [withMaven] Skip 'Generated Artifacts Publisher' disabled by configuration
[windows-jdk8] [withMaven] Skip 'Findbugs Publisher' disabled by configuration
[windows-jdk8] [withMaven] Skip 'Open Task Scanner Publisher' disabled by configuration
[windows-jdk8] [withMaven] Skip 'Generated Artifacts Publisher' disabled by configuration
[windows-jdk8] [withMaven] Skip 'Findbugs Publisher' disabled by configuration
[windows-jdk8] [withMaven] Skip 'Open Task Scanner Publisher' disabled by configuration
[windows-jdk8] [withMaven] Skip 'Generated Artifacts Publisher' disabled by configuration
[windows-jdk8] [withMaven] junitPublisher - Archive test results for Maven artifact org.apache.maven.plugins.pmd.its:mpmd-168-empty-report-skipped:1.0-SNAPSHOT generated by maven-surefire-plugin:test (default-test): m\target\it\mpmd-168\target\surefire-reports\*.xml
[windows-jdk8] [withMaven] junitPublisher - Jenkins JUnit Attachments Plugin not found, can't publish test attachments.Recording test results
[windows-jdk8] None of the test reports contained any result
[windows-jdk8] [withMaven] Skip 'Findbugs Publisher' disabled by configuration
[windows-jdk8] [withMaven] Skip 'Open Task Scanner Publisher' disabled by configuration
[windows-jdk8] [withMaven] Skip 'Generated Artifacts Publisher' disabled by configuration
[windows-jdk8] [withMaven] junitPublisher - Archive test results for Maven artifact org.apache.maven.plugins.pmd.its:mpmd-168-empty-report:1.0-SNAPSHOT generated by maven-surefire-plugin:test (default-test): m\target\it\mpmd-168-empty-report\target\surefire-reports\*.xml
[windows-jdk8] [withMaven] junitPublisher - Jenkins JUnit Attachments Plugin not found, can't publish test attachments.Recording test results
[windows-jdk8] None of the test reports contained any result
[windows-jdk8] [withMaven] Skip 'Findbugs Publisher' disabled by configuration
[windows-jdk8] [withMaven] Skip 'Open Task Scanner Publisher' disabled by configuration
[windows-jdk8] [withMaven] Skip 'Generated Artifacts Publisher' disabled by configuration
[windows-jdk8] [withMaven] junitPublisher - Archive test results for Maven artifact org.apache.maven.plugins.pmd.its:MPMD-172:1.0-SNAPSHOT generated by maven-surefire-plugin:test (default-test): m\target\it\MPMD-172\target\surefire-reports\*.xml
[windows-jdk8] [withMaven] junitPublisher - Jenkins JUnit Attachments Plugin not found, can't publish test attachments.Recording test results
[windows-jdk8] None of the test reports contained any result
[windows-jdk8] [withMaven] Skip 'Findbugs Publisher' disabled by configuration
[windows-jdk8] [withMaven] Skip 'Open Task Scanner Publisher' disabled by configuration
[windows-jdk8] [withMaven] Skip 'Generated Artifacts Publisher' disabled by configuration
[windows-jdk8] [withMaven] junitPublisher - Archive test results for Maven artifact org.apache.maven.plugins.pmd.its:MPMD-181-benchmark:1.0-SNAPSHOT generated by maven-surefire-plugin:test (default-test): m\target\it\MPMD-181-benchmark\target\surefire-reports\*.xml
[windows-jdk8] [withMaven] junitPublisher - Jenkins JUnit Attachments Plugin not found, can't publish test attachments.Recording test results
[windows-jdk8] None of the test reports contained any result
[windows-jdk8] [withMaven] Skip 'Findbugs Publisher' disabled by configuration
[windows-jdk8] [withMaven] Skip 'Open Task Scanner Publisher' disabled by configuration
[windows-jdk8] [withMaven] Skip 'Generated Artifacts Publisher' disabled by configuration
[windows-jdk8] [withMaven] junitPublisher - Archive test results for Maven artifact org.apache.maven.plugins.pmd.its:MPMD-181-no-benchmark:1.0-SNAPSHOT generated by maven-surefire-plugin:test (default-test): m\target\it\MPMD-181-no-benchmark\target\surefire-reports\*.xml
[windows-jdk8] [withMaven] junitPublisher - Jenkins JUnit Attachments Plugin not found, can't publish test attachments.Recording test results
[windows-jdk8] None of the test reports contained any result
[windows-jdk8] [withMaven] Skip 'Findbugs Publisher' disabled by configuration
[windows-jdk8] [withMaven] Skip 'Open Task Scanner Publisher' disabled by configuration
[windows-jdk8] [withMaven] Skip 'Generated Artifacts Publisher' disabled by configuration
[windows-jdk8] [withMaven] junitPublisher - Archive test results for Maven artifact org.apache.maven.plugins.pmd.its:MPMD-182:1.0-SNAPSHOT generated by maven-surefire-plugin:test (default-test): m\target\it\MPMD-182\target\surefire-reports\*.xml
[windows-jdk8] [withMaven] junitPublisher - Jenkins JUnit Attachments Plugin not found, can't publish test attachments.Recording test results
[windows-jdk8] None of the test reports contained any result
[windows-jdk8] [withMaven] Skip 'Findbugs Publisher' disabled by configuration
[windows-jdk8] [withMaven] Skip 'Open Task Scanner Publisher' disabled by configuration
[windows-jdk8] [withMaven] Skip 'Generated Artifacts Publisher' disabled by configuration
[windows-jdk8] [withMaven] junitPublisher - Archive test results for Maven artifact org.apache.maven.plugins.pmd.its:MPMD-187:1.0-SNAPSHOT generated by maven-surefire-plugin:test (default-test): m\target\it\MPMD-187\target\surefire-reports\*.xml
[windows-jdk8] [withMaven] junitPublisher - Jenkins JUnit Attachments Plugin not found, can't publish test attachments.Recording test results
[windows-jdk8] None of the test reports contained any result
[windows-jdk8] [withMaven] Skip 'Findbugs Publisher' disabled by configuration
[windows-jdk8] [withMaven] Skip 'Open Task Scanner Publisher' disabled by configuration
[windows-jdk8] [withMaven] Skip 'Generated Artifacts Publisher' disabled by configuration
[windows-jdk8] [withMaven] junitPublisher - Archive test results for Maven artifact org.apache.maven.plugins.pmd.its:MPMD-205-pmd-js-check:1.0-SNAPSHOT generated by maven-surefire-plugin:test (default-test): m\target\it\MPMD-205-pmd-js-check\target\surefire-reports\*.xml
[windows-jdk8] [withMaven] junitPublisher - Jenkins JUnit Attachments Plugin not found, can't publish test attachments.Recording test results
[windows-jdk8] None of the test reports contained any result
[windows-jdk8] [withMaven] Skip 'Findbugs Publisher' disabled by configuration
[windows-jdk8] [withMaven] Skip 'Open Task Scanner Publisher' disabled by configuration
[windows-jdk8] [withMaven] Skip 'Generated Artifacts Publisher' disabled by configuration
[windows-jdk8] [withMaven] junitPublisher - Archive test results for Maven artifact org.apache.maven.plugins.pmd.its:MPMD-206-pmd-sourceDirectories-js:1.0-SNAPSHOT generated by maven-surefire-plugin:test (default-test): m\target\it\MPMD-206-sourceDirectories-js\target\surefire-reports\*.xml
[windows-jdk8] [withMaven] junitPublisher - Jenkins JUnit Attachments Plugin not found, can't publish test attachments.Recording test results
[windows-jdk8] None of the test reports contained any result
[windows-jdk8] [withMaven] Skip 'Findbugs Publisher' disabled by configuration
[windows-jdk8] [withMaven] Skip 'Open Task Scanner Publisher' disabled by configuration
[windows-jdk8] [withMaven] Skip 'Generated Artifacts Publisher' disabled by configuration
[windows-jdk8] [withMaven] Skip 'Findbugs Publisher' disabled by configuration
[windows-jdk8] [withMaven] Skip 'Open Task Scanner Publisher' disabled by configuration
[windows-jdk8] [withMaven] Skip 'Generated Artifacts Publisher' disabled by configuration
[windows-jdk8] [withMaven] junitPublisher - Archive test results for Maven artifact org.apache.maven.plugins.pmd.its.MPMD-234-analysis-cache:no-analysis-cache:1.0-SNAPSHOT generated by maven-surefire-plugin:test (default-test): m\target\it\MPMD-234-analysis-cache\no-analysis-cache\target\surefire-reports\*.xml
[windows-jdk8] [withMaven] junitPublisher - Jenkins JUnit Attachments Plugin not found, can't publish test attachments.Recording test results
[windows-jdk8] None of the test reports contained any result
[windows-jdk8] [withMaven] junitPublisher - Archive test results for Maven artifact org.apache.maven.plugins.pmd.its.MPMD-234-analysis-cache:default-analysis-cache:1.0-SNAPSHOT generated by maven-surefire-plugin:test (default-test): m\target\it\MPMD-234-analysis-cache\default-analysis-cache\target\surefire-reports\*.xml
[windows-jdk8] [withMaven] junitPublisher - Jenkins JUnit Attachments Plugin not found, can't publish test attachments.Recording test results
[windows-jdk8] None of the test reports contained any result
[windows-jdk8] [withMaven] junitPublisher - Archive test results for Maven artifact org.apache.maven.plugins.pmd.its.MPMD-234-analysis-cache:custom-analysis-cache:1.0-SNAPSHOT generated by maven-surefire-plugin:test (default-test): m\target\it\MPMD-234-analysis-cache\custom-analysis-cache\target\surefire-reports\*.xml
[windows-jdk8] [withMaven] junitPublisher - Jenkins JUnit Attachments Plugin not found, can't publish test attachments.Recording test results
[windows-jdk8] None of the test reports contained any result
[windows-jdk8] [withMaven] Skip 'Findbugs Publisher' disabled by configuration
[windows-jdk8] [withMaven] Skip 'Open Task Scanner Publisher' disabled by configuration
[windows-jdk8] [withMaven] Skip 'Generated Artifacts Publisher' disabled by configuration
[windows-jdk8] [withMaven] Skip 'Findbugs Publisher' disabled by configuration
[windows-jdk8] [withMaven] Skip 'Open Task Scanner Publisher' disabled by configuration
[windows-jdk8] [withMaven] Skip 'Generated Artifacts Publisher' disabled by configuration
[windows-jdk8] [withMaven] Skip 'Findbugs Publisher' disabled by configuration
[windows-jdk8] [withMaven] Skip 'Open Task Scanner Publisher' disabled by configuration
[windows-jdk8] [withMaven] Skip 'Generated Artifacts Publisher' disabled by configuration
[windows-jdk8] [withMaven] Skip 'Findbugs Publisher' disabled by configuration
[windows-jdk8] [withMaven] Skip 'Open Task Scanner Publisher' disabled by configuration
[windows-jdk8] [withMaven] Skip 'Generated Artifacts Publisher' disabled by configuration
[windows-jdk8] [withMaven] Skip 'Findbugs Publisher' disabled by configuration
[windows-jdk8] [withMaven] Skip 'Open Task Scanner Publisher' disabled by configuration
[Pipeline] [windows-jdk7] // node
[Pipeline] [windows-jdk9] // node
[Pipeline] [windows-jdk8] // withMaven
[Pipeline] [windows-jdk7] }
[Pipeline] [windows-jdk9] }
[Pipeline] [windows-jdk8] }
[Pipeline] [windows-jdk8] // stage
[Pipeline] [windows-jdk8] }
[Pipeline] [windows-jdk8] // node
[Pipeline] [windows-jdk8] }
[Pipeline] // parallel
[Pipeline] stage
[Pipeline] { (Notifications)
[Pipeline] echo
Build result: UNSTABLE
[Pipeline] jiraIssueSelector
[Pipeline] emailext

Build unstable in Jenkins: Maven TLP » maven-pmd-plugin » master #6

Posted by Apache Jenkins Server <je...@builds.apache.org>.
See https://builds.apache.org/job/maven-box/job/maven-pmd-plugin/job/master/6/

Changes:

* Use random port for wiremock based unit test
* Use random port for wiremock based unit test
* Use random port for wiremock based unit test
* Use random port for wiremock based unit test
* Use random port for wiremock based unit test

2 tests failed.
FAILED:  org.apache.maven.plugins.pmd.PmdReportTest.testFileURL

Error Message:
java.lang.RuntimeException: java.net.BindException: Address already in use: bind

Stack Trace:
com.github.tomakehurst.wiremock.common.FatalStartupException: java.lang.RuntimeException: java.net.BindException: Address already in use: bind
	at org.apache.maven.plugins.pmd.PmdReportTest.testFileURL(PmdReportTest.java:151)
Caused by: java.lang.RuntimeException: java.net.BindException: Address already in use: bind
	at org.apache.maven.plugins.pmd.PmdReportTest.testFileURL(PmdReportTest.java:151)
Caused by: java.net.BindException: Address already in use: bind
	at org.apache.maven.plugins.pmd.PmdReportTest.testFileURL(PmdReportTest.java:151)


FAILED:  org.apache.maven.plugins.pmd.PmdReportTest.testEmptyReportConfiguration

Error Message:
File f:\jenkins\jenkins-slave\workspace\box_maven-pmd-plugin_master-723XUI4HKC5A6CYF5JA2PBPNJGNR6SKD4M55XBOMRDY4Z3ISJGVQ@2\m\target\test\unit\default-configuration\target\cpd.xml unable to be deleted.

Stack Trace:
java.io.IOException: File f:\jenkins\jenkins-slave\workspace\box_maven-pmd-plugin_master-723XUI4HKC5A6CYF5JA2PBPNJGNR6SKD4M55XBOMRDY4Z3ISJGVQ@2\m\target\test\unit\default-configuration\target\cpd.xml unable to be deleted.
	at org.apache.maven.plugins.pmd.PmdReportTest.setUp(PmdReportTest.java:52)




Build log:
[...truncated 321.96 KB...]
[windows-jdk7] [withMaven] junitPublisher - Archive test results for Maven artifact org.apache.maven.plugins:maven-pmd-plugin:3.9.0-SNAPSHOT generated by maven-surefire-plugin:test (default-test): m\target\surefire-reports\*.xml
[windows-jdk7] [withMaven] junitPublisher - Jenkins JUnit Attachments Plugin not found, can't publish test attachments.Recording test results
[windows-jdk7] [withMaven] Skip 'Findbugs Publisher' disabled by configuration
[windows-jdk7] [withMaven] Skip 'Open Task Scanner Publisher' disabled by configuration
[windows-jdk7] [withMaven] Skip 'Generated Artifacts Publisher' disabled by configuration
[windows-jdk7] [withMaven] junitPublisher - Archive test results for Maven artifact org.apache.maven.plugins.pmd.it:empty-rulests:1.0-SNAPSHOT generated by maven-surefire-plugin:test (default-test): m\target\it\empty-rulesets\target\surefire-reports\*.xml
[windows-jdk7] [withMaven] junitPublisher - Jenkins JUnit Attachments Plugin not found, can't publish test attachments.Recording test results
[windows-jdk7] None of the test reports contained any result
[windows-jdk7] [withMaven] Skip 'Findbugs Publisher' disabled by configuration
[windows-jdk7] [withMaven] Skip 'Open Task Scanner Publisher' disabled by configuration
[windows-jdk7] [withMaven] Skip 'Generated Artifacts Publisher' disabled by configuration
[windows-jdk7] [withMaven] junitPublisher - Archive test results for Maven artifact org.apache.maven.plugins.pmd.its:mpmd-138-mod-1:1.0-SNAPSHOT generated by maven-surefire-plugin:test (default-test): m\target\it\mpmd-138\mod-1\target\surefire-reports\*.xml
[windows-jdk7] [withMaven] junitPublisher - Jenkins JUnit Attachments Plugin not found, can't publish test attachments.Recording test results
[windows-jdk7] None of the test reports contained any result
[windows-jdk7] [withMaven] junitPublisher - Archive test results for Maven artifact org.apache.maven.plugins.pmd.its:mpmd-138-mod-2:1.0-SNAPSHOT generated by maven-surefire-plugin:test (default-test): m\target\it\mpmd-138\mod-2\target\surefire-reports\*.xml
[windows-jdk7] [withMaven] junitPublisher - Jenkins JUnit Attachments Plugin not found, can't publish test attachments.Recording test results
[windows-jdk7] None of the test reports contained any result
[windows-jdk7] [withMaven] junitPublisher - Archive test results for Maven artifact org.apache.maven.plugins.pmd.its:mpmd-138-mod-3:1.0-SNAPSHOT generated by maven-surefire-plugin:test (default-test): m\target\it\mpmd-138\mod-3\target\surefire-reports\*.xml
[windows-jdk7] [withMaven] junitPublisher - Jenkins JUnit Attachments Plugin not found, can't publish test attachments.Recording test results
[windows-jdk7] None of the test reports contained any result
[windows-jdk7] [withMaven] junitPublisher - Archive test results for Maven artifact org.apache.maven.plugins.pmd.its:mpmd-138-mod-4:1.0-SNAPSHOT generated by maven-surefire-plugin:test (default-test): m\target\it\mpmd-138\mod-4\target\surefire-reports\*.xml
[windows-jdk7] [withMaven] junitPublisher - Jenkins JUnit Attachments Plugin not found, can't publish test attachments.Recording test results
[windows-jdk7] None of the test reports contained any result
[windows-jdk7] [withMaven] Skip 'Findbugs Publisher' disabled by configuration
[windows-jdk7] [withMaven] Skip 'Open Task Scanner Publisher' disabled by configuration
[windows-jdk7] [withMaven] Skip 'Generated Artifacts Publisher' disabled by configuration
[windows-jdk7] [withMaven] Skip 'Findbugs Publisher' disabled by configuration
[windows-jdk7] [withMaven] Skip 'Open Task Scanner Publisher' disabled by configuration
[windows-jdk7] [withMaven] Skip 'Generated Artifacts Publisher' disabled by configuration
[windows-jdk7] [withMaven] Skip 'Findbugs Publisher' disabled by configuration
[windows-jdk7] [withMaven] Skip 'Open Task Scanner Publisher' disabled by configuration
[windows-jdk7] [withMaven] Skip 'Generated Artifacts Publisher' disabled by configuration
[windows-jdk7] [withMaven] Skip 'Findbugs Publisher' disabled by configuration
[windows-jdk7] [withMaven] Skip 'Open Task Scanner Publisher' disabled by configuration
[windows-jdk7] [withMaven] Skip 'Generated Artifacts Publisher' disabled by configuration
[windows-jdk7] [withMaven] junitPublisher - Archive test results for Maven artifact org.apache.maven.plugins.pmd.its:mpmd-168-empty-report-skipped:1.0-SNAPSHOT generated by maven-surefire-plugin:test (default-test): m\target\it\mpmd-168\target\surefire-reports\*.xml
[windows-jdk7] [withMaven] junitPublisher - Jenkins JUnit Attachments Plugin not found, can't publish test attachments.Recording test results
[windows-jdk7] None of the test reports contained any result
[windows-jdk7] [withMaven] Skip 'Findbugs Publisher' disabled by configuration
[windows-jdk7] [withMaven] Skip 'Open Task Scanner Publisher' disabled by configuration
[windows-jdk7] [withMaven] Skip 'Generated Artifacts Publisher' disabled by configuration
[windows-jdk7] [withMaven] junitPublisher - Archive test results for Maven artifact org.apache.maven.plugins.pmd.its:mpmd-168-empty-report:1.0-SNAPSHOT generated by maven-surefire-plugin:test (default-test): m\target\it\mpmd-168-empty-report\target\surefire-reports\*.xml
[windows-jdk7] [withMaven] junitPublisher - Jenkins JUnit Attachments Plugin not found, can't publish test attachments.Recording test results
[windows-jdk7] None of the test reports contained any result
[windows-jdk7] [withMaven] Skip 'Findbugs Publisher' disabled by configuration
[windows-jdk7] [withMaven] Skip 'Open Task Scanner Publisher' disabled by configuration
[windows-jdk7] [withMaven] Skip 'Generated Artifacts Publisher' disabled by configuration
[windows-jdk7] [withMaven] junitPublisher - Archive test results for Maven artifact org.apache.maven.plugins.pmd.its:MPMD-172:1.0-SNAPSHOT generated by maven-surefire-plugin:test (default-test): m\target\it\MPMD-172\target\surefire-reports\*.xml
[windows-jdk7] [withMaven] junitPublisher - Jenkins JUnit Attachments Plugin not found, can't publish test attachments.Recording test results
[windows-jdk7] None of the test reports contained any result
[windows-jdk7] [withMaven] Skip 'Findbugs Publisher' disabled by configuration
[windows-jdk7] [withMaven] Skip 'Open Task Scanner Publisher' disabled by configuration
[windows-jdk7] [withMaven] Skip 'Generated Artifacts Publisher' disabled by configuration
[windows-jdk7] [withMaven] junitPublisher - Archive test results for Maven artifact org.apache.maven.plugins.pmd.its:MPMD-181-benchmark:1.0-SNAPSHOT generated by maven-surefire-plugin:test (default-test): m\target\it\MPMD-181-benchmark\target\surefire-reports\*.xml
[windows-jdk7] [withMaven] junitPublisher - Jenkins JUnit Attachments Plugin not found, can't publish test attachments.Recording test results
[windows-jdk7] None of the test reports contained any result
[windows-jdk7] [withMaven] Skip 'Findbugs Publisher' disabled by configuration
[windows-jdk7] [withMaven] Skip 'Open Task Scanner Publisher' disabled by configuration
[windows-jdk7] [withMaven] Skip 'Generated Artifacts Publisher' disabled by configuration
[windows-jdk7] [withMaven] junitPublisher - Archive test results for Maven artifact org.apache.maven.plugins.pmd.its:MPMD-181-no-benchmark:1.0-SNAPSHOT generated by maven-surefire-plugin:test (default-test): m\target\it\MPMD-181-no-benchmark\target\surefire-reports\*.xml
[windows-jdk7] [withMaven] junitPublisher - Jenkins JUnit Attachments Plugin not found, can't publish test attachments.Recording test results
[windows-jdk7] None of the test reports contained any result
[windows-jdk7] [withMaven] Skip 'Findbugs Publisher' disabled by configuration
[windows-jdk7] [withMaven] Skip 'Open Task Scanner Publisher' disabled by configuration
[windows-jdk7] [withMaven] Skip 'Generated Artifacts Publisher' disabled by configuration
[windows-jdk7] [withMaven] junitPublisher - Archive test results for Maven artifact org.apache.maven.plugins.pmd.its:MPMD-187:1.0-SNAPSHOT generated by maven-surefire-plugin:test (default-test): m\target\it\MPMD-187\target\surefire-reports\*.xml
[windows-jdk7] [withMaven] junitPublisher - Jenkins JUnit Attachments Plugin not found, can't publish test attachments.Recording test results
[windows-jdk7] None of the test reports contained any result
[windows-jdk7] [withMaven] Skip 'Findbugs Publisher' disabled by configuration
[windows-jdk7] [withMaven] Skip 'Open Task Scanner Publisher' disabled by configuration
[windows-jdk7] [withMaven] Skip 'Generated Artifacts Publisher' disabled by configuration
[windows-jdk7] [withMaven] junitPublisher - Archive test results for Maven artifact org.apache.maven.plugins.pmd.its:MPMD-205-pmd-js-check:1.0-SNAPSHOT generated by maven-surefire-plugin:test (default-test): m\target\it\MPMD-205-pmd-js-check\target\surefire-reports\*.xml
[windows-jdk7] [withMaven] junitPublisher - Jenkins JUnit Attachments Plugin not found, can't publish test attachments.Recording test results
[windows-jdk7] None of the test reports contained any result
[windows-jdk7] [withMaven] Skip 'Findbugs Publisher' disabled by configuration
[windows-jdk7] [withMaven] Skip 'Open Task Scanner Publisher' disabled by configuration
[windows-jdk7] [withMaven] Skip 'Generated Artifacts Publisher' disabled by configuration
[windows-jdk7] [withMaven] junitPublisher - Archive test results for Maven artifact org.apache.maven.plugins.pmd.its:MPMD-206-pmd-sourceDirectories-js:1.0-SNAPSHOT generated by maven-surefire-plugin:test (default-test): m\target\it\MPMD-206-sourceDirectories-js\target\surefire-reports\*.xml
[windows-jdk7] [withMaven] junitPublisher - Jenkins JUnit Attachments Plugin not found, can't publish test attachments.Recording test results
[windows-jdk7] None of the test reports contained any result
[windows-jdk7] [withMaven] Skip 'Findbugs Publisher' disabled by configuration
[windows-jdk7] [withMaven] Skip 'Open Task Scanner Publisher' disabled by configuration
[windows-jdk7] [withMaven] Skip 'Generated Artifacts Publisher' disabled by configuration
[windows-jdk7] [withMaven] Skip 'Findbugs Publisher' disabled by configuration
[windows-jdk7] [withMaven] Skip 'Open Task Scanner Publisher' disabled by configuration
[windows-jdk7] [withMaven] Skip 'Generated Artifacts Publisher' disabled by configuration
[windows-jdk7] [withMaven] junitPublisher - Archive test results for Maven artifact org.apache.maven.plugins.pmd.its.MPMD-234-analysis-cache:no-analysis-cache:1.0-SNAPSHOT generated by maven-surefire-plugin:test (default-test): m\target\it\MPMD-234-analysis-cache\no-analysis-cache\target\surefire-reports\*.xml
[windows-jdk7] [withMaven] junitPublisher - Jenkins JUnit Attachments Plugin not found, can't publish test attachments.Recording test results
[windows-jdk7] None of the test reports contained any result
[windows-jdk7] [withMaven] junitPublisher - Archive test results for Maven artifact org.apache.maven.plugins.pmd.its.MPMD-234-analysis-cache:default-analysis-cache:1.0-SNAPSHOT generated by maven-surefire-plugin:test (default-test): m\target\it\MPMD-234-analysis-cache\default-analysis-cache\target\surefire-reports\*.xml
[windows-jdk7] [withMaven] junitPublisher - Jenkins JUnit Attachments Plugin not found, can't publish test attachments.Recording test results
[windows-jdk7] None of the test reports contained any result
[windows-jdk7] [withMaven] junitPublisher - Archive test results for Maven artifact org.apache.maven.plugins.pmd.its.MPMD-234-analysis-cache:custom-analysis-cache:1.0-SNAPSHOT generated by maven-surefire-plugin:test (default-test): m\target\it\MPMD-234-analysis-cache\custom-analysis-cache\target\surefire-reports\*.xml
[windows-jdk7] [withMaven] junitPublisher - Jenkins JUnit Attachments Plugin not found, can't publish test attachments.Recording test results
[windows-jdk7] None of the test reports contained any result
[windows-jdk7] [withMaven] Skip 'Findbugs Publisher' disabled by configuration
[windows-jdk7] [withMaven] Skip 'Open Task Scanner Publisher' disabled by configuration
[windows-jdk7] [withMaven] Skip 'Generated Artifacts Publisher' disabled by configuration
[windows-jdk7] [withMaven] Skip 'Findbugs Publisher' disabled by configuration
[windows-jdk7] [withMaven] Skip 'Open Task Scanner Publisher' disabled by configuration
[windows-jdk7] [withMaven] Skip 'Generated Artifacts Publisher' disabled by configuration
[windows-jdk7] [withMaven] Skip 'Findbugs Publisher' disabled by configuration
[windows-jdk7] [withMaven] Skip 'Open Task Scanner Publisher' disabled by configuration
[windows-jdk7] [withMaven] Skip 'Generated Artifacts Publisher' disabled by configuration
[windows-jdk7] [withMaven] Skip 'Findbugs Publisher' disabled by configuration
[windows-jdk7] [withMaven] Skip 'Open Task Scanner Publisher' disabled by configuration
[windows-jdk7] [withMaven] Skip 'Generated Artifacts Publisher' disabled by configuration
[windows-jdk7] [withMaven] Skip 'Findbugs Publisher' disabled by configuration
[windows-jdk7] [withMaven] Skip 'Open Task Scanner Publisher' disabled by configuration
[Pipeline] [windows-jdk9] // node
[Pipeline] [windows-jdk7] // withMaven
[Pipeline] [windows-jdk9] }
[Pipeline] [windows-jdk7] }
[Pipeline] [windows-jdk8] }
[Pipeline] [windows-jdk7] // stage
[Pipeline] [windows-jdk8] // dir
[Pipeline] [windows-jdk7] }
[Pipeline] [windows-jdk8] }
[windows-jdk8] [withMaven] Skip 'Generated Artifacts Publisher' disabled by configuration
[windows-jdk8] [withMaven] junitPublisher - Archive test results for Maven artifact org.apache.maven.plugins:maven-pmd-plugin:3.9.0-SNAPSHOT generated by maven-surefire-plugin:test (default-test): m\target\surefire-reports\*.xml
[windows-jdk8] [withMaven] junitPublisher - Jenkins JUnit Attachments Plugin not found, can't publish test attachments.Recording test results
[windows-jdk8] [withMaven] Skip 'Findbugs Publisher' disabled by configuration
[windows-jdk8] [withMaven] Skip 'Open Task Scanner Publisher' disabled by configuration
[windows-jdk8] [withMaven] Skip 'Generated Artifacts Publisher' disabled by configuration
[windows-jdk8] [withMaven] junitPublisher - Archive test results for Maven artifact org.apache.maven.plugins.pmd.it:empty-rulests:1.0-SNAPSHOT generated by maven-surefire-plugin:test (default-test): m\target\it\empty-rulesets\target\surefire-reports\*.xml
[windows-jdk8] [withMaven] junitPublisher - Jenkins JUnit Attachments Plugin not found, can't publish test attachments.Recording test results
[windows-jdk8] None of the test reports contained any result
[windows-jdk8] [withMaven] Skip 'Findbugs Publisher' disabled by configuration
[windows-jdk8] [withMaven] Skip 'Open Task Scanner Publisher' disabled by configuration
[windows-jdk8] [withMaven] Skip 'Generated Artifacts Publisher' disabled by configuration
[windows-jdk8] [withMaven] junitPublisher - Archive test results for Maven artifact org.apache.maven.plugins.pmd.its:mpmd-138-mod-1:1.0-SNAPSHOT generated by maven-surefire-plugin:test (default-test): m\target\it\mpmd-138\mod-1\target\surefire-reports\*.xml
[windows-jdk8] [withMaven] junitPublisher - Jenkins JUnit Attachments Plugin not found, can't publish test attachments.Recording test results
[windows-jdk8] None of the test reports contained any result
[windows-jdk8] [withMaven] junitPublisher - Archive test results for Maven artifact org.apache.maven.plugins.pmd.its:mpmd-138-mod-2:1.0-SNAPSHOT generated by maven-surefire-plugin:test (default-test): m\target\it\mpmd-138\mod-2\target\surefire-reports\*.xml
[windows-jdk8] [withMaven] junitPublisher - Jenkins JUnit Attachments Plugin not found, can't publish test attachments.Recording test results
[windows-jdk8] None of the test reports contained any result
[windows-jdk8] [withMaven] junitPublisher - Archive test results for Maven artifact org.apache.maven.plugins.pmd.its:mpmd-138-mod-3:1.0-SNAPSHOT generated by maven-surefire-plugin:test (default-test): m\target\it\mpmd-138\mod-3\target\surefire-reports\*.xml
[windows-jdk8] [withMaven] junitPublisher - Jenkins JUnit Attachments Plugin not found, can't publish test attachments.Recording test results
[windows-jdk8] None of the test reports contained any result
[windows-jdk8] [withMaven] junitPublisher - Archive test results for Maven artifact org.apache.maven.plugins.pmd.its:mpmd-138-mod-4:1.0-SNAPSHOT generated by maven-surefire-plugin:test (default-test): m\target\it\mpmd-138\mod-4\target\surefire-reports\*.xml
[windows-jdk8] [withMaven] junitPublisher - Jenkins JUnit Attachments Plugin not found, can't publish test attachments.Recording test results
[windows-jdk8] None of the test reports contained any result
[windows-jdk8] [withMaven] Skip 'Findbugs Publisher' disabled by configuration
[windows-jdk8] [withMaven] Skip 'Open Task Scanner Publisher' disabled by configuration
[windows-jdk8] [withMaven] Skip 'Generated Artifacts Publisher' disabled by configuration
[windows-jdk8] [withMaven] Skip 'Findbugs Publisher' disabled by configuration
[windows-jdk8] [withMaven] Skip 'Open Task Scanner Publisher' disabled by configuration
[windows-jdk8] [withMaven] Skip 'Generated Artifacts Publisher' disabled by configuration
[windows-jdk8] [withMaven] Skip 'Findbugs Publisher' disabled by configuration
[windows-jdk8] [withMaven] Skip 'Open Task Scanner Publisher' disabled by configuration
[windows-jdk8] [withMaven] Skip 'Generated Artifacts Publisher' disabled by configuration
[windows-jdk8] [withMaven] Skip 'Findbugs Publisher' disabled by configuration
[windows-jdk8] [withMaven] Skip 'Open Task Scanner Publisher' disabled by configuration
[windows-jdk8] [withMaven] Skip 'Generated Artifacts Publisher' disabled by configuration
[windows-jdk8] [withMaven] junitPublisher - Archive test results for Maven artifact org.apache.maven.plugins.pmd.its:mpmd-168-empty-report-skipped:1.0-SNAPSHOT generated by maven-surefire-plugin:test (default-test): m\target\it\mpmd-168\target\surefire-reports\*.xml
[windows-jdk8] [withMaven] junitPublisher - Jenkins JUnit Attachments Plugin not found, can't publish test attachments.Recording test results
[windows-jdk8] None of the test reports contained any result
[windows-jdk8] [withMaven] Skip 'Findbugs Publisher' disabled by configuration
[windows-jdk8] [withMaven] Skip 'Open Task Scanner Publisher' disabled by configuration
[windows-jdk8] [withMaven] Skip 'Generated Artifacts Publisher' disabled by configuration
[windows-jdk8] [withMaven] junitPublisher - Archive test results for Maven artifact org.apache.maven.plugins.pmd.its:mpmd-168-empty-report:1.0-SNAPSHOT generated by maven-surefire-plugin:test (default-test): m\target\it\mpmd-168-empty-report\target\surefire-reports\*.xml
[windows-jdk8] [withMaven] junitPublisher - Jenkins JUnit Attachments Plugin not found, can't publish test attachments.Recording test results
[windows-jdk8] None of the test reports contained any result
[windows-jdk8] [withMaven] Skip 'Findbugs Publisher' disabled by configuration
[windows-jdk8] [withMaven] Skip 'Open Task Scanner Publisher' disabled by configuration
[windows-jdk8] [withMaven] Skip 'Generated Artifacts Publisher' disabled by configuration
[windows-jdk8] [withMaven] junitPublisher - Archive test results for Maven artifact org.apache.maven.plugins.pmd.its:MPMD-172:1.0-SNAPSHOT generated by maven-surefire-plugin:test (default-test): m\target\it\MPMD-172\target\surefire-reports\*.xml
[windows-jdk8] [withMaven] junitPublisher - Jenkins JUnit Attachments Plugin not found, can't publish test attachments.Recording test results
[windows-jdk8] None of the test reports contained any result
[windows-jdk8] [withMaven] Skip 'Findbugs Publisher' disabled by configuration
[windows-jdk8] [withMaven] Skip 'Open Task Scanner Publisher' disabled by configuration
[windows-jdk8] [withMaven] Skip 'Generated Artifacts Publisher' disabled by configuration
[windows-jdk8] [withMaven] junitPublisher - Archive test results for Maven artifact org.apache.maven.plugins.pmd.its:MPMD-181-benchmark:1.0-SNAPSHOT generated by maven-surefire-plugin:test (default-test): m\target\it\MPMD-181-benchmark\target\surefire-reports\*.xml
[windows-jdk8] [withMaven] junitPublisher - Jenkins JUnit Attachments Plugin not found, can't publish test attachments.Recording test results
[windows-jdk8] None of the test reports contained any result
[windows-jdk8] [withMaven] Skip 'Findbugs Publisher' disabled by configuration
[windows-jdk8] [withMaven] Skip 'Open Task Scanner Publisher' disabled by configuration
[windows-jdk8] [withMaven] Skip 'Generated Artifacts Publisher' disabled by configuration
[windows-jdk8] [withMaven] junitPublisher - Archive test results for Maven artifact org.apache.maven.plugins.pmd.its:MPMD-181-no-benchmark:1.0-SNAPSHOT generated by maven-surefire-plugin:test (default-test): m\target\it\MPMD-181-no-benchmark\target\surefire-reports\*.xml
[windows-jdk8] [withMaven] junitPublisher - Jenkins JUnit Attachments Plugin not found, can't publish test attachments.Recording test results
[windows-jdk8] None of the test reports contained any result
[windows-jdk8] [withMaven] Skip 'Findbugs Publisher' disabled by configuration
[windows-jdk8] [withMaven] Skip 'Open Task Scanner Publisher' disabled by configuration
[windows-jdk8] [withMaven] Skip 'Generated Artifacts Publisher' disabled by configuration
[windows-jdk8] [withMaven] junitPublisher - Archive test results for Maven artifact org.apache.maven.plugins.pmd.its:MPMD-182:1.0-SNAPSHOT generated by maven-surefire-plugin:test (default-test): m\target\it\MPMD-182\target\surefire-reports\*.xml
[windows-jdk8] [withMaven] junitPublisher - Jenkins JUnit Attachments Plugin not found, can't publish test attachments.Recording test results
[windows-jdk8] None of the test reports contained any result
[windows-jdk8] [withMaven] Skip 'Findbugs Publisher' disabled by configuration
[windows-jdk8] [withMaven] Skip 'Open Task Scanner Publisher' disabled by configuration
[windows-jdk8] [withMaven] Skip 'Generated Artifacts Publisher' disabled by configuration
[windows-jdk8] [withMaven] junitPublisher - Archive test results for Maven artifact org.apache.maven.plugins.pmd.its:MPMD-187:1.0-SNAPSHOT generated by maven-surefire-plugin:test (default-test): m\target\it\MPMD-187\target\surefire-reports\*.xml
[windows-jdk8] [withMaven] junitPublisher - Jenkins JUnit Attachments Plugin not found, can't publish test attachments.Recording test results
[windows-jdk8] None of the test reports contained any result
[windows-jdk8] [withMaven] Skip 'Findbugs Publisher' disabled by configuration
[windows-jdk8] [withMaven] Skip 'Open Task Scanner Publisher' disabled by configuration
[windows-jdk8] [withMaven] Skip 'Generated Artifacts Publisher' disabled by configuration
[windows-jdk8] [withMaven] junitPublisher - Archive test results for Maven artifact org.apache.maven.plugins.pmd.its:MPMD-205-pmd-js-check:1.0-SNAPSHOT generated by maven-surefire-plugin:test (default-test): m\target\it\MPMD-205-pmd-js-check\target\surefire-reports\*.xml
[windows-jdk8] [withMaven] junitPublisher - Jenkins JUnit Attachments Plugin not found, can't publish test attachments.Recording test results
[windows-jdk8] None of the test reports contained any result
[windows-jdk8] [withMaven] Skip 'Findbugs Publisher' disabled by configuration
[windows-jdk8] [withMaven] Skip 'Open Task Scanner Publisher' disabled by configuration
[windows-jdk8] [withMaven] Skip 'Generated Artifacts Publisher' disabled by configuration
[windows-jdk8] [withMaven] junitPublisher - Archive test results for Maven artifact org.apache.maven.plugins.pmd.its:MPMD-206-pmd-sourceDirectories-js:1.0-SNAPSHOT generated by maven-surefire-plugin:test (default-test): m\target\it\MPMD-206-sourceDirectories-js\target\surefire-reports\*.xml
[windows-jdk8] [withMaven] junitPublisher - Jenkins JUnit Attachments Plugin not found, can't publish test attachments.Recording test results
[windows-jdk8] None of the test reports contained any result
[windows-jdk8] [withMaven] Skip 'Findbugs Publisher' disabled by configuration
[windows-jdk8] [withMaven] Skip 'Open Task Scanner Publisher' disabled by configuration
[windows-jdk8] [withMaven] Skip 'Generated Artifacts Publisher' disabled by configuration
[windows-jdk8] [withMaven] Skip 'Findbugs Publisher' disabled by configuration
[windows-jdk8] [withMaven] Skip 'Open Task Scanner Publisher' disabled by configuration
[windows-jdk8] [withMaven] Skip 'Generated Artifacts Publisher' disabled by configuration
[windows-jdk8] [withMaven] junitPublisher - Archive test results for Maven artifact org.apache.maven.plugins.pmd.its.MPMD-234-analysis-cache:no-analysis-cache:1.0-SNAPSHOT generated by maven-surefire-plugin:test (default-test): m\target\it\MPMD-234-analysis-cache\no-analysis-cache\target\surefire-reports\*.xml
[windows-jdk8] [withMaven] junitPublisher - Jenkins JUnit Attachments Plugin not found, can't publish test attachments.Recording test results
[windows-jdk8] None of the test reports contained any result
[windows-jdk8] [withMaven] junitPublisher - Archive test results for Maven artifact org.apache.maven.plugins.pmd.its.MPMD-234-analysis-cache:default-analysis-cache:1.0-SNAPSHOT generated by maven-surefire-plugin:test (default-test): m\target\it\MPMD-234-analysis-cache\default-analysis-cache\target\surefire-reports\*.xml
[windows-jdk8] [withMaven] junitPublisher - Jenkins JUnit Attachments Plugin not found, can't publish test attachments.Recording test results
[windows-jdk8] None of the test reports contained any result
[windows-jdk8] [withMaven] junitPublisher - Archive test results for Maven artifact org.apache.maven.plugins.pmd.its.MPMD-234-analysis-cache:custom-analysis-cache:1.0-SNAPSHOT generated by maven-surefire-plugin:test (default-test): m\target\it\MPMD-234-analysis-cache\custom-analysis-cache\target\surefire-reports\*.xml
[windows-jdk8] [withMaven] junitPublisher - Jenkins JUnit Attachments Plugin not found, can't publish test attachments.Recording test results
[windows-jdk8] None of the test reports contained any result
[windows-jdk8] [withMaven] Skip 'Findbugs Publisher' disabled by configuration
[windows-jdk8] [withMaven] Skip 'Open Task Scanner Publisher' disabled by configuration
[windows-jdk8] [withMaven] Skip 'Generated Artifacts Publisher' disabled by configuration
[windows-jdk8] [withMaven] Skip 'Findbugs Publisher' disabled by configuration
[windows-jdk8] [withMaven] Skip 'Open Task Scanner Publisher' disabled by configuration
[windows-jdk8] [withMaven] Skip 'Generated Artifacts Publisher' disabled by configuration
[windows-jdk8] [withMaven] Skip 'Findbugs Publisher' disabled by configuration
[windows-jdk8] [withMaven] Skip 'Open Task Scanner Publisher' disabled by configuration
[windows-jdk8] [withMaven] Skip 'Generated Artifacts Publisher' disabled by configuration
[windows-jdk8] [withMaven] Skip 'Findbugs Publisher' disabled by configuration
[windows-jdk8] [withMaven] Skip 'Open Task Scanner Publisher' disabled by configuration
[windows-jdk8] [withMaven] Skip 'Generated Artifacts Publisher' disabled by configuration
[windows-jdk8] [withMaven] Skip 'Findbugs Publisher' disabled by configuration
[windows-jdk8] [withMaven] Skip 'Open Task Scanner Publisher' disabled by configuration
[Pipeline] [windows-jdk7] // node
[Pipeline] [windows-jdk8] // withMaven
[Pipeline] [windows-jdk7] }
[Pipeline] [windows-jdk8] }
[Pipeline] [windows-jdk8] // stage
[Pipeline] [windows-jdk8] }
[Pipeline] [windows-jdk8] // node
[Pipeline] [windows-jdk8] }
[Pipeline] // parallel
[Pipeline] stage
[Pipeline] { (Notifications)
[Pipeline] echo
Build result: UNSTABLE
[Pipeline] jiraIssueSelector
[Pipeline] emailext

Build unstable in Jenkins: Maven TLP » maven-pmd-plugin » master #5

Posted by Apache Jenkins Server <je...@builds.apache.org>.
See https://builds.apache.org/job/maven-box/job/maven-pmd-plugin/job/master/5/

No changes.

1 tests failed.
FAILED:  org.apache.maven.plugins.pmd.PmdReportTest.testEmptyReportConfiguration

Error Message:
File f:\jenkins\jenkins-slave\workspace\box_maven-pmd-plugin_master-723XUI4HKC5A6CYF5JA2PBPNJGNR6SKD4M55XBOMRDY4Z3ISJGVQ@2\m\target\test\unit\default-configuration\target\cpd.xml unable to be deleted.

Stack Trace:
java.io.IOException: File f:\jenkins\jenkins-slave\workspace\box_maven-pmd-plugin_master-723XUI4HKC5A6CYF5JA2PBPNJGNR6SKD4M55XBOMRDY4Z3ISJGVQ@2\m\target\test\unit\default-configuration\target\cpd.xml unable to be deleted.
	at org.apache.maven.plugins.pmd.PmdReportTest.setUp(PmdReportTest.java:52)




Build log:
[...truncated 631.71 KB...]
[windows-jdk8] [withMaven] Skip 'Findbugs Publisher' disabled by configuration
[windows-jdk8] [withMaven] Skip 'Open Task Scanner Publisher' disabled by configuration
[windows-jdk8] [withMaven] Skip 'Generated Artifacts Publisher' disabled by configuration
[windows-jdk8] [withMaven] Skip 'Findbugs Publisher' disabled by configuration
[windows-jdk8] [withMaven] Skip 'Open Task Scanner Publisher' disabled by configuration
[windows-jdk8] [withMaven] Skip 'Generated Artifacts Publisher' disabled by configuration
[windows-jdk8] [withMaven] Skip 'Findbugs Publisher' disabled by configuration
[windows-jdk8] [withMaven] Skip 'Open Task Scanner Publisher' disabled by configuration
[windows-jdk8] [withMaven] Skip 'Generated Artifacts Publisher' disabled by configuration
[windows-jdk8] [withMaven] Skip 'Findbugs Publisher' disabled by configuration
[windows-jdk8] [withMaven] Skip 'Open Task Scanner Publisher' disabled by configuration
[windows-jdk8] [withMaven] Skip 'Generated Artifacts Publisher' disabled by configuration
[windows-jdk8] [withMaven] junitPublisher - Archive test results for Maven artifact org.apache.maven.plugins.pmd.its:mpmd-168-empty-report-skipped:1.0-SNAPSHOT generated by maven-surefire-plugin:test (default-test): m\target\it\mpmd-168\target\surefire-reports\*.xml
[windows-jdk8] [withMaven] junitPublisher - Jenkins JUnit Attachments Plugin not found, can't publish test attachments.Recording test results
[windows-jdk8] None of the test reports contained any result
[windows-jdk8] [withMaven] Skip 'Findbugs Publisher' disabled by configuration
[windows-jdk8] [withMaven] Skip 'Open Task Scanner Publisher' disabled by configuration
[windows-jdk8] [withMaven] Skip 'Generated Artifacts Publisher' disabled by configuration
[windows-jdk8] [withMaven] junitPublisher - Archive test results for Maven artifact org.apache.maven.plugins.pmd.its:mpmd-168-empty-report:1.0-SNAPSHOT generated by maven-surefire-plugin:test (default-test): m\target\it\mpmd-168-empty-report\target\surefire-reports\*.xml
[windows-jdk8] [withMaven] junitPublisher - Jenkins JUnit Attachments Plugin not found, can't publish test attachments.Recording test results
[windows-jdk8] None of the test reports contained any result
[windows-jdk8] [withMaven] Skip 'Findbugs Publisher' disabled by configuration
[windows-jdk8] [withMaven] Skip 'Open Task Scanner Publisher' disabled by configuration
[windows-jdk8] [withMaven] Skip 'Generated Artifacts Publisher' disabled by configuration
[windows-jdk8] [withMaven] junitPublisher - Archive test results for Maven artifact org.apache.maven.plugins.pmd.its:MPMD-172:1.0-SNAPSHOT generated by maven-surefire-plugin:test (default-test): m\target\it\MPMD-172\target\surefire-reports\*.xml
[windows-jdk8] [withMaven] junitPublisher - Jenkins JUnit Attachments Plugin not found, can't publish test attachments.Recording test results
[windows-jdk8] None of the test reports contained any result
[windows-jdk8] [withMaven] Skip 'Findbugs Publisher' disabled by configuration
[windows-jdk8] [withMaven] Skip 'Open Task Scanner Publisher' disabled by configuration
[windows-jdk8] [withMaven] Skip 'Generated Artifacts Publisher' disabled by configuration
[windows-jdk8] [withMaven] junitPublisher - Archive test results for Maven artifact org.apache.maven.plugins.pmd.its:MPMD-181-benchmark:1.0-SNAPSHOT generated by maven-surefire-plugin:test (default-test): m\target\it\MPMD-181-benchmark\target\surefire-reports\*.xml
[windows-jdk8] [withMaven] junitPublisher - Jenkins JUnit Attachments Plugin not found, can't publish test attachments.Recording test results
[windows-jdk8] None of the test reports contained any result
[windows-jdk8] [withMaven] Skip 'Findbugs Publisher' disabled by configuration
[windows-jdk8] [withMaven] Skip 'Open Task Scanner Publisher' disabled by configuration
[windows-jdk8] [withMaven] Skip 'Generated Artifacts Publisher' disabled by configuration
[windows-jdk8] [withMaven] junitPublisher - Archive test results for Maven artifact org.apache.maven.plugins.pmd.its:MPMD-181-no-benchmark:1.0-SNAPSHOT generated by maven-surefire-plugin:test (default-test): m\target\it\MPMD-181-no-benchmark\target\surefire-reports\*.xml
[windows-jdk8] [withMaven] junitPublisher - Jenkins JUnit Attachments Plugin not found, can't publish test attachments.Recording test results
[windows-jdk8] None of the test reports contained any result
[windows-jdk8] [withMaven] Skip 'Findbugs Publisher' disabled by configuration
[windows-jdk8] [withMaven] Skip 'Open Task Scanner Publisher' disabled by configuration
[windows-jdk8] [withMaven] Skip 'Generated Artifacts Publisher' disabled by configuration
[windows-jdk8] [withMaven] junitPublisher - Archive test results for Maven artifact org.apache.maven.plugins.pmd.its:MPMD-182:1.0-SNAPSHOT generated by maven-surefire-plugin:test (default-test): m\target\it\MPMD-182\target\surefire-reports\*.xml
[windows-jdk8] [withMaven] junitPublisher - Jenkins JUnit Attachments Plugin not found, can't publish test attachments.Recording test results
[windows-jdk8] None of the test reports contained any result
[windows-jdk8] [withMaven] Skip 'Findbugs Publisher' disabled by configuration
[windows-jdk8] [withMaven] Skip 'Open Task Scanner Publisher' disabled by configuration
[windows-jdk8] [withMaven] Skip 'Generated Artifacts Publisher' disabled by configuration
[windows-jdk8] [withMaven] junitPublisher - Archive test results for Maven artifact org.apache.maven.plugins.pmd.its:MPMD-187:1.0-SNAPSHOT generated by maven-surefire-plugin:test (default-test): m\target\it\MPMD-187\target\surefire-reports\*.xml
[windows-jdk8] [withMaven] junitPublisher - Jenkins JUnit Attachments Plugin not found, can't publish test attachments.Recording test results
[windows-jdk8] None of the test reports contained any result
[windows-jdk8] [withMaven] Skip 'Findbugs Publisher' disabled by configuration
[windows-jdk8] [withMaven] Skip 'Open Task Scanner Publisher' disabled by configuration
[windows-jdk8] [withMaven] Skip 'Generated Artifacts Publisher' disabled by configuration
[windows-jdk8] [withMaven] junitPublisher - Archive test results for Maven artifact org.apache.maven.plugins.pmd.its:MPMD-205-pmd-js-check:1.0-SNAPSHOT generated by maven-surefire-plugin:test (default-test): m\target\it\MPMD-205-pmd-js-check\target\surefire-reports\*.xml
[windows-jdk8] [withMaven] junitPublisher - Jenkins JUnit Attachments Plugin not found, can't publish test attachments.Recording test results
[windows-jdk8] None of the test reports contained any result
[windows-jdk8] [withMaven] Skip 'Findbugs Publisher' disabled by configuration
[windows-jdk8] [withMaven] Skip 'Open Task Scanner Publisher' disabled by configuration
[windows-jdk8] [withMaven] Skip 'Generated Artifacts Publisher' disabled by configuration
[windows-jdk8] [withMaven] junitPublisher - Archive test results for Maven artifact org.apache.maven.plugins.pmd.its:MPMD-206-pmd-sourceDirectories-js:1.0-SNAPSHOT generated by maven-surefire-plugin:test (default-test): m\target\it\MPMD-206-sourceDirectories-js\target\surefire-reports\*.xml
[windows-jdk8] [withMaven] junitPublisher - Jenkins JUnit Attachments Plugin not found, can't publish test attachments.Recording test results
[windows-jdk8] None of the test reports contained any result
[windows-jdk8] [withMaven] Skip 'Findbugs Publisher' disabled by configuration
[windows-jdk8] [withMaven] Skip 'Open Task Scanner Publisher' disabled by configuration
[windows-jdk8] [withMaven] Skip 'Generated Artifacts Publisher' disabled by configuration
[windows-jdk8] [withMaven] Skip 'Findbugs Publisher' disabled by configuration
[windows-jdk8] [withMaven] Skip 'Open Task Scanner Publisher' disabled by configuration
[windows-jdk8] [withMaven] Skip 'Generated Artifacts Publisher' disabled by configuration
[windows-jdk8] [withMaven] junitPublisher - Archive test results for Maven artifact org.apache.maven.plugins.pmd.its.MPMD-234-analysis-cache:no-analysis-cache:1.0-SNAPSHOT generated by maven-surefire-plugin:test (default-test): m\target\it\MPMD-234-analysis-cache\no-analysis-cache\target\surefire-reports\*.xml
[windows-jdk8] [withMaven] junitPublisher - Jenkins JUnit Attachments Plugin not found, can't publish test attachments.Recording test results
[windows-jdk8] None of the test reports contained any result
[windows-jdk8] [withMaven] junitPublisher - Archive test results for Maven artifact org.apache.maven.plugins.pmd.its.MPMD-234-analysis-cache:default-analysis-cache:1.0-SNAPSHOT generated by maven-surefire-plugin:test (default-test): m\target\it\MPMD-234-analysis-cache\default-analysis-cache\target\surefire-reports\*.xml
[windows-jdk8] [withMaven] junitPublisher - Jenkins JUnit Attachments Plugin not found, can't publish test attachments.Recording test results
[windows-jdk8] None of the test reports contained any result
[windows-jdk8] [withMaven] junitPublisher - Archive test results for Maven artifact org.apache.maven.plugins.pmd.its.MPMD-234-analysis-cache:custom-analysis-cache:1.0-SNAPSHOT generated by maven-surefire-plugin:test (default-test): m\target\it\MPMD-234-analysis-cache\custom-analysis-cache\target\surefire-reports\*.xml
[windows-jdk8] [withMaven] junitPublisher - Jenkins JUnit Attachments Plugin not found, can't publish test attachments.Recording test results
[windows-jdk8] None of the test reports contained any result
[windows-jdk8] [withMaven] Skip 'Findbugs Publisher' disabled by configuration
[windows-jdk8] [withMaven] Skip 'Open Task Scanner Publisher' disabled by configuration
[windows-jdk8] [withMaven] Skip 'Generated Artifacts Publisher' disabled by configuration
[windows-jdk8] [withMaven] Skip 'Findbugs Publisher' disabled by configuration
[windows-jdk8] [withMaven] Skip 'Open Task Scanner Publisher' disabled by configuration
[windows-jdk8] [withMaven] Skip 'Generated Artifacts Publisher' disabled by configuration
[windows-jdk8] [withMaven] Skip 'Findbugs Publisher' disabled by configuration
[windows-jdk8] [withMaven] Skip 'Open Task Scanner Publisher' disabled by configuration
[windows-jdk8] [withMaven] Skip 'Generated Artifacts Publisher' disabled by configuration
[windows-jdk8] [withMaven] Skip 'Findbugs Publisher' disabled by configuration
[windows-jdk8] [withMaven] Skip 'Open Task Scanner Publisher' disabled by configuration
[windows-jdk8] [withMaven] Skip 'Generated Artifacts Publisher' disabled by configuration
[windows-jdk8] [withMaven] Skip 'Findbugs Publisher' disabled by configuration
[windows-jdk8] [withMaven] Skip 'Open Task Scanner Publisher' disabled by configuration
[Pipeline] [windows-jdk7] // node
[Pipeline] [windows-jdk8] // withMaven
[Pipeline] [windows-jdk7] }
[Pipeline] [windows-jdk8] }
[Pipeline] [windows-jdk8] // stage
[Pipeline] [windows-jdk8] }
[Pipeline] [windows-jdk8] // node
[Pipeline] [windows-jdk8] }
[windows-jdk9] [INFO] run script verify.bsh
[windows-jdk9] [INFO] ..SUCCESS (24.7 s)
[windows-jdk9] [INFO] 
[windows-jdk9] [INFO] --- maven-checkstyle-plugin:2.15:check (checkstyle-check) @ maven-pmd-plugin ---
[windows-jdk9] [INFO] 
[windows-jdk9] [INFO] --- maven-invoker-plugin:2.0.0:verify (integration-test) @ maven-pmd-plugin ---
[windows-jdk9] [INFO] -------------------------------------------------
[windows-jdk9] [INFO] Build Summary:
[windows-jdk9] [INFO]   Passed: 20, Failed: 0, Errors: 0, Skipped: 0
[windows-jdk9] [INFO] -------------------------------------------------
[windows-jdk9] [INFO] ------------------------------------------------------------------------
[windows-jdk9] [INFO] BUILD SUCCESS
[windows-jdk9] [INFO] ------------------------------------------------------------------------
[windows-jdk9] [INFO] Total time: 05:16 min
[windows-jdk9] [INFO] Finished at: 2017-12-17T11:12:55Z
[windows-jdk9] [INFO] Final Memory: 51M/169M
[windows-jdk9] [INFO] ------------------------------------------------------------------------
[windows-jdk9] [jenkins-maven-event-spy] INFO generated F:\jenkins\jenkins-slave\workspace\box_maven-pmd-plugin_master-723XUI4HKC5A6CYF5JA2PBPNJGNR6SKD4M55XBOMRDY4Z3ISJGVQ@tmp\withMaven7da0fa24\maven-spy-20171217-110737-9908236988248187630297.log
[Pipeline] [windows-jdk9] }
[Pipeline] [windows-jdk9] // dir
[Pipeline] [windows-jdk9] }
[windows-jdk9] [withMaven] Skip 'Generated Artifacts Publisher' disabled by configuration
[windows-jdk9] [withMaven] junitPublisher - Archive test results for Maven artifact org.apache.maven.plugins:maven-pmd-plugin:3.9.0-SNAPSHOT generated by maven-surefire-plugin:test (default-test): m\target\surefire-reports\*.xml
[windows-jdk9] [withMaven] junitPublisher - Jenkins JUnit Attachments Plugin not found, can't publish test attachments.Recording test results
[windows-jdk9] [withMaven] Skip 'Findbugs Publisher' disabled by configuration
[windows-jdk9] [withMaven] Skip 'Open Task Scanner Publisher' disabled by configuration
[windows-jdk9] [withMaven] Skip 'Generated Artifacts Publisher' disabled by configuration
[windows-jdk9] [withMaven] junitPublisher - Archive test results for Maven artifact org.apache.maven.plugins.pmd.it:empty-rulests:1.0-SNAPSHOT generated by maven-surefire-plugin:test (default-test): m\target\it\empty-rulesets\target\surefire-reports\*.xml
[windows-jdk9] [withMaven] junitPublisher - Jenkins JUnit Attachments Plugin not found, can't publish test attachments.Recording test results
[windows-jdk9] None of the test reports contained any result
[windows-jdk9] [withMaven] Skip 'Findbugs Publisher' disabled by configuration
[windows-jdk9] [withMaven] Skip 'Open Task Scanner Publisher' disabled by configuration
[windows-jdk9] [withMaven] Skip 'Generated Artifacts Publisher' disabled by configuration
[windows-jdk9] [withMaven] junitPublisher - Archive test results for Maven artifact org.apache.maven.plugins.pmd.its:mpmd-138-mod-1:1.0-SNAPSHOT generated by maven-surefire-plugin:test (default-test): m\target\it\mpmd-138\mod-1\target\surefire-reports\*.xml
[windows-jdk9] [withMaven] junitPublisher - Jenkins JUnit Attachments Plugin not found, can't publish test attachments.Recording test results
[windows-jdk9] None of the test reports contained any result
[windows-jdk9] [withMaven] junitPublisher - Archive test results for Maven artifact org.apache.maven.plugins.pmd.its:mpmd-138-mod-2:1.0-SNAPSHOT generated by maven-surefire-plugin:test (default-test): m\target\it\mpmd-138\mod-2\target\surefire-reports\*.xml
[windows-jdk9] [withMaven] junitPublisher - Jenkins JUnit Attachments Plugin not found, can't publish test attachments.Recording test results
[windows-jdk9] None of the test reports contained any result
[windows-jdk9] [withMaven] junitPublisher - Archive test results for Maven artifact org.apache.maven.plugins.pmd.its:mpmd-138-mod-3:1.0-SNAPSHOT generated by maven-surefire-plugin:test (default-test): m\target\it\mpmd-138\mod-3\target\surefire-reports\*.xml
[windows-jdk9] [withMaven] junitPublisher - Jenkins JUnit Attachments Plugin not found, can't publish test attachments.Recording test results
[windows-jdk9] None of the test reports contained any result
[windows-jdk9] [withMaven] junitPublisher - Archive test results for Maven artifact org.apache.maven.plugins.pmd.its:mpmd-138-mod-4:1.0-SNAPSHOT generated by maven-surefire-plugin:test (default-test): m\target\it\mpmd-138\mod-4\target\surefire-reports\*.xml
[windows-jdk9] [withMaven] junitPublisher - Jenkins JUnit Attachments Plugin not found, can't publish test attachments.Recording test results
[windows-jdk9] None of the test reports contained any result
[windows-jdk9] [withMaven] Skip 'Findbugs Publisher' disabled by configuration
[windows-jdk9] [withMaven] Skip 'Open Task Scanner Publisher' disabled by configuration
[windows-jdk9] [withMaven] Skip 'Generated Artifacts Publisher' disabled by configuration
[windows-jdk9] [withMaven] Skip 'Findbugs Publisher' disabled by configuration
[windows-jdk9] [withMaven] Skip 'Open Task Scanner Publisher' disabled by configuration
[windows-jdk9] [withMaven] Skip 'Generated Artifacts Publisher' disabled by configuration
[windows-jdk9] [withMaven] Skip 'Findbugs Publisher' disabled by configuration
[windows-jdk9] [withMaven] Skip 'Open Task Scanner Publisher' disabled by configuration
[windows-jdk9] [withMaven] Skip 'Generated Artifacts Publisher' disabled by configuration
[windows-jdk9] [withMaven] Skip 'Findbugs Publisher' disabled by configuration
[windows-jdk9] [withMaven] Skip 'Open Task Scanner Publisher' disabled by configuration
[windows-jdk9] [withMaven] Skip 'Generated Artifacts Publisher' disabled by configuration
[windows-jdk9] [withMaven] junitPublisher - Archive test results for Maven artifact org.apache.maven.plugins.pmd.its:mpmd-168-empty-report-skipped:1.0-SNAPSHOT generated by maven-surefire-plugin:test (default-test): m\target\it\mpmd-168\target\surefire-reports\*.xml
[windows-jdk9] [withMaven] junitPublisher - Jenkins JUnit Attachments Plugin not found, can't publish test attachments.Recording test results
[windows-jdk9] None of the test reports contained any result
[windows-jdk9] [withMaven] Skip 'Findbugs Publisher' disabled by configuration
[windows-jdk9] [withMaven] Skip 'Open Task Scanner Publisher' disabled by configuration
[windows-jdk9] [withMaven] Skip 'Generated Artifacts Publisher' disabled by configuration
[windows-jdk9] [withMaven] junitPublisher - Archive test results for Maven artifact org.apache.maven.plugins.pmd.its:mpmd-168-empty-report:1.0-SNAPSHOT generated by maven-surefire-plugin:test (default-test): m\target\it\mpmd-168-empty-report\target\surefire-reports\*.xml
[windows-jdk9] [withMaven] junitPublisher - Jenkins JUnit Attachments Plugin not found, can't publish test attachments.Recording test results
[windows-jdk9] None of the test reports contained any result
[windows-jdk9] [withMaven] Skip 'Findbugs Publisher' disabled by configuration
[windows-jdk9] [withMaven] Skip 'Open Task Scanner Publisher' disabled by configuration
[windows-jdk9] [withMaven] Skip 'Generated Artifacts Publisher' disabled by configuration
[windows-jdk9] [withMaven] junitPublisher - Archive test results for Maven artifact org.apache.maven.plugins.pmd.its:MPMD-172:1.0-SNAPSHOT generated by maven-surefire-plugin:test (default-test): m\target\it\MPMD-172\target\surefire-reports\*.xml
[windows-jdk9] [withMaven] junitPublisher - Jenkins JUnit Attachments Plugin not found, can't publish test attachments.Recording test results
[windows-jdk9] None of the test reports contained any result
[windows-jdk9] [withMaven] Skip 'Findbugs Publisher' disabled by configuration
[windows-jdk9] [withMaven] Skip 'Open Task Scanner Publisher' disabled by configuration
[windows-jdk9] [withMaven] Skip 'Generated Artifacts Publisher' disabled by configuration
[windows-jdk9] [withMaven] junitPublisher - Archive test results for Maven artifact org.apache.maven.plugins.pmd.its:MPMD-181-benchmark:1.0-SNAPSHOT generated by maven-surefire-plugin:test (default-test): m\target\it\MPMD-181-benchmark\target\surefire-reports\*.xml
[windows-jdk9] [withMaven] junitPublisher - Jenkins JUnit Attachments Plugin not found, can't publish test attachments.Recording test results
[windows-jdk9] None of the test reports contained any result
[windows-jdk9] [withMaven] Skip 'Findbugs Publisher' disabled by configuration
[windows-jdk9] [withMaven] Skip 'Open Task Scanner Publisher' disabled by configuration
[windows-jdk9] [withMaven] Skip 'Generated Artifacts Publisher' disabled by configuration
[windows-jdk9] [withMaven] junitPublisher - Archive test results for Maven artifact org.apache.maven.plugins.pmd.its:MPMD-181-no-benchmark:1.0-SNAPSHOT generated by maven-surefire-plugin:test (default-test): m\target\it\MPMD-181-no-benchmark\target\surefire-reports\*.xml
[windows-jdk9] [withMaven] junitPublisher - Jenkins JUnit Attachments Plugin not found, can't publish test attachments.Recording test results
[windows-jdk9] None of the test reports contained any result
[windows-jdk9] [withMaven] Skip 'Findbugs Publisher' disabled by configuration
[windows-jdk9] [withMaven] Skip 'Open Task Scanner Publisher' disabled by configuration
[windows-jdk9] [withMaven] Skip 'Generated Artifacts Publisher' disabled by configuration
[windows-jdk9] [withMaven] junitPublisher - Archive test results for Maven artifact org.apache.maven.plugins.pmd.its:MPMD-182:1.0-SNAPSHOT generated by maven-surefire-plugin:test (default-test): m\target\it\MPMD-182\target\surefire-reports\*.xml
[windows-jdk9] [withMaven] junitPublisher - Jenkins JUnit Attachments Plugin not found, can't publish test attachments.Recording test results
[windows-jdk9] None of the test reports contained any result
[windows-jdk9] [withMaven] Skip 'Findbugs Publisher' disabled by configuration
[windows-jdk9] [withMaven] Skip 'Open Task Scanner Publisher' disabled by configuration
[windows-jdk9] [withMaven] Skip 'Generated Artifacts Publisher' disabled by configuration
[windows-jdk9] [withMaven] junitPublisher - Archive test results for Maven artifact org.apache.maven.plugins.pmd.its:MPMD-187:1.0-SNAPSHOT generated by maven-surefire-plugin:test (default-test): m\target\it\MPMD-187\target\surefire-reports\*.xml
[windows-jdk9] [withMaven] junitPublisher - Jenkins JUnit Attachments Plugin not found, can't publish test attachments.Recording test results
[windows-jdk9] None of the test reports contained any result
[windows-jdk9] [withMaven] Skip 'Findbugs Publisher' disabled by configuration
[windows-jdk9] [withMaven] Skip 'Open Task Scanner Publisher' disabled by configuration
[windows-jdk9] [withMaven] Skip 'Generated Artifacts Publisher' disabled by configuration
[windows-jdk9] [withMaven] junitPublisher - Archive test results for Maven artifact org.apache.maven.plugins.pmd.its:MPMD-205-pmd-js-check:1.0-SNAPSHOT generated by maven-surefire-plugin:test (default-test): m\target\it\MPMD-205-pmd-js-check\target\surefire-reports\*.xml
[windows-jdk9] [withMaven] junitPublisher - Jenkins JUnit Attachments Plugin not found, can't publish test attachments.Recording test results
[windows-jdk9] None of the test reports contained any result
[windows-jdk9] [withMaven] Skip 'Findbugs Publisher' disabled by configuration
[windows-jdk9] [withMaven] Skip 'Open Task Scanner Publisher' disabled by configuration
[windows-jdk9] [withMaven] Skip 'Generated Artifacts Publisher' disabled by configuration
[windows-jdk9] [withMaven] junitPublisher - Archive test results for Maven artifact org.apache.maven.plugins.pmd.its:MPMD-206-pmd-sourceDirectories-js:1.0-SNAPSHOT generated by maven-surefire-plugin:test (default-test): m\target\it\MPMD-206-sourceDirectories-js\target\surefire-reports\*.xml
[windows-jdk9] [withMaven] junitPublisher - Jenkins JUnit Attachments Plugin not found, can't publish test attachments.Recording test results
[windows-jdk9] None of the test reports contained any result
[windows-jdk9] [withMaven] Skip 'Findbugs Publisher' disabled by configuration
[windows-jdk9] [withMaven] Skip 'Open Task Scanner Publisher' disabled by configuration
[windows-jdk9] [withMaven] Skip 'Generated Artifacts Publisher' disabled by configuration
[windows-jdk9] [withMaven] Skip 'Findbugs Publisher' disabled by configuration
[windows-jdk9] [withMaven] Skip 'Open Task Scanner Publisher' disabled by configuration
[windows-jdk9] [withMaven] Skip 'Generated Artifacts Publisher' disabled by configuration
[windows-jdk9] [withMaven] junitPublisher - Archive test results for Maven artifact org.apache.maven.plugins.pmd.its.MPMD-234-analysis-cache:no-analysis-cache:1.0-SNAPSHOT generated by maven-surefire-plugin:test (default-test): m\target\it\MPMD-234-analysis-cache\no-analysis-cache\target\surefire-reports\*.xml
[windows-jdk9] [withMaven] junitPublisher - Jenkins JUnit Attachments Plugin not found, can't publish test attachments.Recording test results
[windows-jdk9] None of the test reports contained any result
[windows-jdk9] [withMaven] junitPublisher - Archive test results for Maven artifact org.apache.maven.plugins.pmd.its.MPMD-234-analysis-cache:default-analysis-cache:1.0-SNAPSHOT generated by maven-surefire-plugin:test (default-test): m\target\it\MPMD-234-analysis-cache\default-analysis-cache\target\surefire-reports\*.xml
[windows-jdk9] [withMaven] junitPublisher - Jenkins JUnit Attachments Plugin not found, can't publish test attachments.Recording test results
[windows-jdk9] None of the test reports contained any result
[windows-jdk9] [withMaven] junitPublisher - Archive test results for Maven artifact org.apache.maven.plugins.pmd.its.MPMD-234-analysis-cache:custom-analysis-cache:1.0-SNAPSHOT generated by maven-surefire-plugin:test (default-test): m\target\it\MPMD-234-analysis-cache\custom-analysis-cache\target\surefire-reports\*.xml
[windows-jdk9] [withMaven] junitPublisher - Jenkins JUnit Attachments Plugin not found, can't publish test attachments.Recording test results
[windows-jdk9] None of the test reports contained any result
[windows-jdk9] [withMaven] Skip 'Findbugs Publisher' disabled by configuration
[windows-jdk9] [withMaven] Skip 'Open Task Scanner Publisher' disabled by configuration
[windows-jdk9] [withMaven] Skip 'Generated Artifacts Publisher' disabled by configuration
[windows-jdk9] [withMaven] Skip 'Findbugs Publisher' disabled by configuration
[windows-jdk9] [withMaven] Skip 'Open Task Scanner Publisher' disabled by configuration
[windows-jdk9] [withMaven] Skip 'Generated Artifacts Publisher' disabled by configuration
[windows-jdk9] [withMaven] Skip 'Findbugs Publisher' disabled by configuration
[windows-jdk9] [withMaven] Skip 'Open Task Scanner Publisher' disabled by configuration
[windows-jdk9] [withMaven] Skip 'Generated Artifacts Publisher' disabled by configuration
[windows-jdk9] [withMaven] Skip 'Findbugs Publisher' disabled by configuration
[windows-jdk9] [withMaven] Skip 'Open Task Scanner Publisher' disabled by configuration
[windows-jdk9] [withMaven] Skip 'Generated Artifacts Publisher' disabled by configuration
[windows-jdk9] [withMaven] Skip 'Findbugs Publisher' disabled by configuration
[windows-jdk9] [withMaven] Skip 'Open Task Scanner Publisher' disabled by configuration
[Pipeline] [windows-jdk9] // withMaven
[Pipeline] [windows-jdk9] }
[Pipeline] [windows-jdk9] // stage
[Pipeline] [windows-jdk9] }
[Pipeline] [windows-jdk9] // node
[Pipeline] [windows-jdk9] }
[Pipeline] // parallel
[Pipeline] stage
[Pipeline] { (Notifications)
[Pipeline] echo
Build result: UNSTABLE
[Pipeline] jiraIssueSelector