You are viewing a plain text version of this content. The canonical link for it is here.
Posted to commits@sling.apache.org by Apache Jenkins Server <je...@builds.apache.org> on 2016/06/23 08:19:43 UTC

Build failed in Jenkins: sling-contrib-1.7 #961

See <https://builds.apache.org/job/sling-contrib-1.7/961/changes>

Changes:

[cziegeler] [maven-release-plugin] prepare for next development iteration

[cziegeler] [maven-release-plugin] prepare release org.apache.sling.rewriter-1.1.4

[cziegeler] SLING-5806 : No service returned if several services for same type

[cziegeler] SLING-5806 : No service returned if several services for same type

------------------------------------------
Started by an SCM change
[EnvInject] - Loading node environment variables.
Building remotely on ubuntu-6 (docker Ubuntu ubuntu yahoo-not-h2) in workspace <https://builds.apache.org/job/sling-contrib-1.7/ws/>
Cleaning up <https://builds.apache.org/job/sling-contrib-1.7/ws/trunk>
Deleting <https://builds.apache.org/job/sling-contrib-1.7/ws/trunk/auth/org.apache.sling.auth.xing.oauth/target>
Deleting <https://builds.apache.org/job/sling-contrib-1.7/ws/trunk/auth/org.apache.sling.auth.xing.login/target>
Deleting <https://builds.apache.org/job/sling-contrib-1.7/ws/trunk/auth/org.apache.sling.auth.xing.api/target>
Updating http://svn.apache.org/repos/asf/sling/trunk/contrib at revision '2016-06-23T08:18:23.360 +0000'
U         pom.xml
AU        extensions/rewriter/src/test/java/org/apache/sling/rewriter/impl/HashingServiceTrackerCustomizerTest.java
AU        extensions/rewriter/src/main/java/org/apache/sling/rewriter/impl/TransformerFactoryServiceTracker.java
U         extensions/rewriter/src/main/java/org/apache/sling/rewriter/impl/FactoryCache.java
AU        extensions/rewriter/src/main/java/org/apache/sling/rewriter/impl/HashingServiceTrackerCustomizer.java
U         extensions/rewriter/pom.xml
U         extensions/sling-pipes/src/test/java/org/apache/sling/pipes/PipeBindingsTest.java
U         extensions/sling-pipes/src/main/java/org/apache/sling/pipes/PipeBindings.java
U         extensions/sling-pipes/src/main/java/org/apache/sling/pipes/XPathPipe.java
U         extensions/sling-pipes/src/main/java/org/apache/sling/pipes/FilterPipe.java
U         launchpad/testing/src/test/java/org/apache/sling/launchpad/webapp/integrationtest/auth/SelectorAuthenticationResponseCodeTest.java
U         launchpad/testing/src/main/provisioning/model.txt
U         launchpad/karaf/org.apache.sling.launchpad.karaf-features/src/main/feature/feature.xml
U         launchpad/karaf/org.apache.sling.launchpad.karaf-integration-tests/src/test/java/org/apache/sling/launchpad/karaf/tests/bootstrap/SlingJcrOakIT.java
U         launchpad/karaf/org.apache.sling.launchpad.karaf-integration-tests/src/test/java/org/apache/sling/launchpad/karaf/tests/bootstrap/OakSlingIT.java
At revision 1749856

Parsing POMs
Modules changed, recalculating dependency graph
Established TCP socket on 39623
maven3-agent.jar already up to date
maven3-interceptor.jar already up to date
maven3-interceptor-commons.jar already up to date
[trunk] $ /home/jenkins/jenkins-slave/tools/hudson.model.JDK/JDK_1.7_latest_/bin/java -Xmx512M -XX:MaxPermSize=256M -enableassertions -cp /home/jenkins/jenkins-slave/maven3-agent.jar:/home/jenkins/jenkins-slave/tools/hudson.tasks.Maven_MavenInstallation/Maven_3.0.5/boot/plexus-classworlds-2.4.jar org.jvnet.hudson.maven3.agent.Maven3Main /home/jenkins/jenkins-slave/tools/hudson.tasks.Maven_MavenInstallation/Maven_3.0.5 /home/jenkins/jenkins-slave/slave.jar /home/jenkins/jenkins-slave/maven3-interceptor.jar /home/jenkins/jenkins-slave/maven3-interceptor-commons.jar 39623
#
# There is insufficient memory for the Java Runtime Environment to continue.
# Cannot create GC thread. Out of system resources.
# An error report file with more information is saved as:
# <https://builds.apache.org/job/sling-contrib-1.7/ws/trunk/hs_err_pid24855.log>
ERROR: Failed to launch Maven. Exit code = 1


Jenkins build is still unstable: sling-contrib-1.7 #1007

Posted by Apache Jenkins Server <je...@builds.apache.org>.
See <https://builds.apache.org/job/sling-contrib-1.7/changes>


Jenkins build is still unstable: sling-contrib-1.7 #1006

Posted by Apache Jenkins Server <je...@builds.apache.org>.
See <https://builds.apache.org/job/sling-contrib-1.7/changes>


Jenkins build is still unstable: sling-contrib-1.7 #1005

Posted by Apache Jenkins Server <je...@builds.apache.org>.
See <https://builds.apache.org/job/sling-contrib-1.7/changes>


Jenkins build is still unstable: sling-contrib-1.7 #1004

Posted by Apache Jenkins Server <je...@builds.apache.org>.
See <https://builds.apache.org/job/sling-contrib-1.7/changes>


Jenkins build is still unstable: sling-contrib-1.7 #1003

Posted by Apache Jenkins Server <je...@builds.apache.org>.
See <https://builds.apache.org/job/sling-contrib-1.7/1003/>


Jenkins build is still unstable: sling-contrib-1.7 #1002

Posted by Apache Jenkins Server <je...@builds.apache.org>.
See <https://builds.apache.org/job/sling-contrib-1.7/1002/>


Jenkins build is still unstable: sling-contrib-1.7 #1001

Posted by Apache Jenkins Server <je...@builds.apache.org>.
See <https://builds.apache.org/job/sling-contrib-1.7/1001/>


Jenkins build is still unstable: sling-contrib-1.7 #1000

Posted by Apache Jenkins Server <je...@builds.apache.org>.
See <https://builds.apache.org/job/sling-contrib-1.7/changes>


Jenkins build is still unstable: sling-contrib-1.7 #999

Posted by Apache Jenkins Server <je...@builds.apache.org>.
See <https://builds.apache.org/job/sling-contrib-1.7/changes>


Jenkins build is still unstable: sling-contrib-1.7 #998

Posted by Apache Jenkins Server <je...@builds.apache.org>.
See <https://builds.apache.org/job/sling-contrib-1.7/changes>


Jenkins build is still unstable: sling-contrib-1.7 #997

Posted by Apache Jenkins Server <je...@builds.apache.org>.
See <https://builds.apache.org/job/sling-contrib-1.7/changes>


Jenkins build is still unstable: sling-contrib-1.7 #996

Posted by Apache Jenkins Server <je...@builds.apache.org>.
See <https://builds.apache.org/job/sling-contrib-1.7/changes>


Jenkins build is still unstable: sling-contrib-1.7 #995

Posted by Apache Jenkins Server <je...@builds.apache.org>.
See <https://builds.apache.org/job/sling-contrib-1.7/995/>


Jenkins build is still unstable: sling-contrib-1.7 #994

Posted by Apache Jenkins Server <je...@builds.apache.org>.
See <https://builds.apache.org/job/sling-contrib-1.7/994/>


Jenkins build is still unstable: sling-contrib-1.7 #993

Posted by Apache Jenkins Server <je...@builds.apache.org>.
See <https://builds.apache.org/job/sling-contrib-1.7/993/>


Jenkins build is still unstable: sling-contrib-1.7 #992

Posted by Apache Jenkins Server <je...@builds.apache.org>.
See <https://builds.apache.org/job/sling-contrib-1.7/changes>


Jenkins build is unstable: sling-contrib-1.7 #991

Posted by Apache Jenkins Server <je...@builds.apache.org>.
See <https://builds.apache.org/job/sling-contrib-1.7/991/changes>


Build failed in Jenkins: sling-contrib-1.7 #990

Posted by Apache Jenkins Server <je...@builds.apache.org>.
See <https://builds.apache.org/job/sling-contrib-1.7/990/changes>

Changes:

[olli] do not keep caches

------------------------------------------
[...truncated 12055 lines...]
Downloading: http://repository.apache.org/snapshots/org/apache/sling/org.apache.sling.launchpad.karaf-features/0.1.1-SNAPSHOT/maven-metadata.xml
Downloaded: http://repository.apache.org/snapshots/org/apache/sling/org.apache.sling.launchpad.karaf-features/0.1.1-SNAPSHOT/maven-metadata.xml (2 KB at 1.7 KB/sec)
[INFO] Generating feature descriptor file <https://builds.apache.org/job/sling-contrib-1.7/ws/trunk/launchpad/karaf/org.apache.sling.launchpad.karaf-features/target/feature/feature.xml>
[INFO] ...done!
[INFO] 
[INFO] --- karaf-maven-plugin:4.0.5:features-generate-descriptor (generate-features-file) @ org.apache.sling.launchpad.karaf-features ---
[INFO] Generating feature descriptor file <https://builds.apache.org/job/sling-contrib-1.7/ws/trunk/launchpad/karaf/org.apache.sling.launchpad.karaf-features/target/feature/feature.xml>
[INFO] ...done!
[WARNING] Artifact org.apache.sling:org.apache.sling.launchpad.karaf-features:xml:features:0.1.1-SNAPSHOT already attached to project, ignoring duplicate
[INFO] 
[INFO] --- animal-sniffer-maven-plugin:1.14:check (default) @ org.apache.sling.launchpad.karaf-features ---
[INFO] Checking unresolved references to org.codehaus.mojo.signature:java16:1.0
[INFO] 
[INFO] --- maven-enforcer-plugin:1.3.1:enforce (enforce-java) @ org.apache.sling.launchpad.karaf-features ---
[INFO] 
[INFO] --- maven-antrun-plugin:1.8:run (set-bundle-required-execution-environment) @ org.apache.sling.launchpad.karaf-features ---
[INFO] Executing tasks

main:
[INFO] Executed tasks
[WARNING] Failed to getClass for org.apache.maven.plugin.source.SourceJarMojo
[INFO] 
[INFO] --- maven-source-plugin:2.4:jar (attach-sources) @ org.apache.sling.launchpad.karaf-features ---
[INFO] Building jar: <https://builds.apache.org/job/sling-contrib-1.7/ws/trunk/launchpad/karaf/org.apache.sling.launchpad.karaf-features/target/org.apache.sling.launchpad.karaf-features-0.1.1-SNAPSHOT-sources.jar>
[INFO] 
[INFO] --- karaf-maven-plugin:4.0.5:kar (features-create-kar) @ org.apache.sling.launchpad.karaf-features ---
Downloading: http://repository.apache.org/snapshots/org/apache/sling/org.apache.sling.api/2.11.1-SNAPSHOT/maven-metadata.xml
Downloaded: http://repository.apache.org/snapshots/org/apache/sling/org.apache.sling.api/2.11.1-SNAPSHOT/maven-metadata.xml (1012 B at 0.1 KB/sec)
Downloading: http://repository.apache.org/snapshots/org/apache/sling/org.apache.sling.commons.messaging/0.0.1-SNAPSHOT/maven-metadata.xml
Downloaded: http://repository.apache.org/snapshots/org/apache/sling/org.apache.sling.commons.messaging/0.0.1-SNAPSHOT/maven-metadata.xml (1014 B at 1.9 KB/sec)
Downloading: http://repository.apache.org/snapshots/org/apache/sling/org.apache.sling.commons.messaging.mail/0.0.1-SNAPSHOT/maven-metadata.xml
Downloaded: http://repository.apache.org/snapshots/org/apache/sling/org.apache.sling.commons.messaging.mail/0.0.1-SNAPSHOT/maven-metadata.xml (1019 B at 1.9 KB/sec)
Downloading: http://repository.apache.org/snapshots/org/apache/sling/org.apache.sling.discovery.base/1.1.3-SNAPSHOT/maven-metadata.xml
Downloaded: http://repository.apache.org/snapshots/org/apache/sling/org.apache.sling.discovery.base/1.1.3-SNAPSHOT/maven-metadata.xml (2 KB at 1.7 KB/sec)
Downloading: http://repository.apache.org/snapshots/org/apache/sling/org.apache.sling.discovery.base/1.1.3-SNAPSHOT/org.apache.sling.discovery.base-1.1.3-20160712.101730-1264.jar
Downloaded: http://repository.apache.org/snapshots/org/apache/sling/org.apache.sling.discovery.base/1.1.3-SNAPSHOT/org.apache.sling.discovery.base-1.1.3-20160712.101730-1264.jar (83 KB at 78.4 KB/sec)
Downloading: http://repository.apache.org/snapshots/org/apache/sling/org.apache.sling.discovery.impl/1.2.7-SNAPSHOT/maven-metadata.xml
Downloaded: http://repository.apache.org/snapshots/org/apache/sling/org.apache.sling.discovery.impl/1.2.7-SNAPSHOT/maven-metadata.xml (1023 B at 1.4 KB/sec)
Downloading: http://repository.apache.org/snapshots/org/apache/sling/org.apache.sling.discovery.impl/1.2.7-SNAPSHOT/org.apache.sling.discovery.impl-1.2.7-20160712.102021-1268.jar
Downloaded: http://repository.apache.org/snapshots/org/apache/sling/org.apache.sling.discovery.impl/1.2.7-SNAPSHOT/org.apache.sling.discovery.impl-1.2.7-20160712.102021-1268.jar (106 KB at 86.8 KB/sec)
Downloading: http://repository.apache.org/snapshots/org/apache/sling/org.apache.sling.discovery.oak/1.2.7-SNAPSHOT/maven-metadata.xml
Downloaded: http://repository.apache.org/snapshots/org/apache/sling/org.apache.sling.discovery.oak/1.2.7-SNAPSHOT/maven-metadata.xml (1018 B at 1.4 KB/sec)
Downloading: http://repository.apache.org/snapshots/org/apache/sling/org.apache.sling.discovery.oak/1.2.7-SNAPSHOT/org.apache.sling.discovery.oak-1.2.7-20160712.102325-778.jar
Downloaded: http://repository.apache.org/snapshots/org/apache/sling/org.apache.sling.discovery.oak/1.2.7-SNAPSHOT/org.apache.sling.discovery.oak-1.2.7-20160712.102325-778.jar (75 KB at 71.4 KB/sec)
Downloading: http://repository.apache.org/snapshots/org/apache/sling/org.apache.sling.validation.api/1.0.0-SNAPSHOT/maven-metadata.xml
Downloaded: http://repository.apache.org/snapshots/org/apache/sling/org.apache.sling.validation.api/1.0.0-SNAPSHOT/maven-metadata.xml (1023 B at 1.5 KB/sec)
Downloading: http://repository.apache.org/snapshots/org/apache/sling/org.apache.sling.validation.core/1.0.0-SNAPSHOT/maven-metadata.xml
Downloaded: http://repository.apache.org/snapshots/org/apache/sling/org.apache.sling.validation.core/1.0.0-SNAPSHOT/maven-metadata.xml (1 KB at 1.4 KB/sec)
Downloading: http://repository.apache.org/snapshots/org/apache/sling/org.apache.sling.jcr.oak.server/1.0.1-SNAPSHOT/maven-metadata.xml
Downloaded: http://repository.apache.org/snapshots/org/apache/sling/org.apache.sling.jcr.oak.server/1.0.1-SNAPSHOT/maven-metadata.xml (1023 B at 1.4 KB/sec)
Downloading: http://repository.apache.org/snapshots/org/apache/sling/org.apache.sling.jcr.oak.server/1.0.1-SNAPSHOT/org.apache.sling.jcr.oak.server-1.0.1-20160712.100428-1647.jar
Downloaded: http://repository.apache.org/snapshots/org/apache/sling/org.apache.sling.jcr.oak.server/1.0.1-SNAPSHOT/org.apache.sling.jcr.oak.server-1.0.1-20160712.100428-1647.jar (29 KB at 36.7 KB/sec)
Downloading: http://repo.maven.apache.org/maven2/org/apache/jackrabbit/oak-segment/1.5.5/oak-segment-1.5.5.jar
Downloaded: http://repo.maven.apache.org/maven2/org/apache/jackrabbit/oak-segment/1.5.5/oak-segment-1.5.5.jar (316 KB at 1056.4 KB/sec)
Downloading: http://repository.apache.org/snapshots/org/apache/sling/org.apache.sling.scripting.core/2.0.37-SNAPSHOT/maven-metadata.xml
Downloaded: http://repository.apache.org/snapshots/org/apache/sling/org.apache.sling.scripting.core/2.0.37-SNAPSHOT/maven-metadata.xml (1023 B at 1.4 KB/sec)
Downloading: http://repository.apache.org/snapshots/org/apache/sling/org.apache.sling.scripting.core/2.0.37-SNAPSHOT/org.apache.sling.scripting.core-2.0.37-20160709.180001-747.jar
Downloaded: http://repository.apache.org/snapshots/org/apache/sling/org.apache.sling.scripting.core/2.0.37-SNAPSHOT/org.apache.sling.scripting.core-2.0.37-20160709.180001-747.jar (81 KB at 72.3 KB/sec)
Downloading: http://repository.apache.org/snapshots/org/apache/sling/org.apache.sling.servlets.resolver/2.4.3-SNAPSHOT/maven-metadata.xml
Downloaded: http://repository.apache.org/snapshots/org/apache/sling/org.apache.sling.servlets.resolver/2.4.3-SNAPSHOT/maven-metadata.xml (1022 B at 1.4 KB/sec)
Downloading: http://repository.apache.org/snapshots/org/apache/sling/org.apache.sling.servlets.resolver/2.4.3-SNAPSHOT/org.apache.sling.servlets.resolver-2.4.3-20160709.192252-706.jar
Downloaded: http://repository.apache.org/snapshots/org/apache/sling/org.apache.sling.servlets.resolver/2.4.3-SNAPSHOT/org.apache.sling.servlets.resolver-2.4.3-20160709.192252-706.jar (67 KB at 64.1 KB/sec)
Downloading: http://repository.apache.org/snapshots/org/apache/sling/org.apache.sling.hc.core/1.2.5-SNAPSHOT/maven-metadata.xml
Downloaded: http://repository.apache.org/snapshots/org/apache/sling/org.apache.sling.hc.core/1.2.5-SNAPSHOT/maven-metadata.xml (1012 B at 1.6 KB/sec)
Downloading: http://repository.apache.org/snapshots/org/apache/sling/org.apache.sling.hc.core/1.2.5-SNAPSHOT/org.apache.sling.hc.core-1.2.5-20160712.103842-582.jar
Downloaded: http://repository.apache.org/snapshots/org/apache/sling/org.apache.sling.hc.core/1.2.5-SNAPSHOT/org.apache.sling.hc.core-1.2.5-20160712.103842-582.jar (109 KB at 90.0 KB/sec)
Downloading: http://repository.apache.org/snapshots/org/apache/sling/org.apache.sling.scripting.freemarker/1.0.0-SNAPSHOT/maven-metadata.xml
Downloading: http://repository.apache.org/snapshots/org/apache/sling/org.apache.sling.scripting.freemarker/1.0.0-SNAPSHOT/org.apache.sling.scripting.freemarker-1.0.0-SNAPSHOT.jar
[JENKINS] Archiving disabled
[INFO] ------------------------------------------------------------------------
[INFO] Reactor Summary:
[INFO] 
[INFO] Apache Sling Authentication XING API .............. SUCCESS [23.343s]
[INFO] Apache Sling Authentication XING Login ............ SUCCESS [9.576s]
[INFO] Apache Sling Authentication XING OAuth ............ SUCCESS [5.563s]
[INFO] Apache Sling Commons HTML Utilities ............... SUCCESS [4.834s]
[INFO] Apache Sling APT parser ........................... SUCCESS [25.095s]
[INFO] Apache Sling APT servlet .......................... SUCCESS [4.925s]
[INFO] Apache Sling Resource Collection API .............. SUCCESS [5.641s]
[INFO] Apache Sling DataSource Provider .................. SUCCESS [14.132s]
[INFO] Apache Sling Dojo JavaScript Library .............. SUCCESS [9.188s]
[INFO] Apache Sling Dojo Data Extension .................. SUCCESS [9.346s]
[INFO] Apache Sling FTP Server ........................... SUCCESS [22.378s]
[INFO] Apache Sling Google Web Toolkit Servlet Library ... SUCCESS [5.919s]
[INFO] Apache Sling Google Web Toolkit Sample ............ SUCCESS [44.219s]
[INFO] Apache Sling JMX Resource Provider ................ SUCCESS [20.724s]
[INFO] Apache Sling ClassLoader Leak Detector ............ SUCCESS [6.943s]
[INFO] Apache Sling MongoDB Resource Provider ............ SUCCESS [5.003s]
[INFO] Apache Sling OSGi Bundle Repository ............... SUCCESS [8.981s]
[INFO] Apache Sling Distribution API ..................... SUCCESS [8.047s]
[INFO] Apache Sling Distribution Core .................... SUCCESS [35.949s]
[INFO] Apache Sling Distribution Extensions .............. SUCCESS [11.906s]
[INFO] Apache Sling Distribution Sample .................. SUCCESS [3.693s]
[INFO] Apache Sling Distribution Integration Tests ....... SUCCESS [15:03.463s]
[INFO] Apache Sling Log Tail Implementation .............. SUCCESS [12.908s]
[INFO] S3 dependencies for Oak ........................... SUCCESS [12.223s]
[INFO] Apache Sling Request Processing Analyzer .......... SUCCESS [6.708s]
[INFO] Apache Sling Resource Merger ...................... SUCCESS [8.163s]
[INFO] Apache Sling Inventory Printer Based on Resources . SUCCESS [2.836s]
[INFO] Apache Sling Rewriter ............................. SUCCESS [14.965s]
[INFO] Apache Sling Security ............................. SUCCESS [18.456s]
[INFO] Apache Sling SLF4J MDC Filter ..................... SUCCESS [12.684s]
[INFO] Apache Sling Query ................................ SUCCESS [5.903s]
[INFO] Apache Sling Oak Restrictions ..................... SUCCESS [7.563s]
[INFO] Apache Sling Superimposing Resource Provider ...... SUCCESS [13.309s]
[INFO] Apache Sling Tenant ............................... SUCCESS [10.392s]
[INFO] Apache Sling Log Tracer ........................... SUCCESS [9.859s]
[INFO] Apache Sling URL Rewriter ......................... SUCCESS [12.265s]
[INFO] HApi - Sling Hypermedia API tools ................. SUCCESS [8.141s]
[INFO] HApi - Sling Hypermedia API client-side tools ..... SUCCESS [12.082s]
[INFO] HApi - Sample Content ............................. SUCCESS [4.505s]
[INFO] HApi - Sling Hypermedia API Tools Reactor ......... SUCCESS [6.525s]
[INFO] Apache Sling Dynamic Include ...................... SUCCESS [3.125s]
[INFO] Apache Sling JCR Java Compiler .................... SUCCESS [24.939s]
[INFO] Apache Sling Repository Accessor .................. SUCCESS [3.774s]
[INFO] Apache Sling Object Content Mapping ............... SUCCESS [8.181s]
[INFO] Apache Sling JCR Prefs ............................ SUCCESS [4.791s]
[INFO] Apache Sling JCR Resource Security ................ SUCCESS [3.303s]
[INFO] Apache Sling Script Console ....................... SUCCESS [4.862s]
[INFO] Apache Sling Atom Tag Library ..................... SUCCESS [5.332s]
[INFO] Apache Sling Scripting Groovy Support ............. SUCCESS [9.559s]
[INFO] Apache Sling Scripting Java Support ............... SUCCESS [11.324s]
[INFO] Apache Sling Scripting JST Support ................ SUCCESS [9.656s]
[INFO] Apache Sling Scripting Python Support ............. SUCCESS [12.377s]
[INFO] Apache Sling Scripting Ruby Support ............... SUCCESS [14.267s]
[INFO] Scala Script Engine ............................... SUCCESS [1:39.670s]
[INFO] Apache Sling Scala Scripting Configuration ........ SUCCESS [5.453s]
[INFO] Scala for Sling Demo Application - Hello World .... SUCCESS [3.138s]
[INFO] Scala for Sling Demo Application - Forum .......... SUCCESS [2.711s]
[INFO] Apache Sling Scripting Velocity Support ........... SUCCESS [8.015s]
[INFO] Apache Sling Scripting W3C XML Processing Support . SUCCESS [13.534s]
[INFO] Apache Sling NoSQL Generic Resource Provider ...... SUCCESS [6.368s]
[INFO] Apache Sling NoSQL Couchbase Client ............... SUCCESS [7.838s]
[INFO] Apache Sling NoSQL Couchbase Resource Provider .... SUCCESS [5.122s]
[INFO] Apache Sling NoSQL MongoDB Resource Provider ...... SUCCESS [5.452s]
[INFO] Apache Sling Contrib NoSQL Modules Reactor ........ SUCCESS [3.448s]
[INFO] Apache Sling Launchpad Contrib Testing ............ SUCCESS [2:02.844s]
[INFO] Apache Sling Launchpad Karaf - Features ........... FAILURE [32.150s]
[INFO] Apache Sling Launchpad Karaf - Distribution ....... SKIPPED
[INFO] Apache Sling Launchpad Karaf - Integration Tests .. SKIPPED
[INFO] Apache Sling Launchpad Karaf - Launchpad Oak Tar Integration Tests  SKIPPED
[INFO] Apache Sling Launchpad Karaf Builder .............. SKIPPED
[INFO] Apache Sling Contrib (Builder) .................... SKIPPED
[INFO] ------------------------------------------------------------------------
[INFO] BUILD FAILURE
[INFO] ------------------------------------------------------------------------
[INFO] Total time: 30:49.542s
[INFO] Finished at: Tue Jul 12 10:50:18 UTC 2016
[INFO] Final Memory: 148M/470M
[INFO] ------------------------------------------------------------------------
[JENKINS] Archiving disabled
[JENKINS] Archiving disabled
[JENKINS] Archiving disabled
[JENKINS] Archiving disabled
[JENKINS] Archiving disabled
[JENKINS] Archiving disabled
[JENKINS] Archiving disabled
[JENKINS] Archiving disabled
[JENKINS] Archiving disabled
[JENKINS] Archiving disabled
[JENKINS] Archiving disabled
[JENKINS] Archiving disabled
[JENKINS] Archiving disabled
[JENKINS] Archiving disabled
[JENKINS] Archiving disabled
[JENKINS] Archiving disabled
[JENKINS] Archiving disabled
[JENKINS] Archiving disabled
[JENKINS] Archiving disabled
[JENKINS] Archiving disabled
[JENKINS] Archiving disabled
[JENKINS] Archiving disabled
[JENKINS] Archiving disabled
[JENKINS] Archiving disabled
[JENKINS] Archiving disabled
[JENKINS] Archiving disabled
[JENKINS] Archiving disabled
[JENKINS] Archiving disabled
[JENKINS] Archiving disabled
[JENKINS] Archiving disabled
[JENKINS] Archiving disabled
[JENKINS] Archiving disabled
[JENKINS] Archiving disabled
[JENKINS] Archiving disabled
[JENKINS] Archiving disabled
[JENKINS] Archiving disabled
[JENKINS] Archiving disabled
[JENKINS] Archiving disabled
[JENKINS] Archiving disabled
[JENKINS] Archiving disabled
[JENKINS] Archiving disabled
[JENKINS] Archiving disabled
[JENKINS] Archiving disabled
[JENKINS] Archiving disabled
[JENKINS] Archiving disabled
[JENKINS] Archiving disabled
[JENKINS] Archiving disabled
[JENKINS] Archiving disabled
[JENKINS] Archiving disabled
[JENKINS] Archiving disabled
[JENKINS] Archiving disabled
[JENKINS] Archiving disabled
[JENKINS] Archiving disabled
[JENKINS] Archiving disabled
[JENKINS] Archiving disabled
[JENKINS] Archiving disabled
[JENKINS] Archiving disabled
[JENKINS] Archiving disabled
[JENKINS] Archiving disabled
[JENKINS] Archiving disabled
[JENKINS] Archiving disabled
[JENKINS] Archiving disabled
[JENKINS] Archiving disabled
[JENKINS] Archiving disabled
[JENKINS] Archiving disabled
[JENKINS] Archiving disabled
[JENKINS] Archiving disabled
[JENKINS] Archiving disabled
[JENKINS] Archiving disabled
[JENKINS] Archiving disabled
[JENKINS] Archiving disabled
Waiting for Jenkins to finish collecting data
[ERROR] Failed to execute goal org.apache.karaf.tooling:karaf-maven-plugin:4.0.5:kar (features-create-kar) on project org.apache.sling.launchpad.karaf-features: Failed to create archive: Could not find artifact org.apache.sling:org.apache.sling.scripting.freemarker:jar:1.0.0-SNAPSHOT in Nexus (http://repository.apache.org/snapshots)
[ERROR] 
[ERROR] Try downloading the file manually from the project website.
[ERROR] 
[ERROR] Then, install it using the command:
[ERROR] mvn install:install-file -DgroupId=org.apache.sling -DartifactId=org.apache.sling.scripting.freemarker -Dversion=1.0.0-SNAPSHOT -Dpackaging=jar -Dfile=/path/to/file
[ERROR] 
[ERROR] Alternatively, if you host your own repository you can deploy the file there:
[ERROR] mvn deploy:deploy-file -DgroupId=org.apache.sling -DartifactId=org.apache.sling.scripting.freemarker -Dversion=1.0.0-SNAPSHOT -Dpackaging=jar -Dfile=/path/to/file -Durl=[url] -DrepositoryId=[id]
[ERROR] 
[ERROR] 
[ERROR] org.apache.sling:org.apache.sling.scripting.freemarker:jar:1.0.0-SNAPSHOT
[ERROR] 
[ERROR] from the specified remote repositories:
[ERROR] Nexus (http://repository.apache.org/snapshots, releases=false, snapshots=true),
[ERROR] central (http://repo.maven.apache.org/maven2, releases=true, snapshots=false)
[ERROR] -> [Help 1]
[ERROR] 
[ERROR] To see the full stack trace of the errors, re-run Maven with the -e switch.
[ERROR] Re-run Maven using the -X switch to enable full debug logging.
[ERROR] 
[ERROR] For more information about the errors and possible solutions, please read the following articles:
[ERROR] [Help 1] http://cwiki.apache.org/confluence/display/MAVEN/MojoExecutionException
[ERROR] 
[ERROR] After correcting the problems, you can resume the build with the command
[ERROR]   mvn <goals> -rf :org.apache.sling.launchpad.karaf-features
channel stopped

Jenkins build is still unstable: sling-contrib-1.7 #989

Posted by Apache Jenkins Server <je...@builds.apache.org>.
See <https://builds.apache.org/job/sling-contrib-1.7/changes>


Jenkins build is still unstable: sling-contrib-1.7 #988

Posted by Apache Jenkins Server <je...@builds.apache.org>.
See <https://builds.apache.org/job/sling-contrib-1.7/changes>


Jenkins build is still unstable: sling-contrib-1.7 #987

Posted by Apache Jenkins Server <je...@builds.apache.org>.
See <https://builds.apache.org/job/sling-contrib-1.7/987/>


Jenkins build is still unstable: sling-contrib-1.7 #986

Posted by Apache Jenkins Server <je...@builds.apache.org>.
See <https://builds.apache.org/job/sling-contrib-1.7/986/>


Jenkins build is unstable: sling-contrib-1.7 #985

Posted by Apache Jenkins Server <je...@builds.apache.org>.
See <https://builds.apache.org/job/sling-contrib-1.7/985/>


Build failed in Jenkins: sling-contrib-1.7 #984

Posted by Apache Jenkins Server <je...@builds.apache.org>.
See <https://builds.apache.org/job/sling-contrib-1.7/984/changes>

Changes:

[olli] SLING-5832 Update Jackrabbit to 2.12.2

[olli] SLING-5832 Update Jackrabbit to 2.12.2

------------------------------------------
[...truncated 13102 lines...]
[INFO] --- maven-source-plugin:2.4:jar (attach-sources) @ org.apache.sling.launchpad.karaf-features ---
[INFO] Building jar: <https://builds.apache.org/job/sling-contrib-1.7/ws/trunk/launchpad/karaf/org.apache.sling.launchpad.karaf-features/target/org.apache.sling.launchpad.karaf-features-0.1.1-SNAPSHOT-sources.jar>
[INFO] 
[INFO] --- karaf-maven-plugin:4.0.5:kar (features-create-kar) @ org.apache.sling.launchpad.karaf-features ---
Downloading: http://repository.apache.org/snapshots/org/apache/sling/org.apache.sling.api/2.11.1-SNAPSHOT/maven-metadata.xml
Downloaded: http://repository.apache.org/snapshots/org/apache/sling/org.apache.sling.api/2.11.1-SNAPSHOT/maven-metadata.xml (1012 B at 1.7 KB/sec)
Downloading: http://repository.apache.org/snapshots/org/apache/sling/org.apache.sling.commons.messaging/0.0.1-SNAPSHOT/maven-metadata.xml
Downloaded: http://repository.apache.org/snapshots/org/apache/sling/org.apache.sling.commons.messaging/0.0.1-SNAPSHOT/maven-metadata.xml (1014 B at 1.9 KB/sec)
Downloading: http://repository.apache.org/snapshots/org/apache/sling/org.apache.sling.commons.messaging/0.0.1-SNAPSHOT/org.apache.sling.commons.messaging-0.0.1-20160408.211943-1.jar
Downloaded: http://repository.apache.org/snapshots/org/apache/sling/org.apache.sling.commons.messaging/0.0.1-SNAPSHOT/org.apache.sling.commons.messaging-0.0.1-20160408.211943-1.jar (10 KB at 17.7 KB/sec)
Downloading: http://repository.apache.org/snapshots/org/apache/sling/org.apache.sling.commons.messaging.mail/0.0.1-SNAPSHOT/maven-metadata.xml
Downloaded: http://repository.apache.org/snapshots/org/apache/sling/org.apache.sling.commons.messaging.mail/0.0.1-SNAPSHOT/maven-metadata.xml (1019 B at 1.7 KB/sec)
Downloading: http://repository.apache.org/snapshots/org/apache/sling/org.apache.sling.commons.messaging.mail/0.0.1-SNAPSHOT/org.apache.sling.commons.messaging.mail-0.0.1-20160409.072306-2.jar
Downloaded: http://repository.apache.org/snapshots/org/apache/sling/org.apache.sling.commons.messaging.mail/0.0.1-SNAPSHOT/org.apache.sling.commons.messaging.mail-0.0.1-20160409.072306-2.jar (21 KB at 33.4 KB/sec)
Downloading: http://repository.apache.org/snapshots/org/apache/sling/org.apache.sling.discovery.base/1.1.3-SNAPSHOT/maven-metadata.xml
Downloaded: http://repository.apache.org/snapshots/org/apache/sling/org.apache.sling.discovery.base/1.1.3-SNAPSHOT/maven-metadata.xml (2 KB at 2.3 KB/sec)
Downloading: http://repository.apache.org/snapshots/org/apache/sling/org.apache.sling.discovery.base/1.1.3-SNAPSHOT/org.apache.sling.discovery.base-1.1.3-20160708.212849-1246.jar
Downloaded: http://repository.apache.org/snapshots/org/apache/sling/org.apache.sling.discovery.base/1.1.3-SNAPSHOT/org.apache.sling.discovery.base-1.1.3-20160708.212849-1246.jar (83 KB at 105.2 KB/sec)
Downloading: http://repository.apache.org/snapshots/org/apache/sling/org.apache.sling.discovery.impl/1.2.7-SNAPSHOT/maven-metadata.xml
Downloaded: http://repository.apache.org/snapshots/org/apache/sling/org.apache.sling.discovery.impl/1.2.7-SNAPSHOT/maven-metadata.xml (1023 B at 1.9 KB/sec)
Downloading: http://repository.apache.org/snapshots/org/apache/sling/org.apache.sling.discovery.impl/1.2.7-SNAPSHOT/org.apache.sling.discovery.impl-1.2.7-20160708.213307-1250.jar
Downloaded: http://repository.apache.org/snapshots/org/apache/sling/org.apache.sling.discovery.impl/1.2.7-SNAPSHOT/org.apache.sling.discovery.impl-1.2.7-20160708.213307-1250.jar (106 KB at 134.0 KB/sec)
Downloading: http://repository.apache.org/snapshots/org/apache/sling/org.apache.sling.discovery.oak/1.2.7-SNAPSHOT/maven-metadata.xml
Downloaded: http://repository.apache.org/snapshots/org/apache/sling/org.apache.sling.discovery.oak/1.2.7-SNAPSHOT/maven-metadata.xml (1018 B at 1.6 KB/sec)
Downloading: http://repository.apache.org/snapshots/org/apache/sling/org.apache.sling.discovery.oak/1.2.7-SNAPSHOT/org.apache.sling.discovery.oak-1.2.7-20160708.213550-760.jar
Downloaded: http://repository.apache.org/snapshots/org/apache/sling/org.apache.sling.discovery.oak/1.2.7-SNAPSHOT/org.apache.sling.discovery.oak-1.2.7-20160708.213550-760.jar (75 KB at 40.4 KB/sec)
Downloading: http://repository.apache.org/snapshots/org/apache/sling/org.apache.sling.validation.api/1.0.0-SNAPSHOT/maven-metadata.xml
Downloaded: http://repository.apache.org/snapshots/org/apache/sling/org.apache.sling.validation.api/1.0.0-SNAPSHOT/maven-metadata.xml (1023 B at 1.4 KB/sec)
Downloading: http://repository.apache.org/snapshots/org/apache/sling/org.apache.sling.validation.core/1.0.0-SNAPSHOT/maven-metadata.xml
Downloaded: http://repository.apache.org/snapshots/org/apache/sling/org.apache.sling.validation.core/1.0.0-SNAPSHOT/maven-metadata.xml (1 KB at 1.7 KB/sec)
Downloading: http://repository.apache.org/snapshots/org/apache/sling/org.apache.sling.jcr.oak.server/1.0.1-SNAPSHOT/maven-metadata.xml
Downloaded: http://repository.apache.org/snapshots/org/apache/sling/org.apache.sling.jcr.oak.server/1.0.1-SNAPSHOT/maven-metadata.xml (1023 B at 1.8 KB/sec)
Downloading: http://repository.apache.org/snapshots/org/apache/sling/org.apache.sling.jcr.oak.server/1.0.1-SNAPSHOT/org.apache.sling.jcr.oak.server-1.0.1-20160708.211140-1629.jar
Downloaded: http://repository.apache.org/snapshots/org/apache/sling/org.apache.sling.jcr.oak.server/1.0.1-SNAPSHOT/org.apache.sling.jcr.oak.server-1.0.1-20160708.211140-1629.jar (29 KB at 5.0 KB/sec)
Downloading: http://repository.apache.org/snapshots/org/apache/sling/org.apache.sling.scripting.core/2.0.37-SNAPSHOT/maven-metadata.xml
Downloaded: http://repository.apache.org/snapshots/org/apache/sling/org.apache.sling.scripting.core/2.0.37-SNAPSHOT/maven-metadata.xml (1023 B at 1.8 KB/sec)
Downloading: http://repository.apache.org/snapshots/org/apache/sling/org.apache.sling.scripting.core/2.0.37-SNAPSHOT/org.apache.sling.scripting.core-2.0.37-20160708.211429-743.jar
Downloaded: http://repository.apache.org/snapshots/org/apache/sling/org.apache.sling.scripting.core/2.0.37-SNAPSHOT/org.apache.sling.scripting.core-2.0.37-20160708.211429-743.jar (82 KB at 102.8 KB/sec)
Downloading: http://repository.apache.org/snapshots/org/apache/sling/org.apache.sling.servlets.resolver/2.4.3-SNAPSHOT/maven-metadata.xml
Downloaded: http://repository.apache.org/snapshots/org/apache/sling/org.apache.sling.servlets.resolver/2.4.3-SNAPSHOT/maven-metadata.xml (1022 B at 1.8 KB/sec)
Downloading: http://repository.apache.org/snapshots/org/apache/sling/org.apache.sling.servlets.resolver/2.4.3-SNAPSHOT/org.apache.sling.servlets.resolver-2.4.3-20160708.211257-701.jar
Downloaded: http://repository.apache.org/snapshots/org/apache/sling/org.apache.sling.servlets.resolver/2.4.3-SNAPSHOT/org.apache.sling.servlets.resolver-2.4.3-20160708.211257-701.jar (68 KB at 90.8 KB/sec)
Downloading: http://repo.maven.apache.org/maven2/org/apache/jackrabbit/jackrabbit-api/2.12.2/jackrabbit-api-2.12.2.jar
Downloaded: http://repo.maven.apache.org/maven2/org/apache/jackrabbit/jackrabbit-api/2.12.2/jackrabbit-api-2.12.2.jar (41 KB at 298.1 KB/sec)
Downloading: http://repo.maven.apache.org/maven2/org/apache/jackrabbit/jackrabbit-data/2.12.2/jackrabbit-data-2.12.2.jar
Downloaded: http://repo.maven.apache.org/maven2/org/apache/jackrabbit/jackrabbit-data/2.12.2/jackrabbit-data-2.12.2.jar (163 KB at 2052.6 KB/sec)
Downloading: http://repo.maven.apache.org/maven2/org/apache/jackrabbit/jackrabbit-jcr-commons/2.12.2/jackrabbit-jcr-commons-2.12.2.jar
Downloaded: http://repo.maven.apache.org/maven2/org/apache/jackrabbit/jackrabbit-jcr-commons/2.12.2/jackrabbit-jcr-commons-2.12.2.jar (391 KB at 4763.4 KB/sec)
Downloading: http://repo.maven.apache.org/maven2/org/apache/jackrabbit/jackrabbit-jcr-rmi/2.12.2/jackrabbit-jcr-rmi-2.12.2.jar
Downloaded: http://repo.maven.apache.org/maven2/org/apache/jackrabbit/jackrabbit-jcr-rmi/2.12.2/jackrabbit-jcr-rmi-2.12.2.jar (428 KB at 6470.8 KB/sec)
Downloading: http://repo.maven.apache.org/maven2/org/apache/jackrabbit/jackrabbit-spi/2.12.2/jackrabbit-spi-2.12.2.jar
Downloaded: http://repo.maven.apache.org/maven2/org/apache/jackrabbit/jackrabbit-spi/2.12.2/jackrabbit-spi-2.12.2.jar (28 KB at 503.1 KB/sec)
Downloading: http://repo.maven.apache.org/maven2/org/apache/jackrabbit/jackrabbit-spi-commons/2.12.2/jackrabbit-spi-commons-2.12.2.jar
Downloaded: http://repo.maven.apache.org/maven2/org/apache/jackrabbit/jackrabbit-spi-commons/2.12.2/jackrabbit-spi-commons-2.12.2.jar (782 KB at 9415.0 KB/sec)
Downloading: http://repo.maven.apache.org/maven2/org/apache/jackrabbit/jackrabbit-webdav/2.12.2/jackrabbit-webdav-2.12.2.jar
Downloaded: http://repo.maven.apache.org/maven2/org/apache/jackrabbit/jackrabbit-webdav/2.12.2/jackrabbit-webdav-2.12.2.jar (323 KB at 5120.9 KB/sec)
Downloading: http://repo.maven.apache.org/maven2/org/apache/sling/org.apache.sling.auth.openid/1.0.4/org.apache.sling.auth.openid-1.0.4.jar
Downloaded: http://repo.maven.apache.org/maven2/org/apache/sling/org.apache.sling.auth.openid/1.0.4/org.apache.sling.auth.openid-1.0.4.jar (300 KB at 1526.8 KB/sec)
Downloading: http://repo.maven.apache.org/maven2/org/apache/sling/org.apache.sling.auth.selector/1.0.6/org.apache.sling.auth.selector-1.0.6.jar
Downloaded: http://repo.maven.apache.org/maven2/org/apache/sling/org.apache.sling.auth.selector/1.0.6/org.apache.sling.auth.selector-1.0.6.jar (19 KB at 147.0 KB/sec)
Downloading: http://repository.apache.org/snapshots/org/apache/sling/org.apache.sling.hc.core/1.2.5-SNAPSHOT/maven-metadata.xml
Downloaded: http://repository.apache.org/snapshots/org/apache/sling/org.apache.sling.hc.core/1.2.5-SNAPSHOT/maven-metadata.xml (1012 B at 1.6 KB/sec)
Downloading: http://repository.apache.org/snapshots/org/apache/sling/org.apache.sling.hc.core/1.2.5-SNAPSHOT/org.apache.sling.hc.core-1.2.5-20160708.200550-563.jar
Downloaded: http://repository.apache.org/snapshots/org/apache/sling/org.apache.sling.hc.core/1.2.5-SNAPSHOT/org.apache.sling.hc.core-1.2.5-20160708.200550-563.jar (109 KB at 120.2 KB/sec)
Downloading: http://repo.maven.apache.org/maven2/org/apache/sling/org.apache.sling.hc.jmx/1.0.6/org.apache.sling.hc.jmx-1.0.6.jar
Downloaded: http://repo.maven.apache.org/maven2/org/apache/sling/org.apache.sling.hc.jmx/1.0.6/org.apache.sling.hc.jmx-1.0.6.jar (18 KB at 133.2 KB/sec)
Downloading: http://repository.apache.org/snapshots/org/apache/sling/org.apache.sling.scripting.freemarker/1.0.0-SNAPSHOT/maven-metadata.xml
Downloading: http://repository.apache.org/snapshots/org/apache/sling/org.apache.sling.scripting.freemarker/1.0.0-SNAPSHOT/org.apache.sling.scripting.freemarker-1.0.0-SNAPSHOT.jar
[JENKINS] Archiving disabled
[INFO] ------------------------------------------------------------------------
[INFO] Reactor Summary:
[INFO] 
[INFO] Apache Sling Authentication XING API .............. SUCCESS [27.994s]
[INFO] Apache Sling Authentication XING Login ............ SUCCESS [11.051s]
[INFO] Apache Sling Authentication XING OAuth ............ SUCCESS [35.995s]
[INFO] Apache Sling Commons HTML Utilities ............... SUCCESS [5.721s]
[INFO] Apache Sling APT parser ........................... SUCCESS [19.590s]
[INFO] Apache Sling APT servlet .......................... SUCCESS [5.656s]
[INFO] Apache Sling Resource Collection API .............. SUCCESS [10.172s]
[INFO] Apache Sling DataSource Provider .................. SUCCESS [13.441s]
[INFO] Apache Sling Dojo JavaScript Library .............. SUCCESS [18.041s]
[INFO] Apache Sling Dojo Data Extension .................. SUCCESS [3.860s]
[INFO] Apache Sling FTP Server ........................... SUCCESS [9.044s]
[INFO] Apache Sling Google Web Toolkit Servlet Library ... SUCCESS [8.811s]
[INFO] Apache Sling Google Web Toolkit Sample ............ SUCCESS [47.486s]
[INFO] Apache Sling JMX Resource Provider ................ SUCCESS [7.590s]
[INFO] Apache Sling ClassLoader Leak Detector ............ SUCCESS [8.628s]
[INFO] Apache Sling MongoDB Resource Provider ............ SUCCESS [4.414s]
[INFO] Apache Sling OSGi Bundle Repository ............... SUCCESS [6.412s]
[INFO] Apache Sling Distribution API ..................... SUCCESS [5.269s]
[INFO] Apache Sling Distribution Core .................... SUCCESS [20.670s]
[INFO] Apache Sling Distribution Extensions .............. SUCCESS [13.005s]
[INFO] Apache Sling Distribution Sample .................. SUCCESS [5.397s]
[INFO] Apache Sling Distribution Integration Tests ....... SUCCESS [15:13.391s]
[INFO] Apache Sling Log Tail Implementation .............. SUCCESS [8.463s]
[INFO] S3 dependencies for Oak ........................... SUCCESS [9.970s]
[INFO] Apache Sling Request Processing Analyzer .......... SUCCESS [3.413s]
[INFO] Apache Sling Resource Merger ...................... SUCCESS [9.194s]
[INFO] Apache Sling Inventory Printer Based on Resources . SUCCESS [27.233s]
[INFO] Apache Sling Rewriter ............................. SUCCESS [18.396s]
[INFO] Apache Sling Security ............................. SUCCESS [6.338s]
[INFO] Apache Sling SLF4J MDC Filter ..................... SUCCESS [21.003s]
[INFO] Apache Sling Query ................................ SUCCESS [12.294s]
[INFO] Apache Sling Oak Restrictions ..................... SUCCESS [9.452s]
[INFO] Apache Sling Superimposing Resource Provider ...... SUCCESS [11.209s]
[INFO] Apache Sling Tenant ............................... SUCCESS [6.202s]
[INFO] Apache Sling Log Tracer ........................... SUCCESS [10.864s]
[INFO] Apache Sling URL Rewriter ......................... SUCCESS [7.291s]
[INFO] HApi - Sling Hypermedia API tools ................. SUCCESS [3.560s]
[INFO] HApi - Sling Hypermedia API client-side tools ..... SUCCESS [10.175s]
[INFO] HApi - Sample Content ............................. SUCCESS [7.123s]
[INFO] HApi - Sling Hypermedia API Tools Reactor ......... SUCCESS [2.135s]
[INFO] Apache Sling Dynamic Include ...................... SUCCESS [2.813s]
[INFO] Apache Sling JCR Java Compiler .................... SUCCESS [10.762s]
[INFO] Apache Sling Repository Accessor .................. SUCCESS [8.113s]
[INFO] Apache Sling Object Content Mapping ............... SUCCESS [11.653s]
[INFO] Apache Sling JCR Prefs ............................ SUCCESS [5.406s]
[INFO] Apache Sling JCR Resource Security ................ SUCCESS [2.869s]
[INFO] Apache Sling Script Console ....................... SUCCESS [5.542s]
[INFO] Apache Sling Atom Tag Library ..................... SUCCESS [4.921s]
[INFO] Apache Sling Scripting Groovy Support ............. SUCCESS [5.814s]
[INFO] Apache Sling Scripting Java Support ............... SUCCESS [8.446s]
[INFO] Apache Sling Scripting JST Support ................ SUCCESS [19.121s]
[INFO] Apache Sling Scripting Python Support ............. SUCCESS [5.572s]
[INFO] Apache Sling Scripting Ruby Support ............... SUCCESS [14.388s]
[INFO] Scala Script Engine ............................... SUCCESS [1:44.695s]
[INFO] Apache Sling Scala Scripting Configuration ........ SUCCESS [5.282s]
[INFO] Scala for Sling Demo Application - Hello World .... SUCCESS [4.982s]
[INFO] Scala for Sling Demo Application - Forum .......... SUCCESS [2.691s]
[INFO] Apache Sling Scripting Velocity Support ........... SUCCESS [11.199s]
[INFO] Apache Sling Scripting W3C XML Processing Support . SUCCESS [8.331s]
[INFO] Apache Sling NoSQL Generic Resource Provider ...... SUCCESS [12.402s]
[INFO] Apache Sling NoSQL Couchbase Client ............... SUCCESS [7.324s]
[INFO] Apache Sling NoSQL Couchbase Resource Provider .... SUCCESS [8.763s]
[INFO] Apache Sling NoSQL MongoDB Resource Provider ...... SUCCESS [4.695s]
[INFO] Apache Sling Contrib NoSQL Modules Reactor ........ SUCCESS [1.629s]
[INFO] Apache Sling Launchpad Contrib Testing ............ SUCCESS [1:49.264s]
[INFO] Apache Sling Launchpad Karaf - Features ........... FAILURE [28.280s]
[INFO] Apache Sling Launchpad Karaf - Distribution ....... SKIPPED
[INFO] Apache Sling Launchpad Karaf - Integration Tests .. SKIPPED
[INFO] Apache Sling Launchpad Karaf - Launchpad Oak Tar Integration Tests  SKIPPED
[INFO] Apache Sling Launchpad Karaf Builder .............. SKIPPED
[INFO] Apache Sling Contrib (Builder) .................... SKIPPED
[INFO] ------------------------------------------------------------------------
[INFO] BUILD FAILURE
[INFO] ------------------------------------------------------------------------
[INFO] Total time: 31:03.494s
[INFO] Finished at: Fri Jul 08 21:46:01 UTC 2016
[INFO] Final Memory: 147M/451M
[INFO] ------------------------------------------------------------------------
[JENKINS] Archiving disabled
[JENKINS] Archiving disabled
[JENKINS] Archiving disabled
[JENKINS] Archiving disabled
[JENKINS] Archiving disabled
[JENKINS] Archiving disabled
[JENKINS] Archiving disabled
[JENKINS] Archiving disabled
[JENKINS] Archiving disabled
[JENKINS] Archiving disabled
[JENKINS] Archiving disabled
[JENKINS] Archiving disabled
[JENKINS] Archiving disabled
[JENKINS] Archiving disabled
[JENKINS] Archiving disabled
[JENKINS] Archiving disabled
[JENKINS] Archiving disabled
[JENKINS] Archiving disabled
[JENKINS] Archiving disabled
[JENKINS] Archiving disabled
[JENKINS] Archiving disabled
[JENKINS] Archiving disabled
[JENKINS] Archiving disabled
[JENKINS] Archiving disabled
[JENKINS] Archiving disabled
[JENKINS] Archiving disabled
[JENKINS] Archiving disabled
[JENKINS] Archiving disabled
[JENKINS] Archiving disabled
[JENKINS] Archiving disabled
[JENKINS] Archiving disabled
[JENKINS] Archiving disabled
[JENKINS] Archiving disabled
[JENKINS] Archiving disabled
[JENKINS] Archiving disabled
[JENKINS] Archiving disabled
[JENKINS] Archiving disabled
[JENKINS] Archiving disabled
[JENKINS] Archiving disabled
[JENKINS] Archiving disabled
[JENKINS] Archiving disabled
[JENKINS] Archiving disabled
[JENKINS] Archiving disabled
[JENKINS] Archiving disabled
[JENKINS] Archiving disabled
[JENKINS] Archiving disabled
[JENKINS] Archiving disabled
[JENKINS] Archiving disabled
[JENKINS] Archiving disabled
[JENKINS] Archiving disabled
[JENKINS] Archiving disabled
[JENKINS] Archiving disabled
[JENKINS] Archiving disabled
[JENKINS] Archiving disabled
[JENKINS] Archiving disabled
[JENKINS] Archiving disabled
[JENKINS] Archiving disabled
[JENKINS] Archiving disabled
[JENKINS] Archiving disabled
[JENKINS] Archiving disabled
[JENKINS] Archiving disabled
[JENKINS] Archiving disabled
[JENKINS] Archiving disabled
[JENKINS] Archiving disabled
[JENKINS] Archiving disabled
[JENKINS] Archiving disabled
[JENKINS] Archiving disabled
[JENKINS] Archiving disabled
[JENKINS] Archiving disabled
[JENKINS] Archiving disabled
[JENKINS] Archiving disabled
Waiting for Jenkins to finish collecting data
[ERROR] Failed to execute goal org.apache.karaf.tooling:karaf-maven-plugin:4.0.5:kar (features-create-kar) on project org.apache.sling.launchpad.karaf-features: Failed to create archive: Could not find artifact org.apache.sling:org.apache.sling.scripting.freemarker:jar:1.0.0-SNAPSHOT in Nexus (http://repository.apache.org/snapshots)
[ERROR] 
[ERROR] Try downloading the file manually from the project website.
[ERROR] 
[ERROR] Then, install it using the command:
[ERROR] mvn install:install-file -DgroupId=org.apache.sling -DartifactId=org.apache.sling.scripting.freemarker -Dversion=1.0.0-SNAPSHOT -Dpackaging=jar -Dfile=/path/to/file
[ERROR] 
[ERROR] Alternatively, if you host your own repository you can deploy the file there:
[ERROR] mvn deploy:deploy-file -DgroupId=org.apache.sling -DartifactId=org.apache.sling.scripting.freemarker -Dversion=1.0.0-SNAPSHOT -Dpackaging=jar -Dfile=/path/to/file -Durl=[url] -DrepositoryId=[id]
[ERROR] 
[ERROR] 
[ERROR] org.apache.sling:org.apache.sling.scripting.freemarker:jar:1.0.0-SNAPSHOT
[ERROR] 
[ERROR] from the specified remote repositories:
[ERROR] Nexus (http://repository.apache.org/snapshots, releases=false, snapshots=true),
[ERROR] central (http://repo.maven.apache.org/maven2, releases=true, snapshots=false)
[ERROR] -> [Help 1]
[ERROR] 
[ERROR] To see the full stack trace of the errors, re-run Maven with the -e switch.
[ERROR] Re-run Maven using the -X switch to enable full debug logging.
[ERROR] 
[ERROR] For more information about the errors and possible solutions, please read the following articles:
[ERROR] [Help 1] http://cwiki.apache.org/confluence/display/MAVEN/MojoExecutionException
[ERROR] 
[ERROR] After correcting the problems, you can resume the build with the command
[ERROR]   mvn <goals> -rf :org.apache.sling.launchpad.karaf-features
channel stopped

Build failed in Jenkins: sling-contrib-1.7 #983

Posted by Apache Jenkins Server <je...@builds.apache.org>.
See <https://builds.apache.org/job/sling-contrib-1.7/983/changes>

Changes:

[rombert] SLING-5768 - Introduce sling:resourceTypes as extension to Oak permission system

Add module to contrib reactor.

[rombert] SLING-5768 Introduce sling:resourceTypes as extension to Oak permission system

Submitted-By: Georg Henzler

------------------------------------------
[...truncated 1454 lines...]
[INFO] 
[INFO] --- apache-rat-plugin:0.11:check (default) @ org.apache.sling.datasource ---
[INFO] 51 implicit excludes (use -debug for more details).
[INFO] Exclude: src/main/appended-resources/META-INF/*
[INFO] Exclude: velocity.log
[INFO] Exclude: target/*
[INFO] Exclude: README.md
[INFO] Exclude: maven-eclipse.xml
[INFO] Exclude: .*
[INFO] Exclude: .*/**
[INFO] Exclude: **/*.json
[INFO] Exclude: DEPENDENCIES
[INFO] Exclude: **/*.rej
[INFO] Exclude: hs_err_*.log
[INFO] 10 resources included (use -debug for more details)
[INFO] Rat check: Summary of files. Unapproved: 0 unknown: 0 generated: 0 approved: 10 licence.
[INFO] 
[INFO] --- maven-bundle-plugin:3.0.1:baseline (baseline) @ org.apache.sling.datasource ---
[INFO] artifact org.apache.sling:org.apache.sling.datasource: checking for updates from Nexus
[INFO] artifact org.apache.sling:org.apache.sling.datasource: checking for updates from central
[INFO] Baseline Report - Generated by Apache Felix Maven Bundle Plugin on 2016-07-08T12:22Z based on Bnd - see http://www.aqute.biz/Bnd/Bnd
[INFO] Comparing bundle org.apache.sling.datasource version 1.0.1-SNAPSHOT to version 1.0.0
[INFO] 
[INFO]   PACKAGE_NAME                                       DELTA      CUR_VER    BASE_VER   REC_VER    WARNINGS  
[INFO] = ================================================== ========== ========== ========== ========== ==========
[INFO] Baseline analysis complete, 0 error(s), 0 warning(s)
[INFO] 
[INFO] --- maven-failsafe-plugin:2.18.1:verify (default) @ org.apache.sling.datasource ---
[INFO] Failsafe report directory: <https://builds.apache.org/job/sling-contrib-1.7/ws/trunk/extensions/datasource/target/failsafe-reports>
[JENKINS] Recording test results[INFO] 
[INFO] --- maven-install-plugin:2.5.2:install (default-install) @ org.apache.sling.datasource ---
[INFO] Installing <https://builds.apache.org/job/sling-contrib-1.7/ws/trunk/extensions/datasource/target/org.apache.sling.datasource-1.0.1-SNAPSHOT.jar> to /home/jenkins/jenkins-slave/maven-repositories/1/org/apache/sling/org.apache.sling.datasource/1.0.1-SNAPSHOT/org.apache.sling.datasource-1.0.1-SNAPSHOT.jar
[INFO] Installing <https://builds.apache.org/job/sling-contrib-1.7/ws/trunk/extensions/datasource/pom.xml> to /home/jenkins/jenkins-slave/maven-repositories/1/org/apache/sling/org.apache.sling.datasource/1.0.1-SNAPSHOT/org.apache.sling.datasource-1.0.1-SNAPSHOT.pom

[INFO] Installing <https://builds.apache.org/job/sling-contrib-1.7/ws/trunk/extensions/datasource/target/org.apache.sling.datasource-1.0.1-SNAPSHOT-sources.jar> to /home/jenkins/jenkins-slave/maven-repositories/1/org/apache/sling/org.apache.sling.datasource/1.0.1-SNAPSHOT/org.apache.sling.datasource-1.0.1-SNAPSHOT-sources.jar
[INFO] 
[INFO] --- maven-bundle-plugin:3.0.1:install (default-install) @ org.apache.sling.datasource ---
[INFO] Local OBR update disabled (enable with -DobrRepository)
[JENKINS] Archiving disabled
[INFO]                                                                         
[INFO] ------------------------------------------------------------------------
[INFO] Building Apache Sling Dojo JavaScript Library 1.1.0.002-SNAPSHOT
[INFO] ------------------------------------------------------------------------
[INFO] 
[INFO] --- maven-clean-plugin:2.5:clean (default-clean) @ org.apache.sling.extensions.dojo ---
[INFO] 
[INFO] --- maven-enforcer-plugin:1.3.1:enforce (enforce-java) @ org.apache.sling.extensions.dojo ---
[INFO] 
[INFO] --- maven-antrun-plugin:1.8:run (set-bundle-required-execution-environment) @ org.apache.sling.extensions.dojo ---
[INFO] Executing tasks

main:
[INFO] Executed tasks
[INFO] 
[INFO] --- maven-remote-resources-plugin:1.5:process (default) @ org.apache.sling.extensions.dojo ---
[INFO] 
[INFO] --- maven-resources-plugin:2.7:resources (default-resources) @ org.apache.sling.extensions.dojo ---
[INFO] Using 'UTF-8' encoding to copy filtered resources.
[INFO] Copying 4 resources
[INFO] Copying 3 resources
[INFO] 
[INFO] --- maven-antrun-plugin:1.8:run (check-memory-task) @ org.apache.sling.extensions.dojo ---
[INFO] Executing tasks

main:
     [echo] **************** WARNING (SLING-443/SLING-1782) ******************************
     [echo] On most platforms, you'll get OutOfMemoryErrors when building unless you set
     [echo] on 32bit platforms: MAVEN_OPTS="-Xmx256M -XX:MaxPermSize=256M", see SLING-443
     [echo] on 64bit platforms: MAVEN_OPTS="-Xmx512M -XX:MaxPermSize=512M", see SLING-1782
     [echo] ******************************************************************************
[INFO] Executed tasks
[INFO] 
[INFO] --- maven-antrun-plugin:1.8:run (download-dojo) @ org.apache.sling.extensions.dojo ---
[WARNING] Parameter tasks is deprecated, use target instead
[INFO] Executing tasks

main:
    [mkdir] Created dir: <https://builds.apache.org/job/sling-contrib-1.7/ws/trunk/extensions/dojo/download-cache>
    [mkdir] Created dir: <https://builds.apache.org/job/sling-contrib-1.7/ws/trunk/extensions/dojo/target/dojo>
      [get] Getting: http://download.dojotoolkit.org/release-1.1.1/dojo-release-1.1.1-src.tar.gz
      [get] To: <https://builds.apache.org/job/sling-contrib-1.7/ws/trunk/extensions/dojo/download-cache/dojo-release-1.1.1-src.tar.gz>
      [get] Error getting http://download.dojotoolkit.org/release-1.1.1/dojo-release-1.1.1-src.tar.gz to <https://builds.apache.org/job/sling-contrib-1.7/ws/trunk/extensions/dojo/download-cache/dojo-release-1.1.1-src.tar.gz>
[JENKINS] Archiving disabled
[INFO] ------------------------------------------------------------------------
[INFO] Reactor Summary:
[INFO] 
[INFO] Apache Sling Authentication XING API .............. SUCCESS [18.899s]
[INFO] Apache Sling Authentication XING Login ............ SUCCESS [13.583s]
[INFO] Apache Sling Authentication XING OAuth ............ SUCCESS [6.913s]
[INFO] Apache Sling Commons HTML Utilities ............... SUCCESS [3.572s]
[INFO] Apache Sling APT parser ........................... SUCCESS [18.783s]
[INFO] Apache Sling APT servlet .......................... SUCCESS [6.382s]
[INFO] Apache Sling Resource Collection API .............. SUCCESS [8.016s]
[INFO] Apache Sling DataSource Provider .................. SUCCESS [16.038s]
[INFO] Apache Sling Dojo JavaScript Library .............. FAILURE [2.397s]
[INFO] Apache Sling Dojo Data Extension .................. SKIPPED
[INFO] Apache Sling FTP Server ........................... SKIPPED
[INFO] Apache Sling Google Web Toolkit Servlet Library ... SKIPPED
[INFO] Apache Sling Google Web Toolkit Sample ............ SKIPPED
[INFO] Apache Sling JMX Resource Provider ................ SKIPPED
[INFO] Apache Sling ClassLoader Leak Detector ............ SKIPPED
[INFO] Apache Sling MongoDB Resource Provider ............ SKIPPED
[INFO] Apache Sling OSGi Bundle Repository ............... SKIPPED
[INFO] Apache Sling Distribution API ..................... SKIPPED
[INFO] Apache Sling Distribution Core .................... SKIPPED
[INFO] Apache Sling Distribution Extensions .............. SKIPPED
[INFO] Apache Sling Distribution Sample .................. SKIPPED
[INFO] Apache Sling Distribution Integration Tests ....... SKIPPED
[INFO] Apache Sling Log Tail Implementation .............. SKIPPED
[INFO] S3 dependencies for Oak ........................... SKIPPED
[INFO] Apache Sling Request Processing Analyzer .......... SKIPPED
[INFO] Apache Sling Resource Merger ...................... SKIPPED
[INFO] Apache Sling Inventory Printer Based on Resources . SKIPPED
[INFO] Apache Sling Rewriter ............................. SKIPPED
[INFO] Apache Sling Security ............................. SKIPPED
[INFO] Apache Sling SLF4J MDC Filter ..................... SKIPPED
[INFO] Apache Sling Query ................................ SKIPPED
[INFO] Apache Sling Oak Restrictions ..................... SKIPPED
[INFO] Apache Sling Superimposing Resource Provider ...... SKIPPED
[INFO] Apache Sling Tenant ............................... SKIPPED
[INFO] Apache Sling Log Tracer ........................... SKIPPED
[INFO] Apache Sling URL Rewriter ......................... SKIPPED
[INFO] HApi - Sling Hypermedia API tools ................. SKIPPED
[INFO] HApi - Sling Hypermedia API client-side tools ..... SKIPPED
[INFO] HApi - Sample Content ............................. SKIPPED
[INFO] HApi - Sling Hypermedia API Tools Reactor ......... SKIPPED
[INFO] Apache Sling Dynamic Include ...................... SKIPPED
[INFO] Apache Sling JCR Java Compiler .................... SKIPPED
[INFO] Apache Sling Repository Accessor .................. SKIPPED
[INFO] Apache Sling Object Content Mapping ............... SKIPPED
[INFO] Apache Sling JCR Prefs ............................ SKIPPED
[INFO] Apache Sling JCR Resource Security ................ SKIPPED
[INFO] Apache Sling Script Console ....................... SKIPPED
[INFO] Apache Sling Atom Tag Library ..................... SKIPPED
[INFO] Apache Sling Scripting Groovy Support ............. SKIPPED
[INFO] Apache Sling Scripting Java Support ............... SKIPPED
[INFO] Apache Sling Scripting JST Support ................ SKIPPED
[INFO] Apache Sling Scripting Python Support ............. SKIPPED
[INFO] Apache Sling Scripting Ruby Support ............... SKIPPED
[INFO] Scala Script Engine ............................... SKIPPED
[INFO] Apache Sling Scala Scripting Configuration ........ SKIPPED
[INFO] Scala for Sling Demo Application - Hello World .... SKIPPED
[INFO] Scala for Sling Demo Application - Forum .......... SKIPPED
[INFO] Apache Sling Scripting Velocity Support ........... SKIPPED
[INFO] Apache Sling Scripting W3C XML Processing Support . SKIPPED
[INFO] Apache Sling NoSQL Generic Resource Provider ...... SKIPPED
[INFO] Apache Sling NoSQL Couchbase Client ............... SKIPPED
[INFO] Apache Sling NoSQL Couchbase Resource Provider .... SKIPPED
[INFO] Apache Sling NoSQL MongoDB Resource Provider ...... SKIPPED
[INFO] Apache Sling Contrib NoSQL Modules Reactor ........ SKIPPED
[INFO] Apache Sling Launchpad Contrib Testing ............ SKIPPED
[INFO] Apache Sling Launchpad Karaf - Features ........... SKIPPED
[INFO] Apache Sling Launchpad Karaf - Distribution ....... SKIPPED
[INFO] Apache Sling Launchpad Karaf - Integration Tests .. SKIPPED
[INFO] Apache Sling Launchpad Karaf - Launchpad Oak Tar Integration Tests  SKIPPED
[INFO] Apache Sling Launchpad Karaf Builder .............. SKIPPED
[INFO] Apache Sling Contrib (Builder) .................... SKIPPED
[INFO] ------------------------------------------------------------------------
[INFO] BUILD FAILURE
[INFO] ------------------------------------------------------------------------
[INFO] Total time: 1:46.623s
[INFO] Finished at: Fri Jul 08 12:22:11 UTC 2016
[INFO] Final Memory: 69M/471M
[INFO] ------------------------------------------------------------------------
[JENKINS] Archiving disabled
[JENKINS] Archiving disabled
[JENKINS] Archiving disabled
[JENKINS] Archiving disabled
[JENKINS] Archiving disabled
[JENKINS] Archiving disabled
[JENKINS] Archiving disabled
[JENKINS] Archiving disabled
[JENKINS] Archiving disabled
[JENKINS] Archiving disabled
[JENKINS] Archiving disabled
[JENKINS] Archiving disabled
[JENKINS] Archiving disabled
[JENKINS] Archiving disabled
[JENKINS] Archiving disabled
[JENKINS] Archiving disabled
[JENKINS] Archiving disabled
[JENKINS] Archiving disabled
[JENKINS] Archiving disabled
[JENKINS] Archiving disabled
[JENKINS] Archiving disabled
[JENKINS] Archiving disabled
[JENKINS] Archiving disabled
[JENKINS] Archiving disabled
[JENKINS] Archiving disabled
[JENKINS] Archiving disabled
[JENKINS] Archiving disabled
[JENKINS] Archiving disabled
[JENKINS] Archiving disabled
[JENKINS] Archiving disabled
[JENKINS] Archiving disabled
[JENKINS] Archiving disabled
[JENKINS] Archiving disabled
[JENKINS] Archiving disabled
[JENKINS] Archiving disabled
[JENKINS] Archiving disabled
[JENKINS] Archiving disabled
[JENKINS] Archiving disabled
[JENKINS] Archiving disabled
[JENKINS] Archiving disabled
[JENKINS] Archiving disabled
[JENKINS] Archiving disabled
[JENKINS] Archiving disabled
[JENKINS] Archiving disabled
[JENKINS] Archiving disabled
[JENKINS] Archiving disabled
[JENKINS] Archiving disabled
[JENKINS] Archiving disabled
[JENKINS] Archiving disabled
[JENKINS] Archiving disabled
[JENKINS] Archiving disabled
[JENKINS] Archiving disabled
[JENKINS] Archiving disabled
[JENKINS] Archiving disabled
[JENKINS] Archiving disabled
[JENKINS] Archiving disabled
[JENKINS] Archiving disabled
[JENKINS] Archiving disabled
[JENKINS] Archiving disabled
[JENKINS] Archiving disabled
[JENKINS] Archiving disabled
[JENKINS] Archiving disabled
[JENKINS] Archiving disabled
[JENKINS] Archiving disabled
[JENKINS] Archiving disabled
[JENKINS] Archiving disabled
[JENKINS] Archiving disabled
[JENKINS] Archiving disabled
[JENKINS] Archiving disabled
[JENKINS] Archiving disabled
[JENKINS] Archiving disabled
Waiting for Jenkins to finish collecting data
[ERROR] Failed to execute goal org.apache.maven.plugins:maven-antrun-plugin:1.8:run (download-dojo) on project org.apache.sling.extensions.dojo: An Ant BuildException has occured: java.net.UnknownHostException: download.dojotoolkit.org
[ERROR] around Ant part ...<get dest="./download-cache/dojo-release-1.1.1-src.tar.gz" src="http://download.dojotoolkit.org/release-1.1.1/dojo-release-1.1.1-src.tar.gz" usetimestamp="true"/>... @ 19:165 in <https://builds.apache.org/job/sling-contrib-1.7/ws/trunk/extensions/dojo/target/antrun/build-main.xml>: Unknown host download.dojotoolkit.org
[ERROR] -> [Help 1]
[ERROR] 
[ERROR] To see the full stack trace of the errors, re-run Maven with the -e switch.
[ERROR] Re-run Maven using the -X switch to enable full debug logging.
[ERROR] 
[ERROR] For more information about the errors and possible solutions, please read the following articles:
[ERROR] [Help 1] http://cwiki.apache.org/confluence/display/MAVEN/MojoExecutionException
[ERROR] 
[ERROR] After correcting the problems, you can resume the build with the command
[ERROR]   mvn <goals> -rf :org.apache.sling.extensions.dojo
channel stopped

Jenkins build is still unstable: sling-contrib-1.7 #982

Posted by Apache Jenkins Server <je...@builds.apache.org>.
See <https://builds.apache.org/job/sling-contrib-1.7/changes>


Jenkins build is still unstable: sling-contrib-1.7 #981

Posted by Apache Jenkins Server <je...@builds.apache.org>.
See <https://builds.apache.org/job/sling-contrib-1.7/changes>


Jenkins build is still unstable: sling-contrib-1.7 #980

Posted by Apache Jenkins Server <je...@builds.apache.org>.
See <https://builds.apache.org/job/sling-contrib-1.7/changes>


Jenkins build is still unstable: sling-contrib-1.7 #979

Posted by Apache Jenkins Server <je...@builds.apache.org>.
See <https://builds.apache.org/job/sling-contrib-1.7/changes>


Jenkins build is still unstable: sling-contrib-1.7 #978

Posted by Apache Jenkins Server <je...@builds.apache.org>.
See <https://builds.apache.org/job/sling-contrib-1.7/changes>


Jenkins build is still unstable: sling-contrib-1.7 #977

Posted by Apache Jenkins Server <je...@builds.apache.org>.
See <https://builds.apache.org/job/sling-contrib-1.7/changes>


Jenkins build is still unstable: sling-contrib-1.7 #976

Posted by Apache Jenkins Server <je...@builds.apache.org>.
See <https://builds.apache.org/job/sling-contrib-1.7/changes>


Jenkins build is still unstable: sling-contrib-1.7 #975

Posted by Apache Jenkins Server <je...@builds.apache.org>.
See <https://builds.apache.org/job/sling-contrib-1.7/changes>


Jenkins build is still unstable: sling-contrib-1.7 #974

Posted by Apache Jenkins Server <je...@builds.apache.org>.
See <https://builds.apache.org/job/sling-contrib-1.7/changes>


Jenkins build is still unstable: sling-contrib-1.7 #973

Posted by Apache Jenkins Server <je...@builds.apache.org>.
See <https://builds.apache.org/job/sling-contrib-1.7/changes>


Jenkins build is still unstable: sling-contrib-1.7 #972

Posted by Apache Jenkins Server <je...@builds.apache.org>.
See <https://builds.apache.org/job/sling-contrib-1.7/changes>


Jenkins build is still unstable: sling-contrib-1.7 #971

Posted by Apache Jenkins Server <je...@builds.apache.org>.
See <https://builds.apache.org/job/sling-contrib-1.7/changes>


Jenkins build is still unstable: sling-contrib-1.7 #970

Posted by Apache Jenkins Server <je...@builds.apache.org>.
See <https://builds.apache.org/job/sling-contrib-1.7/changes>


Jenkins build is still unstable: sling-contrib-1.7 #969

Posted by Apache Jenkins Server <je...@builds.apache.org>.
See <https://builds.apache.org/job/sling-contrib-1.7/changes>


Jenkins build is still unstable: sling-contrib-1.7 #968

Posted by Apache Jenkins Server <je...@builds.apache.org>.
See <https://builds.apache.org/job/sling-contrib-1.7/changes>


Jenkins build is still unstable: sling-contrib-1.7 #967

Posted by Apache Jenkins Server <je...@builds.apache.org>.
See <https://builds.apache.org/job/sling-contrib-1.7/changes>


Jenkins build is unstable: sling-contrib-1.7 #966

Posted by Apache Jenkins Server <je...@builds.apache.org>.
See <https://builds.apache.org/job/sling-contrib-1.7/966/changes>


Build failed in Jenkins: sling-contrib-1.7 #965

Posted by Apache Jenkins Server <je...@builds.apache.org>.
See <https://builds.apache.org/job/sling-contrib-1.7/965/changes>

Changes:

[olli] SLING-5075 Upgrade Thymeleaf to 3.0 

tweak names, descriptions and messages

------------------------------------------
Started by an SCM change
[EnvInject] - Loading node environment variables.
Building remotely on ubuntu-6 (docker Ubuntu ubuntu yahoo-not-h2) in workspace <https://builds.apache.org/job/sling-contrib-1.7/ws/>
Cleaning up <https://builds.apache.org/job/sling-contrib-1.7/ws/trunk>
Deleting <https://builds.apache.org/job/sling-contrib-1.7/ws/trunk/hs_err_pid23329.log>
Updating http://svn.apache.org/repos/asf/sling/trunk/contrib at revision '2016-06-23T19:18:20.106 +0000'
D         scripting/org.apache.sling.scripting.thymeleaf/src/main/java/org/apache/sling/scripting/thymeleaf/internal/PatternSpecTemplateModeProvider.java
D         scripting/org.apache.sling.scripting.thymeleaf/src/main/java/org/apache/sling/scripting/thymeleaf/internal/PatternSpecTemplateModeProviderConfiguration.java
U         scripting/org.apache.sling.scripting.thymeleaf/src/main/java/org/apache/sling/scripting/thymeleaf/internal/ResourceBundleMessageResolverConfiguration.java
A         scripting/org.apache.sling.scripting.thymeleaf/src/main/java/org/apache/sling/scripting/thymeleaf/internal/PatternTemplateModeProviderConfiguration.java
U         scripting/org.apache.sling.scripting.thymeleaf/src/main/java/org/apache/sling/scripting/thymeleaf/internal/ThymeleafScriptEngineFactory.java
U         scripting/org.apache.sling.scripting.thymeleaf/src/main/java/org/apache/sling/scripting/thymeleaf/internal/SlingResourceTemplateResolver.java
U         scripting/org.apache.sling.scripting.thymeleaf/src/main/java/org/apache/sling/scripting/thymeleaf/internal/ResourceBundleMessageResolver.java
A         scripting/org.apache.sling.scripting.thymeleaf/src/main/java/org/apache/sling/scripting/thymeleaf/internal/PatternTemplateModeProvider.java
U         scripting/org.apache.sling.scripting.thymeleaf/src/main/java/org/apache/sling/scripting/thymeleaf/internal/ThymeleafScriptEngineFactoryConfiguration.java
U         scripting/org.apache.sling.scripting.thymeleaf/src/main/java/org/apache/sling/scripting/thymeleaf/internal/SlingResourceTemplateResolverConfiguration.java
U         scripting/org.apache.sling.scripting.thymeleaf/README.md
U         scripting/org.apache.sling.scripting.thymeleaf.it/src/test/java/org/apache/sling/scripting/thymeleaf/it/ThymeleafTestSupport.java
U         scripting/org.apache.sling.scripting.thymeleaf.it/src/main/resources/content/thymeleaf.json
U         scripting/org.apache.sling.scripting.thymeleaf.it/src/main/java/org/apache/sling/scripting/thymeleaf/it/Activator.java
U         scripting/org.apache.sling.scripting.thymeleaf.it/pom.xml
At revision 1749979

Parsing POMs
Modules changed, recalculating dependency graph
Established TCP socket on 40827
maven3-agent.jar already up to date
maven3-interceptor.jar already up to date
maven3-interceptor-commons.jar already up to date
[trunk] $ /home/jenkins/jenkins-slave/tools/hudson.model.JDK/JDK_1.7_latest_/bin/java -Xmx512M -XX:MaxPermSize=256M -enableassertions -cp /home/jenkins/jenkins-slave/maven3-agent.jar:/home/jenkins/jenkins-slave/tools/hudson.tasks.Maven_MavenInstallation/Maven_3.0.5/boot/plexus-classworlds-2.4.jar org.jvnet.hudson.maven3.agent.Maven3Main /home/jenkins/jenkins-slave/tools/hudson.tasks.Maven_MavenInstallation/Maven_3.0.5 /home/jenkins/jenkins-slave/slave.jar /home/jenkins/jenkins-slave/maven3-interceptor.jar /home/jenkins/jenkins-slave/maven3-interceptor-commons.jar 40827
#
# There is insufficient memory for the Java Runtime Environment to continue.
# Cannot create GC thread. Out of system resources.
# An error report file with more information is saved as:
# <https://builds.apache.org/job/sling-contrib-1.7/ws/trunk/hs_err_pid2593.log>
ERROR: Failed to launch Maven. Exit code = 1


Build failed in Jenkins: sling-contrib-1.7 #964

Posted by Apache Jenkins Server <je...@builds.apache.org>.
See <https://builds.apache.org/job/sling-contrib-1.7/964/changes>

Changes:

[olli] SLING-5680 Add Integration Tests for Scripting Thymeleaf

style

[olli] SLING-5680 Add Integration Tests for Scripting Thymeleaf

add missing resource decoupled

[olli] SLING-5680 Add Integration Tests for Scripting Thymeleaf

use Pax Exam Options instead of Karaf Features

------------------------------------------
[...truncated 9543 lines...]
[WARNING] Bundle org.apache.sling:org.apache.sling.scripting.thymeleaf:bundle:0.1.7-SNAPSHOT : Split package, multiple jars provide the same package:org/thymeleaf/engine
Use Import/Export Package directive -split-package:=(merge-first|merge-last|error|first) to get rid of this warning
Package found in   [Jar:., Jar:thymeleaf]
Class path         [Jar:., Jar:servlet-api, Jar:osgi.core, Jar:osgi.annotation, Jar:org.osgi.service.component.annotations, Jar:org.osgi.service.metatype.annotations, Jar:commons-io, Jar:org.apache.sling.api, Jar:org.apache.sling.scripting.api, Jar:org.apache.sling.scripting.core, Jar:org.apache.sling.i18n, Jar:thymeleaf, Jar:attoparser, Jar:unbescape, Jar:ognl, Jar:javassist, Jar:javassist, Jar:slf4j-api, Jar:org.apache.felix.scr.annotations, Jar:bndlib]
[WARNING] Bundle org.apache.sling:org.apache.sling.scripting.thymeleaf:bundle:0.1.7-SNAPSHOT : Split package, multiple jars provide the same package:org/thymeleaf/templateresolver
Use Import/Export Package directive -split-package:=(merge-first|merge-last|error|first) to get rid of this warning
Package found in   [Jar:., Jar:thymeleaf]
Class path         [Jar:., Jar:servlet-api, Jar:osgi.core, Jar:osgi.annotation, Jar:org.osgi.service.component.annotations, Jar:org.osgi.service.metatype.annotations, Jar:commons-io, Jar:org.apache.sling.api, Jar:org.apache.sling.scripting.api, Jar:org.apache.sling.scripting.core, Jar:org.apache.sling.i18n, Jar:thymeleaf, Jar:attoparser, Jar:unbescape, Jar:ognl, Jar:javassist, Jar:javassist, Jar:slf4j-api, Jar:org.apache.felix.scr.annotations, Jar:bndlib]
[INFO] 
[INFO] --- maven-enforcer-plugin:1.3.1:enforce (enforce-java) @ org.apache.sling.scripting.thymeleaf ---
[INFO] 
[INFO] --- maven-antrun-plugin:1.8:run (set-bundle-required-execution-environment) @ org.apache.sling.scripting.thymeleaf ---
[INFO] Executing tasks

main:
Setting Bundle-RequiredExecutionEnvironment=JavaSE-1.7 from sling.java.version=7
[INFO] Executed tasks
[WARNING] Failed to getClass for org.apache.maven.plugin.source.SourceJarMojo
[INFO] 
[INFO] --- maven-source-plugin:2.4:jar (attach-sources) @ org.apache.sling.scripting.thymeleaf ---
[INFO] Building jar: <https://builds.apache.org/job/sling-contrib-1.7/ws/trunk/scripting/org.apache.sling.scripting.thymeleaf/target/org.apache.sling.scripting.thymeleaf-0.1.7-SNAPSHOT-sources.jar>
[INFO] 
[INFO] --- maven-site-plugin:3.4:attach-descriptor (attach-descriptor) @ org.apache.sling.scripting.thymeleaf ---
[INFO] 
[INFO] --- ianal-maven-plugin:1.0-alpha-1:verify-legal-files (default) @ org.apache.sling.scripting.thymeleaf ---
[INFO] Checking legal files in: org.apache.sling.scripting.thymeleaf-0.1.7-SNAPSHOT.jar
[INFO] Checking legal files in: org.apache.sling.scripting.thymeleaf-0.1.7-SNAPSHOT-sources.jar
[INFO] 
[INFO] --- apache-rat-plugin:0.11:check (default) @ org.apache.sling.scripting.thymeleaf ---
[INFO] 51 implicit excludes (use -debug for more details).
[INFO] Exclude: src/main/appended-resources/META-INF/*
[INFO] Exclude: velocity.log
[INFO] Exclude: target/*
[INFO] Exclude: README.md
[INFO] Exclude: maven-eclipse.xml
[INFO] Exclude: .*
[INFO] Exclude: .*/**
[INFO] Exclude: **/*.json
[INFO] Exclude: DEPENDENCIES
[INFO] Exclude: **/*.rej
[INFO] Exclude: hs_err_*.log
[INFO] 19 resources included (use -debug for more details)
[INFO] Rat check: Summary of files. Unapproved: 0 unknown: 0 generated: 0 approved: 19 licence.
[INFO] 
[INFO] --- maven-bundle-plugin:3.0.1:baseline (baseline) @ org.apache.sling.scripting.thymeleaf ---
[INFO] artifact org.apache.sling:org.apache.sling.scripting.thymeleaf: checking for updates from Nexus
[INFO] artifact org.apache.sling:org.apache.sling.scripting.thymeleaf: checking for updates from central
[INFO] Baseline Report - Generated by Apache Felix Maven Bundle Plugin on 2016-06-23T15:47Z based on Bnd - see http://www.aqute.biz/Bnd/Bnd
[INFO] Comparing bundle org.apache.sling.scripting.thymeleaf version 0.1.7-SNAPSHOT to version 0.0.6
[INFO] 
[INFO]   PACKAGE_NAME                                       DELTA      CUR_VER    BASE_VER   REC_VER    WARNINGS  
[INFO] = ================================================== ========== ========== ========== ========== ==========
[INFO] Baseline analysis complete, 0 error(s), 0 warning(s)
[INFO] 
[INFO] --- maven-install-plugin:2.5.2:install (default-install) @ org.apache.sling.scripting.thymeleaf ---
[INFO] Installing <https://builds.apache.org/job/sling-contrib-1.7/ws/trunk/scripting/org.apache.sling.scripting.thymeleaf/target/org.apache.sling.scripting.thymeleaf-0.1.7-SNAPSHOT.jar> to /home/jenkins/jenkins-slave/maven-repositories/0/org/apache/sling/org.apache.sling.scripting.thymeleaf/0.1.7-SNAPSHOT/org.apache.sling.scripting.thymeleaf-0.1.7-SNAPSHOT.jar
[INFO] Installing <https://builds.apache.org/job/sling-contrib-1.7/ws/trunk/scripting/org.apache.sling.scripting.thymeleaf/pom.xml> to /home/jenkins/jenkins-slave/maven-repositories/0/org/apache/sling/org.apache.sling.scripting.thymeleaf/0.1.7-SNAPSHOT/org.apache.sling.scripting.thymeleaf-0.1.7-SNAPSHOT.pom
[INFO] Installing <https://builds.apache.org/job/sling-contrib-1.7/ws/trunk/scripting/org.apache.sling.scripting.thymeleaf/target/org.apache.sling.scripting.thymeleaf-0.1.7-SNAPSHOT-sources.jar> to /home/jenkins/jenkins-slave/maven-repositories/0/org/apache/sling/org.apache.sling.scripting.thymeleaf/0.1.7-SNAPSHOT/org.apache.sling.scripting.thymeleaf-0.1.7-SNAPSHOT-sources.jar
[INFO] 
[INFO] --- maven-bundle-plugin:3.0.1:install (default-install) @ org.apache.sling.scripting.thymeleaf ---
[INFO] Local OBR update disabled (enable with -DobrRepository)
[JENKINS] Archiving disabled
[INFO]                                                                         
[INFO] ------------------------------------------------------------------------
[INFO] Building Apache Sling Scripting Thymeleaf IT 0.0.1-SNAPSHOT
[INFO] ------------------------------------------------------------------------
Downloading: http://repository.apache.org/snapshots/org/apache/sling/org.apache.sling.testing.paxexam/0.0.1-SNAPSHOT/maven-metadata.xml
Downloading: http://repository.apache.org/snapshots/org/apache/sling/org.apache.sling.testing.paxexam/0.0.1-SNAPSHOT/org.apache.sling.testing.paxexam-0.0.1-SNAPSHOT.pom
[WARNING] The POM for org.apache.sling:org.apache.sling.testing.paxexam:jar:0.0.1-SNAPSHOT is missing, no dependency information available
Downloading: http://repo.maven.apache.org/maven2/org/ops4j/pax/exam/pax-exam-cm/4.9.1/pax-exam-cm-4.9.1.pom
Downloaded: http://repo.maven.apache.org/maven2/org/ops4j/pax/exam/pax-exam-cm/4.9.1/pax-exam-cm-4.9.1.pom (2 KB at 4.1 KB/sec)
Downloading: http://repo.maven.apache.org/maven2/org/ops4j/pax/exam/pax-exam-container-forked/4.9.1/pax-exam-container-forked-4.9.1.pom
Downloaded: http://repo.maven.apache.org/maven2/org/ops4j/pax/exam/pax-exam-container-forked/4.9.1/pax-exam-container-forked-4.9.1.pom (7 KB at 43.2 KB/sec)
Downloading: http://repository.apache.org/snapshots/org/apache/sling/org.apache.sling.testing.paxexam/0.0.1-SNAPSHOT/org.apache.sling.testing.paxexam-0.0.1-SNAPSHOT.jar
Downloading: http://repo.maven.apache.org/maven2/org/ops4j/pax/exam/pax-exam-cm/4.9.1/pax-exam-cm-4.9.1.jar
Downloading: http://repo.maven.apache.org/maven2/org/ops4j/pax/exam/pax-exam-container-forked/4.9.1/pax-exam-container-forked-4.9.1.jar
Downloaded: http://repo.maven.apache.org/maven2/org/ops4j/pax/exam/pax-exam-container-forked/4.9.1/pax-exam-container-forked-4.9.1.jar (32 KB at 96.8 KB/sec)
Downloaded: http://repo.maven.apache.org/maven2/org/ops4j/pax/exam/pax-exam-cm/4.9.1/pax-exam-cm-4.9.1.jar (18 KB at 29.0 KB/sec)
[JENKINS] Archiving disabled
[INFO] ------------------------------------------------------------------------
[INFO] Reactor Summary:
[INFO] 
[INFO] Apache Sling Authentication XING API .............. SUCCESS [17.290s]
[INFO] Apache Sling Authentication XING Login ............ SUCCESS [8.324s]
[INFO] Apache Sling Authentication XING OAuth ............ SUCCESS [6.394s]
[INFO] Apache Sling Commons HTML Utilities ............... SUCCESS [4.378s]
[INFO] Apache Sling APT parser ........................... SUCCESS [32.875s]
[INFO] Apache Sling APT servlet .......................... SUCCESS [4.920s]
[INFO] Apache Sling Resource Collection API .............. SUCCESS [5.999s]
[INFO] Apache Sling DataSource Provider .................. SUCCESS [12.690s]
[INFO] Apache Sling Dojo JavaScript Library .............. SUCCESS [20.520s]
[INFO] Apache Sling Dojo Data Extension .................. SUCCESS [3.815s]
[INFO] Apache Sling FTP Server ........................... SUCCESS [7.160s]
[INFO] Apache Sling Google Web Toolkit Servlet Library ... SUCCESS [7.586s]
[INFO] Apache Sling Google Web Toolkit Sample ............ SUCCESS [36.511s]
[INFO] Apache Sling JMX Resource Provider ................ SUCCESS [4.321s]
[INFO] Apache Sling ClassLoader Leak Detector ............ SUCCESS [4.689s]
[INFO] Apache Sling MongoDB Resource Provider ............ SUCCESS [6.041s]
[INFO] Apache Sling OSGi Bundle Repository ............... SUCCESS [6.564s]
[INFO] Apache Sling Distribution API ..................... SUCCESS [3.933s]
[INFO] Apache Sling Distribution Core .................... SUCCESS [19.340s]
[INFO] Apache Sling Distribution Extensions .............. SUCCESS [9.452s]
[INFO] Apache Sling Distribution Sample .................. SUCCESS [5.416s]
[INFO] Apache Sling Distribution Integration Tests ....... SUCCESS [15:16.524s]
[INFO] Apache Sling Log Tail Implementation .............. SUCCESS [10.551s]
[INFO] S3 dependencies for Oak ........................... SUCCESS [9.493s]
[INFO] Apache Sling Request Processing Analyzer .......... SUCCESS [5.983s]
[INFO] Apache Sling Resource Merger ...................... SUCCESS [10.269s]
[INFO] Apache Sling Inventory Printer Based on Resources . SUCCESS [5.650s]
[INFO] Apache Sling Rewriter ............................. SUCCESS [9.769s]
[INFO] Apache Sling Security ............................. SUCCESS [8.670s]
[INFO] Apache Sling SLF4J MDC Filter ..................... SUCCESS [15.910s]
[INFO] Apache Sling Query ................................ SUCCESS [12.887s]
[INFO] Apache Sling Superimposing Resource Provider ...... SUCCESS [7.759s]
[INFO] Apache Sling Tenant ............................... SUCCESS [7.209s]
[INFO] Apache Sling Log Tracer ........................... SUCCESS [11.917s]
[INFO] Apache Sling URL Rewriter ......................... SUCCESS [7.212s]
[INFO] HApi - Sling Hypermedia API tools ................. SUCCESS [5.016s]
[INFO] HApi - Sling Hypermedia API client-side tools ..... SUCCESS [13.310s]
[INFO] HApi - Sample Content ............................. SUCCESS [4.658s]
[INFO] HApi - Sling Hypermedia API Tools Reactor ......... SUCCESS [5.591s]
[INFO] Apache Sling Dynamic Include ...................... SUCCESS [5.142s]
[INFO] Apache Sling JCR Java Compiler .................... SUCCESS [9.418s]
[INFO] Apache Sling Repository Accessor .................. SUCCESS [5.075s]
[INFO] Apache Sling Object Content Mapping ............... SUCCESS [7.899s]
[INFO] Apache Sling JCR Prefs ............................ SUCCESS [5.120s]
[INFO] Apache Sling JCR Resource Security ................ SUCCESS [4.109s]
[INFO] Apache Sling Script Console ....................... SUCCESS [5.428s]
[INFO] Apache Sling Atom Tag Library ..................... SUCCESS [5.252s]
[INFO] Apache Sling Scripting FreeMarker ................. SUCCESS [9.069s]
[INFO] Apache Sling Scripting Groovy Support ............. SUCCESS [4.907s]
[INFO] Apache Sling Scripting Java Support ............... SUCCESS [6.535s]
[INFO] Apache Sling Scripting JST Support ................ SUCCESS [10.828s]
[INFO] Apache Sling Scripting Python Support ............. SUCCESS [6.522s]
[INFO] Apache Sling Scripting Ruby Support ............... SUCCESS [13.678s]
[INFO] Scala Script Engine ............................... SUCCESS [1:23.790s]
[INFO] Apache Sling Scala Scripting Configuration ........ SUCCESS [6.513s]
[INFO] Scala for Sling Demo Application - Hello World .... SUCCESS [4.037s]
[INFO] Scala for Sling Demo Application - Forum .......... SUCCESS [5.158s]
[INFO] Apache Sling Launchpad Karaf - Features ........... SUCCESS [29.295s]
[INFO] Apache Sling Launchpad Karaf - Integration Tests .. SUCCESS [9.667s]
[INFO] Apache Sling Scripting FreeMarker IT .............. SUCCESS [5.740s]
[INFO] Apache Sling Scripting Thymeleaf .................. SUCCESS [10.465s]
[INFO] Apache Sling Scripting Thymeleaf IT ............... FAILURE [1.906s]
[INFO] Apache Sling Scripting Velocity Support ........... SKIPPED
[INFO] Apache Sling Scripting W3C XML Processing Support . SKIPPED
[INFO] Apache Sling NoSQL Generic Resource Provider ...... SKIPPED
[INFO] Apache Sling NoSQL Couchbase Client ............... SKIPPED
[INFO] Apache Sling NoSQL Couchbase Resource Provider .... SKIPPED
[INFO] Apache Sling NoSQL MongoDB Resource Provider ...... SKIPPED
[INFO] Apache Sling Contrib NoSQL Modules Reactor ........ SKIPPED
[INFO] Apache Sling Launchpad Contrib Testing ............ SKIPPED
[INFO] Apache Sling Launchpad Karaf - Distribution ....... SKIPPED
[INFO] Apache Sling Launchpad Karaf - Launchpad Oak Tar Integration Tests  SKIPPED
[INFO] Apache Sling Launchpad Karaf Builder .............. SKIPPED
[INFO] Apache Sling Contrib (Builder) .................... SKIPPED
[INFO] ------------------------------------------------------------------------
[INFO] BUILD FAILURE
[INFO] ------------------------------------------------------------------------
[INFO] Total time: 27:03.264s
[INFO] Finished at: Thu Jun 23 15:47:27 UTC 2016
[INFO] Final Memory: 143M/399M
[INFO] ------------------------------------------------------------------------
[JENKINS] Archiving disabled
[JENKINS] Archiving disabled
[JENKINS] Archiving disabled
[JENKINS] Archiving disabled
[JENKINS] Archiving disabled
[JENKINS] Archiving disabled
[JENKINS] Archiving disabled
[JENKINS] Archiving disabled
[JENKINS] Archiving disabled
[JENKINS] Archiving disabled
[JENKINS] Archiving disabled
[JENKINS] Archiving disabled
[JENKINS] Archiving disabled
[JENKINS] Archiving disabled
[JENKINS] Archiving disabled
[JENKINS] Archiving disabled
[JENKINS] Archiving disabled
[JENKINS] Archiving disabled
[JENKINS] Archiving disabled
[JENKINS] Archiving disabled
[JENKINS] Archiving disabled
[JENKINS] Archiving disabled
[JENKINS] Archiving disabled
[JENKINS] Archiving disabled
[JENKINS] Archiving disabled
[JENKINS] Archiving disabled
[JENKINS] Archiving disabled
[JENKINS] Archiving disabled
[JENKINS] Archiving disabled
[JENKINS] Archiving disabled
[JENKINS] Archiving disabled
[JENKINS] Archiving disabled
[JENKINS] Archiving disabled
[JENKINS] Archiving disabled
[JENKINS] Archiving disabled
[JENKINS] Archiving disabled
[JENKINS] Archiving disabled
[JENKINS] Archiving disabled
[JENKINS] Archiving disabled
[JENKINS] Archiving disabled
[JENKINS] Archiving disabled
[JENKINS] Archiving disabled
[JENKINS] Archiving disabled
[JENKINS] Archiving disabled
[JENKINS] Archiving disabled
[JENKINS] Archiving disabled
[JENKINS] Archiving disabled
[JENKINS] Archiving disabled
[JENKINS] Archiving disabled
[JENKINS] Archiving disabled
[JENKINS] Archiving disabled
[JENKINS] Archiving disabled
[JENKINS] Archiving disabled
[JENKINS] Archiving disabled
[JENKINS] Archiving disabled
[JENKINS] Archiving disabled
[JENKINS] Archiving disabled
[JENKINS] Archiving disabled
[JENKINS] Archiving disabled
[JENKINS] Archiving disabled
[JENKINS] Archiving disabled
[JENKINS] Archiving disabled
[JENKINS] Archiving disabled
[JENKINS] Archiving disabled
[JENKINS] Archiving disabled
[JENKINS] Archiving disabled
[JENKINS] Archiving disabled
[JENKINS] Archiving disabled
[JENKINS] Archiving disabled
[JENKINS] Archiving disabled
[JENKINS] Archiving disabled
[JENKINS] Archiving disabled
[JENKINS] Archiving disabled
[JENKINS] Archiving disabled
Waiting for Jenkins to finish collecting data
[ERROR] Failed to execute goal on project org.apache.sling.scripting.thymeleaf.it: Could not resolve dependencies for project org.apache.sling:org.apache.sling.scripting.thymeleaf.it:bundle:0.0.1-SNAPSHOT: Could not find artifact org.apache.sling:org.apache.sling.testing.paxexam:jar:0.0.1-SNAPSHOT in Nexus (http://repository.apache.org/snapshots) -> [Help 1]
[ERROR] 
[ERROR] To see the full stack trace of the errors, re-run Maven with the -e switch.
[ERROR] Re-run Maven using the -X switch to enable full debug logging.
[ERROR] 
[ERROR] For more information about the errors and possible solutions, please read the following articles:
[ERROR] [Help 1] http://cwiki.apache.org/confluence/display/MAVEN/DependencyResolutionException
[ERROR] 
[ERROR] After correcting the problems, you can resume the build with the command
[ERROR]   mvn <goals> -rf :org.apache.sling.scripting.thymeleaf.it
channel stopped

Build failed in Jenkins: sling-contrib-1.7 #963

Posted by Apache Jenkins Server <je...@builds.apache.org>.
See <https://builds.apache.org/job/sling-contrib-1.7/963/changes>

Changes:

[olli] SLING-5808 Update Tika to 1.13

[olli] SLING-4411 Provide Oak features

remove feature oak-sling

[olli] SLING-4411 Provide Oak features

remove OakSlingIT and adjust SlingJcrOakIT

[olli] SLING-4411 Provide Oak features

remove feature oak-sling and move Oak bundles and dependencies to feature sling-jcr-oak

[olli] SLING-3017 Improve Karaf integration tests

do not test for bundles which are not part of feature

------------------------------------------
Started by an SCM change
[EnvInject] - Loading node environment variables.
Building remotely on ubuntu-6 (docker Ubuntu ubuntu yahoo-not-h2) in workspace <https://builds.apache.org/job/sling-contrib-1.7/ws/>
Cleaning up <https://builds.apache.org/job/sling-contrib-1.7/ws/trunk>
Deleting <https://builds.apache.org/job/sling-contrib-1.7/ws/trunk/hs_err_pid17492.log>
Updating http://svn.apache.org/repos/asf/sling/trunk/contrib at revision '2016-06-23T13:18:21.583 +0000'
U         launchpad/karaf/org.apache.sling.launchpad.karaf-features/pom.xml
U         launchpad/karaf/org.apache.sling.launchpad.karaf-features/src/main/feature/feature.xml
U         launchpad/karaf/org.apache.sling.launchpad.karaf-distribution/pom.xml
D         launchpad/karaf/org.apache.sling.launchpad.karaf-integration-tests/src/test/java/org/apache/sling/launchpad/karaf/tests/bootstrap/OakSlingIT.java
U         launchpad/karaf/org.apache.sling.launchpad.karaf-integration-tests/src/test/java/org/apache/sling/launchpad/karaf/tests/bootstrap/SlingJcrOakIT.java
U         launchpad/karaf/org.apache.sling.launchpad.karaf-integration-tests/src/test/java/org/apache/sling/launchpad/karaf/tests/bootstrap/SlingLaunchpadOakIT.java
At revision 1749886

Parsing POMs
Modules changed, recalculating dependency graph
Established TCP socket on 33815
maven3-agent.jar already up to date
maven3-interceptor.jar already up to date
maven3-interceptor-commons.jar already up to date
[trunk] $ /home/jenkins/jenkins-slave/tools/hudson.model.JDK/JDK_1.7_latest_/bin/java -Xmx512M -XX:MaxPermSize=256M -enableassertions -cp /home/jenkins/jenkins-slave/maven3-agent.jar:/home/jenkins/jenkins-slave/tools/hudson.tasks.Maven_MavenInstallation/Maven_3.0.5/boot/plexus-classworlds-2.4.jar org.jvnet.hudson.maven3.agent.Maven3Main /home/jenkins/jenkins-slave/tools/hudson.tasks.Maven_MavenInstallation/Maven_3.0.5 /home/jenkins/jenkins-slave/slave.jar /home/jenkins/jenkins-slave/maven3-interceptor.jar /home/jenkins/jenkins-slave/maven3-interceptor-commons.jar 33815
#
# There is insufficient memory for the Java Runtime Environment to continue.
# Cannot create GC thread. Out of system resources.
# An error report file with more information is saved as:
# <https://builds.apache.org/job/sling-contrib-1.7/ws/trunk/hs_err_pid23329.log>
ERROR: Failed to launch Maven. Exit code = 1


Build failed in Jenkins: sling-contrib-1.7 #962

Posted by Apache Jenkins Server <je...@builds.apache.org>.
See <https://builds.apache.org/job/sling-contrib-1.7/962/changes>

Changes:

[olli] SLING-3027 Improve Launchpad Karaf Features

remove unnecessary bundle geronimo-annotation_1.1_spec from feature jackrabbit-sling

------------------------------------------
Started by an SCM change
[EnvInject] - Loading node environment variables.
Building remotely on ubuntu-6 (docker Ubuntu ubuntu yahoo-not-h2) in workspace <https://builds.apache.org/job/sling-contrib-1.7/ws/>
Cleaning up <https://builds.apache.org/job/sling-contrib-1.7/ws/trunk>
Deleting <https://builds.apache.org/job/sling-contrib-1.7/ws/trunk/hs_err_pid24855.log>
Updating http://svn.apache.org/repos/asf/sling/trunk/contrib at revision '2016-06-23T12:18:16.945 +0000'
U         launchpad/karaf/org.apache.sling.launchpad.karaf-features/src/main/feature/feature.xml
At revision 1749870

Parsing POMs
Modules changed, recalculating dependency graph
Established TCP socket on 55491
maven3-agent.jar already up to date
maven3-interceptor.jar already up to date
maven3-interceptor-commons.jar already up to date
[trunk] $ /home/jenkins/jenkins-slave/tools/hudson.model.JDK/JDK_1.7_latest_/bin/java -Xmx512M -XX:MaxPermSize=256M -enableassertions -cp /home/jenkins/jenkins-slave/maven3-agent.jar:/home/jenkins/jenkins-slave/tools/hudson.tasks.Maven_MavenInstallation/Maven_3.0.5/boot/plexus-classworlds-2.4.jar org.jvnet.hudson.maven3.agent.Maven3Main /home/jenkins/jenkins-slave/tools/hudson.tasks.Maven_MavenInstallation/Maven_3.0.5 /home/jenkins/jenkins-slave/slave.jar /home/jenkins/jenkins-slave/maven3-interceptor.jar /home/jenkins/jenkins-slave/maven3-interceptor-commons.jar 55491
#
# There is insufficient memory for the Java Runtime Environment to continue.
# Cannot create GC thread. Out of system resources.
# An error report file with more information is saved as:
# <https://builds.apache.org/job/sling-contrib-1.7/ws/trunk/hs_err_pid17492.log>
ERROR: Failed to launch Maven. Exit code = 1


Re: Build failed in Jenkins: sling-contrib-1.7 #961

Posted by Carsten Ziegeler <cz...@apache.org>.
Apache Jenkins Server wrote
> # There is insufficient memory for the Java Runtime Environment to continue.
> # Cannot create GC thread. Out of system resources.

Looks like a jenkins problem
 
-- 
Carsten Ziegeler
Adobe Research Switzerland
cziegeler@apache.org