You are viewing a plain text version of this content. The canonical link for it is here.
Posted to dev@lucene.apache.org by Policeman Jenkins Server <je...@thetaphi.de> on 2015/09/12 08:46:05 UTC

[JENKINS] Lucene-Solr-trunk-Linux (64bit/jdk1.8.0_60) - Build # 14191 - Still Failing!

Build: http://jenkins.thetaphi.de/job/Lucene-Solr-trunk-Linux/14191/
Java: 64bit/jdk1.8.0_60 -XX:+UseCompressedOops -XX:+UseParallelGC

1 tests failed.
FAILED:  org.apache.solr.client.solrj.impl.CloudSolrClientTest.test

Error Message:
There should be 3 documents because there should be two id=1 docs due to overwrite=false expected:<3> but was:<1>

Stack Trace:
java.lang.AssertionError: There should be 3 documents because there should be two id=1 docs due to overwrite=false expected:<3> but was:<1>
	at __randomizedtesting.SeedInfo.seed([6F219DEA398C246:8EA626040D64AFBE]:0)
	at org.junit.Assert.fail(Assert.java:93)
	at org.junit.Assert.failNotEquals(Assert.java:647)
	at org.junit.Assert.assertEquals(Assert.java:128)
	at org.junit.Assert.assertEquals(Assert.java:472)
	at org.apache.solr.client.solrj.impl.CloudSolrClientTest.testOverwriteOption(CloudSolrClientTest.java:159)
	at org.apache.solr.client.solrj.impl.CloudSolrClientTest.test(CloudSolrClientTest.java:117)
	at sun.reflect.NativeMethodAccessorImpl.invoke0(Native Method)
	at sun.reflect.NativeMethodAccessorImpl.invoke(NativeMethodAccessorImpl.java:62)
	at sun.reflect.DelegatingMethodAccessorImpl.invoke(DelegatingMethodAccessorImpl.java:43)
	at java.lang.reflect.Method.invoke(Method.java:497)
	at com.carrotsearch.randomizedtesting.RandomizedRunner.invoke(RandomizedRunner.java:1627)
	at com.carrotsearch.randomizedtesting.RandomizedRunner$6.evaluate(RandomizedRunner.java:836)
	at com.carrotsearch.randomizedtesting.RandomizedRunner$7.evaluate(RandomizedRunner.java:872)
	at com.carrotsearch.randomizedtesting.RandomizedRunner$8.evaluate(RandomizedRunner.java:886)
	at org.junit.rules.ExpectedException$ExpectedExceptionStatement.evaluate(ExpectedException.java:110)
	at org.apache.solr.BaseDistributedSearchTestCase$ShardsRepeatRule$ShardsFixedStatement.callStatement(BaseDistributedSearchTestCase.java:963)
	at org.apache.solr.BaseDistributedSearchTestCase$ShardsRepeatRule$ShardsStatement.evaluate(BaseDistributedSearchTestCase.java:938)
	at com.carrotsearch.randomizedtesting.rules.SystemPropertiesRestoreRule$1.evaluate(SystemPropertiesRestoreRule.java:57)
	at org.apache.lucene.util.TestRuleSetupTeardownChained$1.evaluate(TestRuleSetupTeardownChained.java:50)
	at org.apache.lucene.util.AbstractBeforeAfterRule$1.evaluate(AbstractBeforeAfterRule.java:46)
	at org.apache.lucene.util.TestRuleThreadAndTestName$1.evaluate(TestRuleThreadAndTestName.java:49)
	at org.apache.lucene.util.TestRuleIgnoreAfterMaxFailures$1.evaluate(TestRuleIgnoreAfterMaxFailures.java:65)
	at org.apache.lucene.util.TestRuleMarkFailure$1.evaluate(TestRuleMarkFailure.java:48)
	at com.carrotsearch.randomizedtesting.rules.StatementAdapter.evaluate(StatementAdapter.java:36)
	at com.carrotsearch.randomizedtesting.ThreadLeakControl$StatementRunner.run(ThreadLeakControl.java:365)
	at com.carrotsearch.randomizedtesting.ThreadLeakControl.forkTimeoutingTask(ThreadLeakControl.java:798)
	at com.carrotsearch.randomizedtesting.ThreadLeakControl$3.evaluate(ThreadLeakControl.java:458)
	at com.carrotsearch.randomizedtesting.RandomizedRunner.runSingleTest(RandomizedRunner.java:845)
	at com.carrotsearch.randomizedtesting.RandomizedRunner$3.evaluate(RandomizedRunner.java:747)
	at com.carrotsearch.randomizedtesting.RandomizedRunner$4.evaluate(RandomizedRunner.java:781)
	at com.carrotsearch.randomizedtesting.RandomizedRunner$5.evaluate(RandomizedRunner.java:792)
	at com.carrotsearch.randomizedtesting.rules.StatementAdapter.evaluate(StatementAdapter.java:36)
	at com.carrotsearch.randomizedtesting.rules.SystemPropertiesRestoreRule$1.evaluate(SystemPropertiesRestoreRule.java:57)
	at org.apache.lucene.util.AbstractBeforeAfterRule$1.evaluate(AbstractBeforeAfterRule.java:46)
	at com.carrotsearch.randomizedtesting.rules.StatementAdapter.evaluate(StatementAdapter.java:36)
	at org.apache.lucene.util.TestRuleStoreClassName$1.evaluate(TestRuleStoreClassName.java:42)
	at com.carrotsearch.randomizedtesting.rules.NoShadowingOrOverridesOnMethodsRule$1.evaluate(NoShadowingOrOverridesOnMethodsRule.java:39)
	at com.carrotsearch.randomizedtesting.rules.NoShadowingOrOverridesOnMethodsRule$1.evaluate(NoShadowingOrOverridesOnMethodsRule.java:39)
	at com.carrotsearch.randomizedtesting.rules.StatementAdapter.evaluate(StatementAdapter.java:36)
	at com.carrotsearch.randomizedtesting.rules.StatementAdapter.evaluate(StatementAdapter.java:36)
	at com.carrotsearch.randomizedtesting.rules.StatementAdapter.evaluate(StatementAdapter.java:36)
	at org.apache.lucene.util.TestRuleAssertionsRequired$1.evaluate(TestRuleAssertionsRequired.java:54)
	at org.apache.lucene.util.TestRuleMarkFailure$1.evaluate(TestRuleMarkFailure.java:48)
	at org.apache.lucene.util.TestRuleIgnoreAfterMaxFailures$1.evaluate(TestRuleIgnoreAfterMaxFailures.java:65)
	at org.apache.lucene.util.TestRuleIgnoreTestSuites$1.evaluate(TestRuleIgnoreTestSuites.java:55)
	at com.carrotsearch.randomizedtesting.rules.StatementAdapter.evaluate(StatementAdapter.java:36)
	at com.carrotsearch.randomizedtesting.ThreadLeakControl$StatementRunner.run(ThreadLeakControl.java:365)
	at java.lang.Thread.run(Thread.java:745)




Build Log:
[...truncated 11364 lines...]
   [junit4] Suite: org.apache.solr.client.solrj.impl.CloudSolrClientTest
   [junit4]   2> Creating dataDir: /home/jenkins/workspace/Lucene-Solr-trunk-Linux/solr/build/solr-solrj/test/J2/temp/solr.client.solrj.impl.CloudSolrClientTest_6F219DEA398C246-001/init-core-data-001
   [junit4]   2> 51013 INFO  (SUITE-CloudSolrClientTest-seed#[6F219DEA398C246]-worker) [    ] o.a.s.SolrTestCaseJ4 Randomized ssl (true) and clientAuth (false)
   [junit4]   2> 51014 INFO  (SUITE-CloudSolrClientTest-seed#[6F219DEA398C246]-worker) [    ] o.a.s.BaseDistributedSearchTestCase Setting hostContext system property: /
   [junit4]   2> 51019 INFO  (TEST-CloudSolrClientTest.test-seed#[6F219DEA398C246]) [    ] o.a.s.c.ZkTestServer STARTING ZK TEST SERVER
   [junit4]   2> 51019 INFO  (Thread-122) [    ] o.a.s.c.ZkTestServer client port:0.0.0.0/0.0.0.0:0
   [junit4]   2> 51019 INFO  (Thread-122) [    ] o.a.s.c.ZkTestServer Starting server
   [junit4]   2> 51119 INFO  (TEST-CloudSolrClientTest.test-seed#[6F219DEA398C246]) [    ] o.a.s.c.ZkTestServer start zk server on port:34565
   [junit4]   2> 51120 INFO  (TEST-CloudSolrClientTest.test-seed#[6F219DEA398C246]) [    ] o.a.s.c.c.SolrZkClient Using default ZkCredentialsProvider
   [junit4]   2> 51120 INFO  (TEST-CloudSolrClientTest.test-seed#[6F219DEA398C246]) [    ] o.a.s.c.c.ConnectionManager Waiting for client to connect to ZooKeeper
   [junit4]   2> 51122 INFO  (zkCallback-143-thread-1) [    ] o.a.s.c.c.ConnectionManager Watcher org.apache.solr.common.cloud.ConnectionManager@50aa2531 name:ZooKeeperConnection Watcher:127.0.0.1:34565 got event WatchedEvent state:SyncConnected type:None path:null path:null type:None
   [junit4]   2> 51122 INFO  (TEST-CloudSolrClientTest.test-seed#[6F219DEA398C246]) [    ] o.a.s.c.c.ConnectionManager Client is connected to ZooKeeper
   [junit4]   2> 51123 INFO  (TEST-CloudSolrClientTest.test-seed#[6F219DEA398C246]) [    ] o.a.s.c.c.SolrZkClient Using default ZkACLProvider
   [junit4]   2> 51123 INFO  (TEST-CloudSolrClientTest.test-seed#[6F219DEA398C246]) [    ] o.a.s.c.c.SolrZkClient makePath: /solr
   [junit4]   2> 51124 INFO  (TEST-CloudSolrClientTest.test-seed#[6F219DEA398C246]) [    ] o.a.s.c.c.SolrZkClient Using default ZkCredentialsProvider
   [junit4]   2> 51125 INFO  (TEST-CloudSolrClientTest.test-seed#[6F219DEA398C246]) [    ] o.a.s.c.c.ConnectionManager Waiting for client to connect to ZooKeeper
   [junit4]   2> 51126 INFO  (zkCallback-144-thread-1) [    ] o.a.s.c.c.ConnectionManager Watcher org.apache.solr.common.cloud.ConnectionManager@69caaa75 name:ZooKeeperConnection Watcher:127.0.0.1:34565/solr got event WatchedEvent state:SyncConnected type:None path:null path:null type:None
   [junit4]   2> 51126 INFO  (TEST-CloudSolrClientTest.test-seed#[6F219DEA398C246]) [    ] o.a.s.c.c.ConnectionManager Client is connected to ZooKeeper
   [junit4]   2> 51126 INFO  (TEST-CloudSolrClientTest.test-seed#[6F219DEA398C246]) [    ] o.a.s.c.c.SolrZkClient Using default ZkACLProvider
   [junit4]   2> 51126 INFO  (TEST-CloudSolrClientTest.test-seed#[6F219DEA398C246]) [    ] o.a.s.c.c.SolrZkClient makePath: /collections/collection1
   [junit4]   2> 51127 INFO  (TEST-CloudSolrClientTest.test-seed#[6F219DEA398C246]) [    ] o.a.s.c.c.SolrZkClient makePath: /collections/collection1/shards
   [junit4]   2> 51128 INFO  (TEST-CloudSolrClientTest.test-seed#[6F219DEA398C246]) [    ] o.a.s.c.c.SolrZkClient makePath: /collections/control_collection
   [junit4]   2> 51129 INFO  (TEST-CloudSolrClientTest.test-seed#[6F219DEA398C246]) [    ] o.a.s.c.c.SolrZkClient makePath: /collections/control_collection/shards
   [junit4]   2> 51129 INFO  (TEST-CloudSolrClientTest.test-seed#[6F219DEA398C246]) [    ] o.a.s.c.AbstractZkTestCase put /home/jenkins/workspace/Lucene-Solr-trunk-Linux/solr/solrj/src/test-files/solrj/solr/collection1/conf/solrconfig.xml to /configs/conf1/solrconfig.xml
   [junit4]   2> 51130 INFO  (TEST-CloudSolrClientTest.test-seed#[6F219DEA398C246]) [    ] o.a.s.c.c.SolrZkClient makePath: /configs/conf1/solrconfig.xml
   [junit4]   2> 51131 INFO  (TEST-CloudSolrClientTest.test-seed#[6F219DEA398C246]) [    ] o.a.s.c.AbstractZkTestCase put /home/jenkins/workspace/Lucene-Solr-trunk-Linux/solr/solrj/src/test-files/solrj/solr/collection1/conf/schema.xml to /configs/conf1/schema.xml
   [junit4]   2> 51132 INFO  (TEST-CloudSolrClientTest.test-seed#[6F219DEA398C246]) [    ] o.a.s.c.c.SolrZkClient makePath: /configs/conf1/schema.xml
   [junit4]   2> 51133 INFO  (TEST-CloudSolrClientTest.test-seed#[6F219DEA398C246]) [    ] o.a.s.c.AbstractZkTestCase skipping /home/jenkins/workspace/Lucene-Solr-trunk-Linux/solr/solrj/src/test-files/solrj/solr/collection1/conf/solrconfig.snippet.randomindexconfig.xml because it doesn't exist
   [junit4]   2> 51133 INFO  (TEST-CloudSolrClientTest.test-seed#[6F219DEA398C246]) [    ] o.a.s.c.AbstractZkTestCase skipping /home/jenkins/workspace/Lucene-Solr-trunk-Linux/solr/solrj/src/test-files/solrj/solr/collection1/conf/stopwords.txt because it doesn't exist
   [junit4]   2> 51133 INFO  (TEST-CloudSolrClientTest.test-seed#[6F219DEA398C246]) [    ] o.a.s.c.AbstractZkTestCase skipping /home/jenkins/workspace/Lucene-Solr-trunk-Linux/solr/solrj/src/test-files/solrj/solr/collection1/conf/protwords.txt because it doesn't exist
   [junit4]   2> 51133 INFO  (TEST-CloudSolrClientTest.test-seed#[6F219DEA398C246]) [    ] o.a.s.c.AbstractZkTestCase skipping /home/jenkins/workspace/Lucene-Solr-trunk-Linux/solr/solrj/src/test-files/solrj/solr/collection1/conf/currency.xml because it doesn't exist
   [junit4]   2> 51133 INFO  (TEST-CloudSolrClientTest.test-seed#[6F219DEA398C246]) [    ] o.a.s.c.AbstractZkTestCase skipping /home/jenkins/workspace/Lucene-Solr-trunk-Linux/solr/solrj/src/test-files/solrj/solr/collection1/conf/enumsConfig.xml because it doesn't exist
   [junit4]   2> 51133 INFO  (TEST-CloudSolrClientTest.test-seed#[6F219DEA398C246]) [    ] o.a.s.c.AbstractZkTestCase skipping /home/jenkins/workspace/Lucene-Solr-trunk-Linux/solr/solrj/src/test-files/solrj/solr/collection1/conf/open-exchange-rates.json because it doesn't exist
   [junit4]   2> 51133 INFO  (TEST-CloudSolrClientTest.test-seed#[6F219DEA398C246]) [    ] o.a.s.c.AbstractZkTestCase skipping /home/jenkins/workspace/Lucene-Solr-trunk-Linux/solr/solrj/src/test-files/solrj/solr/collection1/conf/mapping-ISOLatin1Accent.txt because it doesn't exist
   [junit4]   2> 51134 INFO  (TEST-CloudSolrClientTest.test-seed#[6F219DEA398C246]) [    ] o.a.s.c.AbstractZkTestCase skipping /home/jenkins/workspace/Lucene-Solr-trunk-Linux/solr/solrj/src/test-files/solrj/solr/collection1/conf/old_synonyms.txt because it doesn't exist
   [junit4]   2> 51134 INFO  (TEST-CloudSolrClientTest.test-seed#[6F219DEA398C246]) [    ] o.a.s.c.AbstractZkTestCase skipping /home/jenkins/workspace/Lucene-Solr-trunk-Linux/solr/solrj/src/test-files/solrj/solr/collection1/conf/synonyms.txt because it doesn't exist
   [junit4]   2> 51136 INFO  (TEST-CloudSolrClientTest.test-seed#[6F219DEA398C246]) [    ] o.a.s.c.c.SolrZkClient Using default ZkCredentialsProvider
   [junit4]   2> 51136 INFO  (TEST-CloudSolrClientTest.test-seed#[6F219DEA398C246]) [    ] o.a.s.c.c.ConnectionManager Waiting for client to connect to ZooKeeper
   [junit4]   2> 51137 INFO  (zkCallback-145-thread-1) [    ] o.a.s.c.c.ConnectionManager Watcher org.apache.solr.common.cloud.ConnectionManager@23c4ba00 name:ZooKeeperConnection Watcher:127.0.0.1:34565/solr got event WatchedEvent state:SyncConnected type:None path:null path:null type:None
   [junit4]   2> 51137 INFO  (TEST-CloudSolrClientTest.test-seed#[6F219DEA398C246]) [    ] o.a.s.c.c.ConnectionManager Client is connected to ZooKeeper
   [junit4]   2> 51137 INFO  (TEST-CloudSolrClientTest.test-seed#[6F219DEA398C246]) [    ] o.a.s.c.c.SolrZkClient Using default ZkACLProvider
   [junit4]   2> 51151 INFO  (TEST-CloudSolrClientTest.test-seed#[6F219DEA398C246]) [    ] o.a.s.SolrTestCaseJ4 Writing core.properties file to /home/jenkins/workspace/Lucene-Solr-trunk-Linux/solr/build/solr-solrj/test/J2/temp/solr.client.solrj.impl.CloudSolrClientTest_6F219DEA398C246-001/control-001/cores/collection1
   [junit4]   2> 51167 INFO  (TEST-CloudSolrClientTest.test-seed#[6F219DEA398C246]) [    ] o.e.j.s.Server jetty-9.2.13.v20150730
   [junit4]   2> 51169 INFO  (TEST-CloudSolrClientTest.test-seed#[6F219DEA398C246]) [    ] o.e.j.s.h.ContextHandler Started o.e.j.s.ServletContextHandler@58a4a8ec{/,null,AVAILABLE}
   [junit4]   2> 51313 INFO  (TEST-CloudSolrClientTest.test-seed#[6F219DEA398C246]) [    ] o.e.j.s.ServerConnector Started ServerConnector@2b048cbc{SSL-http/1.1}{127.0.0.1:36203}
   [junit4]   2> 51313 INFO  (TEST-CloudSolrClientTest.test-seed#[6F219DEA398C246]) [    ] o.e.j.s.Server Started @53601ms
   [junit4]   2> 51313 INFO  (TEST-CloudSolrClientTest.test-seed#[6F219DEA398C246]) [    ] o.a.s.c.s.e.JettySolrRunner Jetty properties: {solr.data.dir=/home/jenkins/workspace/Lucene-Solr-trunk-Linux/solr/build/solr-solrj/test/J2/temp/solr.client.solrj.impl.CloudSolrClientTest_6F219DEA398C246-001/tempDir-001/control/data, hostContext=/, hostPort=36203, coreRootDirectory=/home/jenkins/workspace/Lucene-Solr-trunk-Linux/solr/build/solr-solrj/test/J2/../../../../../../../../../home/jenkins/workspace/Lucene-Solr-trunk-Linux/solr/build/solr-solrj/test/J2/temp/solr.client.solrj.impl.CloudSolrClientTest_6F219DEA398C246-001/control-001/cores}
   [junit4]   2> 51314 INFO  (TEST-CloudSolrClientTest.test-seed#[6F219DEA398C246]) [    ] o.a.s.s.SolrDispatchFilter SolrDispatchFilter.init(): sun.misc.Launcher$AppClassLoader@659e0bfd
   [junit4]   2> 51314 INFO  (TEST-CloudSolrClientTest.test-seed#[6F219DEA398C246]) [    ] o.a.s.c.SolrResourceLoader new SolrResourceLoader for directory: '/home/jenkins/workspace/Lucene-Solr-trunk-Linux/solr/build/solr-solrj/test/J2/../../../../../../../../../home/jenkins/workspace/Lucene-Solr-trunk-Linux/solr/build/solr-solrj/test/J2/temp/solr.client.solrj.impl.CloudSolrClientTest_6F219DEA398C246-001/control-001/'
   [junit4]   2> 51331 INFO  (TEST-CloudSolrClientTest.test-seed#[6F219DEA398C246]) [    ] o.a.s.c.c.SolrZkClient Using default ZkCredentialsProvider
   [junit4]   2> 51347 INFO  (TEST-CloudSolrClientTest.test-seed#[6F219DEA398C246]) [    ] o.a.s.c.c.ConnectionManager Waiting for client to connect to ZooKeeper
   [junit4]   2> 51347 INFO  (zkCallback-146-thread-1) [    ] o.a.s.c.c.ConnectionManager Watcher org.apache.solr.common.cloud.ConnectionManager@45fe05f1 name:ZooKeeperConnection Watcher:127.0.0.1:34565/solr got event WatchedEvent state:SyncConnected type:None path:null path:null type:None
   [junit4]   2> 51347 INFO  (TEST-CloudSolrClientTest.test-seed#[6F219DEA398C246]) [    ] o.a.s.c.c.ConnectionManager Client is connected to ZooKeeper
   [junit4]   2> 51348 INFO  (TEST-CloudSolrClientTest.test-seed#[6F219DEA398C246]) [    ] o.a.s.c.c.SolrZkClient Using default ZkACLProvider
   [junit4]   2> 51348 INFO  (TEST-CloudSolrClientTest.test-seed#[6F219DEA398C246]) [    ] o.a.s.s.SolrDispatchFilter Loading solr.xml from SolrHome (not found in ZooKeeper)
   [junit4]   2> 51349 INFO  (TEST-CloudSolrClientTest.test-seed#[6F219DEA398C246]) [    ] o.a.s.c.SolrXmlConfig Loading container configuration from /home/jenkins/workspace/Lucene-Solr-trunk-Linux/solr/build/solr-solrj/test/J2/../../../../../../../../../home/jenkins/workspace/Lucene-Solr-trunk-Linux/solr/build/solr-solrj/test/J2/temp/solr.client.solrj.impl.CloudSolrClientTest_6F219DEA398C246-001/control-001/solr.xml
   [junit4]   2> 51355 INFO  (TEST-CloudSolrClientTest.test-seed#[6F219DEA398C246]) [    ] o.a.s.c.CoresLocator Config-defined core root directory: /home/jenkins/workspace/Lucene-Solr-trunk-Linux/solr/build/solr-solrj/test/J2/../../../../../../../../../home/jenkins/workspace/Lucene-Solr-trunk-Linux/solr/build/solr-solrj/test/J2/temp/solr.client.solrj.impl.CloudSolrClientTest_6F219DEA398C246-001/control-001/cores
   [junit4]   2> 51355 INFO  (TEST-CloudSolrClientTest.test-seed#[6F219DEA398C246]) [    ] o.a.s.c.CoreContainer New CoreContainer 154042019
   [junit4]   2> 51355 INFO  (TEST-CloudSolrClientTest.test-seed#[6F219DEA398C246]) [    ] o.a.s.c.CoreContainer Loading cores into CoreContainer [instanceDir=/home/jenkins/workspace/Lucene-Solr-trunk-Linux/solr/build/solr-solrj/test/J2/../../../../../../../../../home/jenkins/workspace/Lucene-Solr-trunk-Linux/solr/build/solr-solrj/test/J2/temp/solr.client.solrj.impl.CloudSolrClientTest_6F219DEA398C246-001/control-001/]
   [junit4]   2> 51355 INFO  (TEST-CloudSolrClientTest.test-seed#[6F219DEA398C246]) [    ] o.a.s.c.CoreContainer loading shared library: /home/jenkins/workspace/Lucene-Solr-trunk-Linux/solr/build/solr-solrj/test/J2/../../../../../../../../../home/jenkins/workspace/Lucene-Solr-trunk-Linux/solr/build/solr-solrj/test/J2/temp/solr.client.solrj.impl.CloudSolrClientTest_6F219DEA398C246-001/control-001/lib
   [junit4]   2> 51356 WARN  (TEST-CloudSolrClientTest.test-seed#[6F219DEA398C246]) [    ] o.a.s.c.SolrResourceLoader Can't find (or read) directory to add to classloader: lib (resolved as: /home/jenkins/workspace/Lucene-Solr-trunk-Linux/solr/build/solr-solrj/test/J2/../../../../../../../../../home/jenkins/workspace/Lucene-Solr-trunk-Linux/solr/build/solr-solrj/test/J2/temp/solr.client.solrj.impl.CloudSolrClientTest_6F219DEA398C246-001/control-001/lib).
   [junit4]   2> 51364 INFO  (TEST-CloudSolrClientTest.test-seed#[6F219DEA398C246]) [    ] o.a.s.h.c.HttpShardHandlerFactory created with socketTimeout : 90000,urlScheme : ,connTimeout : 15000,maxConnectionsPerHost : 20,maxConnections : 10000,corePoolSize : 0,maximumPoolSize : 2147483647,maxThreadIdleTime : 5,sizeOfQueue : -1,fairnessPolicy : false,useRetries : false,
   [junit4]   2> 51372 INFO  (TEST-CloudSolrClientTest.test-seed#[6F219DEA398C246]) [    ] o.a.s.u.UpdateShardHandler Creating UpdateShardHandler HTTP client with params: socketTimeout=340000&connTimeout=45000&retry=true
   [junit4]   2> 51374 INFO  (TEST-CloudSolrClientTest.test-seed#[6F219DEA398C246]) [    ] o.a.s.l.LogWatcher SLF4J impl is org.slf4j.impl.Log4jLoggerFactory
   [junit4]   2> 51374 INFO  (TEST-CloudSolrClientTest.test-seed#[6F219DEA398C246]) [    ] o.a.s.l.LogWatcher Registering Log Listener [Log4j (org.slf4j.impl.Log4jLoggerFactory)]
   [junit4]   2> 51375 INFO  (TEST-CloudSolrClientTest.test-seed#[6F219DEA398C246]) [    ] o.a.s.c.ZkContainer Zookeeper client=127.0.0.1:34565/solr
   [junit4]   2> 51375 INFO  (TEST-CloudSolrClientTest.test-seed#[6F219DEA398C246]) [    ] o.a.s.c.ZkController zkHost includes chroot
   [junit4]   2> 51375 INFO  (TEST-CloudSolrClientTest.test-seed#[6F219DEA398C246]) [    ] o.a.s.c.c.SolrZkClient Using default ZkCredentialsProvider
   [junit4]   2> 51375 INFO  (TEST-CloudSolrClientTest.test-seed#[6F219DEA398C246]) [    ] o.a.s.c.c.ConnectionManager Waiting for client to connect to ZooKeeper
   [junit4]   2> 51376 INFO  (zkCallback-148-thread-1) [    ] o.a.s.c.c.ConnectionManager Watcher org.apache.solr.common.cloud.ConnectionManager@7fda4c2b name:ZooKeeperConnection Watcher:127.0.0.1:34565 got event WatchedEvent state:SyncConnected type:None path:null path:null type:None
   [junit4]   2> 51377 INFO  (TEST-CloudSolrClientTest.test-seed#[6F219DEA398C246]) [    ] o.a.s.c.c.ConnectionManager Client is connected to ZooKeeper
   [junit4]   2> 51377 INFO  (TEST-CloudSolrClientTest.test-seed#[6F219DEA398C246]) [    ] o.a.s.c.c.SolrZkClient Using default ZkACLProvider
   [junit4]   2> 51378 INFO  (TEST-CloudSolrClientTest.test-seed#[6F219DEA398C246]) [n:127.0.0.1:36203_    ] o.a.s.c.c.ConnectionManager Waiting for client to connect to ZooKeeper
   [junit4]   2> 51379 INFO  (zkCallback-149-thread-1-processing-n:127.0.0.1:36203_) [n:127.0.0.1:36203_    ] o.a.s.c.c.ConnectionManager Watcher org.apache.solr.common.cloud.ConnectionManager@f97ce52 name:ZooKeeperConnection Watcher:127.0.0.1:34565/solr got event WatchedEvent state:SyncConnected type:None path:null path:null type:None
   [junit4]   2> 51379 INFO  (TEST-CloudSolrClientTest.test-seed#[6F219DEA398C246]) [n:127.0.0.1:36203_    ] o.a.s.c.c.ConnectionManager Client is connected to ZooKeeper
   [junit4]   2> 51380 INFO  (TEST-CloudSolrClientTest.test-seed#[6F219DEA398C246]) [n:127.0.0.1:36203_    ] o.a.s.c.c.SolrZkClient makePath: /overseer/queue
   [junit4]   2> 51383 INFO  (TEST-CloudSolrClientTest.test-seed#[6F219DEA398C246]) [n:127.0.0.1:36203_    ] o.a.s.c.c.SolrZkClient makePath: /overseer/collection-queue-work
   [junit4]   2> 51385 INFO  (TEST-CloudSolrClientTest.test-seed#[6F219DEA398C246]) [n:127.0.0.1:36203_    ] o.a.s.c.c.SolrZkClient makePath: /overseer/collection-map-running
   [junit4]   2> 51387 INFO  (TEST-CloudSolrClientTest.test-seed#[6F219DEA398C246]) [n:127.0.0.1:36203_    ] o.a.s.c.c.SolrZkClient makePath: /overseer/collection-map-completed
   [junit4]   2> 51389 INFO  (TEST-CloudSolrClientTest.test-seed#[6F219DEA398C246]) [n:127.0.0.1:36203_    ] o.a.s.c.c.SolrZkClient makePath: /overseer/collection-map-failure
   [junit4]   2> 51391 INFO  (TEST-CloudSolrClientTest.test-seed#[6F219DEA398C246]) [n:127.0.0.1:36203_    ] o.a.s.c.c.SolrZkClient makePath: /live_nodes
   [junit4]   2> 51392 INFO  (TEST-CloudSolrClientTest.test-seed#[6F219DEA398C246]) [n:127.0.0.1:36203_    ] o.a.s.c.c.SolrZkClient makePath: /aliases.json
   [junit4]   2> 51394 INFO  (TEST-CloudSolrClientTest.test-seed#[6F219DEA398C246]) [n:127.0.0.1:36203_    ] o.a.s.c.c.SolrZkClient makePath: /clusterstate.json
   [junit4]   2> 51395 INFO  (TEST-CloudSolrClientTest.test-seed#[6F219DEA398C246]) [n:127.0.0.1:36203_    ] o.a.s.c.c.SolrZkClient makePath: /security.json
   [junit4]   2> 51396 INFO  (TEST-CloudSolrClientTest.test-seed#[6F219DEA398C246]) [n:127.0.0.1:36203_    ] o.a.s.c.ZkController Register node as live in ZooKeeper:/live_nodes/127.0.0.1:36203_
   [junit4]   2> 51397 INFO  (TEST-CloudSolrClientTest.test-seed#[6F219DEA398C246]) [n:127.0.0.1:36203_    ] o.a.s.c.c.SolrZkClient makePath: /live_nodes/127.0.0.1:36203_
   [junit4]   2> 51398 INFO  (TEST-CloudSolrClientTest.test-seed#[6F219DEA398C246]) [n:127.0.0.1:36203_    ] o.a.s.c.c.SolrZkClient makePath: /overseer_elect
   [junit4]   2> 51399 INFO  (TEST-CloudSolrClientTest.test-seed#[6F219DEA398C246]) [n:127.0.0.1:36203_    ] o.a.s.c.c.SolrZkClient makePath: /overseer_elect/election
   [junit4]   2> 51400 INFO  (TEST-CloudSolrClientTest.test-seed#[6F219DEA398C246]) [n:127.0.0.1:36203_    ] o.a.s.c.Overseer Overseer (id=null) closing
   [junit4]   2> 51400 INFO  (TEST-CloudSolrClientTest.test-seed#[6F219DEA398C246]) [n:127.0.0.1:36203_    ] o.a.s.c.LeaderElector Joined leadership election with path: /overseer_elect/election/94505551309963269-127.0.0.1:36203_-n_0000000000
   [junit4]   2> 51400 INFO  (TEST-CloudSolrClientTest.test-seed#[6F219DEA398C246]) [n:127.0.0.1:36203_    ] o.a.s.c.OverseerElectionContext I am going to be the leader 127.0.0.1:36203_
   [junit4]   2> 51400 INFO  (TEST-CloudSolrClientTest.test-seed#[6F219DEA398C246]) [n:127.0.0.1:36203_    ] o.a.s.c.c.SolrZkClient makePath: /overseer_elect/leader
   [junit4]   2> 51401 INFO  (TEST-CloudSolrClientTest.test-seed#[6F219DEA398C246]) [n:127.0.0.1:36203_    ] o.a.s.c.Overseer Overseer (id=94505551309963269-127.0.0.1:36203_-n_0000000000) starting
   [junit4]   2> 51403 INFO  (TEST-CloudSolrClientTest.test-seed#[6F219DEA398C246]) [n:127.0.0.1:36203_    ] o.a.s.c.c.SolrZkClient makePath: /overseer/queue-work
   [junit4]   2> 51408 INFO  (TEST-CloudSolrClientTest.test-seed#[6F219DEA398C246]) [n:127.0.0.1:36203_    ] o.a.s.c.OverseerAutoReplicaFailoverThread Starting OverseerAutoReplicaFailoverThread autoReplicaFailoverWorkLoopDelay=10000 autoReplicaFailoverWaitAfterExpiration=30000 autoReplicaFailoverBadNodeExpiration=60000
   [junit4]   2> 51408 INFO  (OverseerCollectionConfigSetProcessor-94505551309963269-127.0.0.1:36203_-n_0000000000) [n:127.0.0.1:36203_    ] o.a.s.c.OverseerTaskProcessor Process current queue of overseer operations
   [junit4]   2> 51408 INFO  (TEST-CloudSolrClientTest.test-seed#[6F219DEA398C246]) [n:127.0.0.1:36203_    ] o.a.s.c.c.ZkStateReader Updating cluster state from ZooKeeper... 
   [junit4]   2> 51409 INFO  (OverseerStateUpdate-94505551309963269-127.0.0.1:36203_-n_0000000000) [n:127.0.0.1:36203_    ] o.a.s.c.Overseer Starting to work on the main queue
   [junit4]   2> 51420 INFO  (TEST-CloudSolrClientTest.test-seed#[6F219DEA398C246]) [n:127.0.0.1:36203_    ] o.a.s.c.CoreContainer Security conf doesn't exist. Skipping setup for authorization module.
   [junit4]   2> 51420 INFO  (TEST-CloudSolrClientTest.test-seed#[6F219DEA398C246]) [n:127.0.0.1:36203_    ] o.a.s.c.CoreContainer No authentication plugin used.
   [junit4]   2> 51421 INFO  (TEST-CloudSolrClientTest.test-seed#[6F219DEA398C246]) [n:127.0.0.1:36203_    ] o.a.s.c.CoresLocator Looking for core definitions underneath /home/jenkins/workspace/Lucene-Solr-trunk-Linux/solr/build/solr-solrj/test/J2/../../../../../../../../../home/jenkins/workspace/Lucene-Solr-trunk-Linux/solr/build/solr-solrj/test/J2/temp/solr.client.solrj.impl.CloudSolrClientTest_6F219DEA398C246-001/control-001/cores
   [junit4]   2> 51422 INFO  (TEST-CloudSolrClientTest.test-seed#[6F219DEA398C246]) [n:127.0.0.1:36203_    ] o.a.s.c.SolrCore Created CoreDescriptor: {name=collection1, config=solrconfig.xml, transient=false, schema=schema.xml, loadOnStartup=true, configSetProperties=configsetprops.json, instanceDir=/home/jenkins/workspace/Lucene-Solr-trunk-Linux/solr/build/solr-solrj/test/J2/../../../../../../../../../home/jenkins/workspace/Lucene-Solr-trunk-Linux/solr/build/solr-solrj/test/J2/temp/solr.client.solrj.impl.CloudSolrClientTest_6F219DEA398C246-001/control-001/cores/collection1, collection=control_collection, absoluteInstDir=/home/jenkins/workspace/Lucene-Solr-trunk-Linux/solr/build/solr-solrj/test/J2/../../../../../../../../../home/jenkins/workspace/Lucene-Solr-trunk-Linux/solr/build/solr-solrj/test/J2/temp/solr.client.solrj.impl.CloudSolrClientTest_6F219DEA398C246-001/control-001/cores/collection1/, coreNodeName=, dataDir=data/, shard=}
   [junit4]   2> 51423 INFO  (TEST-CloudSolrClientTest.test-seed#[6F219DEA398C246]) [n:127.0.0.1:36203_    ] o.a.s.c.CoresLocator Found core collection1 in /home/jenkins/workspace/Lucene-Solr-trunk-Linux/solr/build/solr-solrj/test/J2/../../../../../../../../../home/jenkins/workspace/Lucene-Solr-trunk-Linux/solr/build/solr-solrj/test/J2/temp/solr.client.solrj.impl.CloudSolrClientTest_6F219DEA398C246-001/control-001/cores/collection1/
   [junit4]   2> 51423 INFO  (TEST-CloudSolrClientTest.test-seed#[6F219DEA398C246]) [n:127.0.0.1:36203_    ] o.a.s.c.CoresLocator Found 1 core definitions
   [junit4]   2> 51424 INFO  (TEST-CloudSolrClientTest.test-seed#[6F219DEA398C246]) [n:127.0.0.1:36203_    ] o.a.s.s.SolrDispatchFilter user.dir=/home/jenkins/workspace/Lucene-Solr-trunk-Linux/solr/build/solr-solrj/test/J2
   [junit4]   2> 51424 INFO  (TEST-CloudSolrClientTest.test-seed#[6F219DEA398C246]) [n:127.0.0.1:36203_    ] o.a.s.s.SolrDispatchFilter SolrDispatchFilter.init() done
   [junit4]   2> 51425 INFO  (coreLoadExecutor-101-thread-1-processing-n:127.0.0.1:36203_) [n:127.0.0.1:36203_ c:control_collection   x:collection1] o.a.s.c.ZkController publishing state=down
   [junit4]   2> 51425 INFO  (coreLoadExecutor-101-thread-1-processing-n:127.0.0.1:36203_) [n:127.0.0.1:36203_ c:control_collection   x:collection1] o.a.s.c.ZkController numShards not found on descriptor - reading it from system property
   [junit4]   2> 51427 INFO  (OverseerStateUpdate-94505551309963269-127.0.0.1:36203_-n_0000000000) [n:127.0.0.1:36203_    ] o.a.s.c.Overseer processMessage: queueSize: 1, message = {
   [junit4]   2>   "core":"collection1",
   [junit4]   2>   "roles":null,
   [junit4]   2>   "base_url":"https://127.0.0.1:36203",
   [junit4]   2>   "node_name":"127.0.0.1:36203_",
   [junit4]   2>   "numShards":"1",
   [junit4]   2>   "state":"down",
   [junit4]   2>   "shard":null,
   [junit4]   2>   "collection":"control_collection",
   [junit4]   2>   "operation":"state"} current state version: 0
   [junit4]   2> 51427 INFO  (coreLoadExecutor-101-thread-1-processing-n:127.0.0.1:36203_) [n:127.0.0.1:36203_ c:control_collection   x:collection1] o.a.s.c.ZkController look for our core node name
   [junit4]   2> 51428 INFO  (OverseerStateUpdate-94505551309963269-127.0.0.1:36203_-n_0000000000) [n:127.0.0.1:36203_    ] o.a.s.c.o.ReplicaMutator Update state numShards=1 message={
   [junit4]   2>   "core":"collection1",
   [junit4]   2>   "roles":null,
   [junit4]   2>   "base_url":"https://127.0.0.1:36203",
   [junit4]   2>   "node_name":"127.0.0.1:36203_",
   [junit4]   2>   "numShards":"1",
   [junit4]   2>   "state":"down",
   [junit4]   2>   "shard":null,
   [junit4]   2>   "collection":"control_collection",
   [junit4]   2>   "operation":"state"}
   [junit4]   2> 51428 INFO  (OverseerStateUpdate-94505551309963269-127.0.0.1:36203_-n_0000000000) [n:127.0.0.1:36203_    ] o.a.s.c.o.ClusterStateMutator building a new cName: control_collection
   [junit4]   2> 51429 INFO  (OverseerStateUpdate-94505551309963269-127.0.0.1:36203_-n_0000000000) [n:127.0.0.1:36203_    ] o.a.s.c.o.ReplicaMutator Assigning new node to shard shard=shard1
   [junit4]   2> 51430 INFO  (zkCallback-149-thread-1-processing-n:127.0.0.1:36203_) [n:127.0.0.1:36203_    ] o.a.s.c.c.ZkStateReader A cluster state change: WatchedEvent state:SyncConnected type:NodeDataChanged path:/clusterstate.json, has occurred - updating... (live nodes size: 1)
   [junit4]   2> 52430 INFO  (coreLoadExecutor-101-thread-1-processing-n:127.0.0.1:36203_) [n:127.0.0.1:36203_ c:control_collection   x:collection1] o.a.s.c.ZkController waiting to find shard id in clusterstate for collection1
   [junit4]   2> 52430 INFO  (coreLoadExecutor-101-thread-1-processing-n:127.0.0.1:36203_) [n:127.0.0.1:36203_ c:control_collection   x:collection1] o.a.s.c.ZkController Check for collection zkNode:control_collection
   [junit4]   2> 52431 INFO  (coreLoadExecutor-101-thread-1-processing-n:127.0.0.1:36203_) [n:127.0.0.1:36203_ c:control_collection   x:collection1] o.a.s.c.ZkController Collection zkNode exists
   [junit4]   2> 52431 INFO  (coreLoadExecutor-101-thread-1-processing-n:127.0.0.1:36203_) [n:127.0.0.1:36203_ c:control_collection   x:collection1] o.a.s.c.c.ZkStateReader Load collection config from:/collections/control_collection
   [junit4]   2> 52432 INFO  (coreLoadExecutor-101-thread-1-processing-n:127.0.0.1:36203_) [n:127.0.0.1:36203_ c:control_collection   x:collection1] o.a.s.c.c.ZkStateReader path=/collections/control_collection configName=conf1 specified config exists in ZooKeeper
   [junit4]   2> 52432 INFO  (coreLoadExecutor-101-thread-1-processing-n:127.0.0.1:36203_) [n:127.0.0.1:36203_ c:control_collection   x:collection1] o.a.s.c.SolrResourceLoader new SolrResourceLoader for directory: '/home/jenkins/workspace/Lucene-Solr-trunk-Linux/solr/build/solr-solrj/test/J2/../../../../../../../../../home/jenkins/workspace/Lucene-Solr-trunk-Linux/solr/build/solr-solrj/test/J2/temp/solr.client.solrj.impl.CloudSolrClientTest_6F219DEA398C246-001/control-001/cores/collection1/'
   [junit4]   2> 52444 INFO  (coreLoadExecutor-101-thread-1-processing-n:127.0.0.1:36203_) [n:127.0.0.1:36203_ c:control_collection   x:collection1] o.a.s.c.Config loaded config solrconfig.xml with version 0 
   [junit4]   2> 52455 INFO  (coreLoadExecutor-101-thread-1-processing-n:127.0.0.1:36203_) [n:127.0.0.1:36203_ c:control_collection   x:collection1] o.a.s.c.SolrConfig current version of requestparams : -1
   [junit4]   2> 52457 INFO  (coreLoadExecutor-101-thread-1-processing-n:127.0.0.1:36203_) [n:127.0.0.1:36203_ c:control_collection   x:collection1] o.a.s.c.SolrConfig Using Lucene MatchVersion: 6.0.0
   [junit4]   2> 52464 INFO  (coreLoadExecutor-101-thread-1-processing-n:127.0.0.1:36203_) [n:127.0.0.1:36203_ c:control_collection   x:collection1] o.a.s.c.Config Loaded SolrConfig: solrconfig.xml
   [junit4]   2> 52468 INFO  (coreLoadExecutor-101-thread-1-processing-n:127.0.0.1:36203_) [n:127.0.0.1:36203_ c:control_collection   x:collection1] o.a.s.s.IndexSchema Reading Solr Schema from /configs/conf1/schema.xml
   [junit4]   2> 52481 INFO  (coreLoadExecutor-101-thread-1-processing-n:127.0.0.1:36203_) [n:127.0.0.1:36203_ c:control_collection   x:collection1] o.a.s.s.IndexSchema [collection1] Schema name=test
   [junit4]   2> 52574 INFO  (coreLoadExecutor-101-thread-1-processing-n:127.0.0.1:36203_) [n:127.0.0.1:36203_ c:control_collection   x:collection1] o.a.s.s.IndexSchema default search field in schema is text
   [junit4]   2> 52575 INFO  (coreLoadExecutor-101-thread-1-processing-n:127.0.0.1:36203_) [n:127.0.0.1:36203_ c:control_collection   x:collection1] o.a.s.s.IndexSchema unique key field: id
   [junit4]   2> 52576 WARN  (coreLoadExecutor-101-thread-1-processing-n:127.0.0.1:36203_) [n:127.0.0.1:36203_ c:control_collection   x:collection1] o.a.s.s.IndexSchema Field lowerfilt1and2 is not multivalued and destination for multiple copyFields (2)
   [junit4]   2> 52576 WARN  (coreLoadExecutor-101-thread-1-processing-n:127.0.0.1:36203_) [n:127.0.0.1:36203_ c:control_collection   x:collection1] o.a.s.s.IndexSchema Field text is not multivalued and destination for multiple copyFields (3)
   [junit4]   2> 52578 INFO  (coreLoadExecutor-101-thread-1-processing-n:127.0.0.1:36203_) [n:127.0.0.1:36203_ c:control_collection   x:collection1] o.a.s.c.ConfigSetProperties Did not find ConfigSet properties, assuming default properties: Can't find resource 'configsetprops.json' in classpath or '/configs/conf1', cwd=/home/jenkins/workspace/Lucene-Solr-trunk-Linux/solr/build/solr-solrj/test/J2
   [junit4]   2> 52578 INFO  (coreLoadExecutor-101-thread-1-processing-n:127.0.0.1:36203_) [n:127.0.0.1:36203_ c:control_collection   x:collection1] o.a.s.c.CoreContainer Creating SolrCore 'collection1' using configuration from collection control_collection
   [junit4]   2> 52579 INFO  (coreLoadExecutor-101-thread-1-processing-n:127.0.0.1:36203_) [n:127.0.0.1:36203_ c:control_collection s:shard1 r:core_node1 x:collection1] o.a.s.c.SolrCore org.apache.solr.core.MockDirectoryFactory
   [junit4]   2> 52579 INFO  (coreLoadExecutor-101-thread-1-processing-n:127.0.0.1:36203_) [n:127.0.0.1:36203_ c:control_collection s:shard1 r:core_node1 x:collection1] o.a.s.c.SolrCore [[collection1] ] Opening new SolrCore at [/home/jenkins/workspace/Lucene-Solr-trunk-Linux/solr/build/solr-solrj/test/J2/../../../../../../../../../home/jenkins/workspace/Lucene-Solr-trunk-Linux/solr/build/solr-solrj/test/J2/temp/solr.client.solrj.impl.CloudSolrClientTest_6F219DEA398C246-001/control-001/cores/collection1/], dataDir=[null]
   [junit4]   2> 52579 INFO  (coreLoadExecutor-101-thread-1-processing-n:127.0.0.1:36203_) [n:127.0.0.1:36203_ c:control_collection s:shard1 r:core_node1 x:collection1] o.a.s.c.SolrCore JMX monitoring not detected for core: collection1
   [junit4]   2> 52580 INFO  (coreLoadExecutor-101-thread-1-processing-n:127.0.0.1:36203_) [n:127.0.0.1:36203_ c:control_collection s:shard1 r:core_node1 x:collection1] o.a.s.c.CachingDirectoryFactory return new directory for /home/jenkins/workspace/Lucene-Solr-trunk-Linux/solr/build/solr-solrj/test/J2/../../../../../../../../../home/jenkins/workspace/Lucene-Solr-trunk-Linux/solr/build/solr-solrj/test/J2/temp/solr.client.solrj.impl.CloudSolrClientTest_6F219DEA398C246-001/control-001/cores/collection1/data
   [junit4]   2> 52580 INFO  (coreLoadExecutor-101-thread-1-processing-n:127.0.0.1:36203_) [n:127.0.0.1:36203_ c:control_collection s:shard1 r:core_node1 x:collection1] o.a.s.c.SolrCore New index directory detected: old=null new=/home/jenkins/workspace/Lucene-Solr-trunk-Linux/solr/build/solr-solrj/test/J2/../../../../../../../../../home/jenkins/workspace/Lucene-Solr-trunk-Linux/solr/build/solr-solrj/test/J2/temp/solr.client.solrj.impl.CloudSolrClientTest_6F219DEA398C246-001/control-001/cores/collection1/data/index/
   [junit4]   2> 52580 WARN  (coreLoadExecutor-101-thread-1-processing-n:127.0.0.1:36203_) [n:127.0.0.1:36203_ c:control_collection s:shard1 r:core_node1 x:collection1] o.a.s.c.SolrCore [collection1] Solr index directory '/home/jenkins/workspace/Lucene-Solr-trunk-Linux/solr/build/solr-solrj/test/J2/../../../../../../../../../home/jenkins/workspace/Lucene-Solr-trunk-Linux/solr/build/solr-solrj/test/J2/temp/solr.client.solrj.impl.CloudSolrClientTest_6F219DEA398C246-001/control-001/cores/collection1/data/index' doesn't exist. Creating new index...
   [junit4]   2> 52580 INFO  (coreLoadExecutor-101-thread-1-processing-n:127.0.0.1:36203_) [n:127.0.0.1:36203_ c:control_collection s:shard1 r:core_node1 x:collection1] o.a.s.c.CachingDirectoryFactory return new directory for /home/jenkins/workspace/Lucene-Solr-trunk-Linux/solr/build/solr-solrj/test/J2/../../../../../../../../../home/jenkins/workspace/Lucene-Solr-trunk-Linux/solr/build/solr-solrj/test/J2/temp/solr.client.solrj.impl.CloudSolrClientTest_6F219DEA398C246-001/control-001/cores/collection1/data/index
   [junit4]   2> 52581 INFO  (coreLoadExecutor-101-thread-1-processing-n:127.0.0.1:36203_) [n:127.0.0.1:36203_ c:control_collection s:shard1 r:core_node1 x:collection1] o.a.s.c.SolrCore SolrDeletionPolicy.onCommit: commits: num=1
   [junit4]   2> 	commit{dir=MockDirectoryWrapper(RAMDirectory@6c0e70b1 lockFactory=org.apache.lucene.store.SingleInstanceLockFactory@33d23e11),segFN=segments_1,generation=1}
   [junit4]   2> 52581 INFO  (coreLoadExecutor-101-thread-1-processing-n:127.0.0.1:36203_) [n:127.0.0.1:36203_ c:control_collection s:shard1 r:core_node1 x:collection1] o.a.s.c.SolrCore newest commit generation = 1
   [junit4]   2> 52586 INFO  (OldIndexDirectoryCleanupThreadForCore-collection1) [n:127.0.0.1:36203_ c:control_collection s:shard1 r:core_node1 x:collection1] o.a.s.c.SolrCore Looking for old index directories to cleanup for core collection1 in /home/jenkins/workspace/Lucene-Solr-trunk-Linux/solr/build/solr-solrj/test/J2/../../../../../../../../../home/jenkins/workspace/Lucene-Solr-trunk-Linux/solr/build/solr-solrj/test/J2/temp/solr.client.solrj.impl.CloudSolrClientTest_6F219DEA398C246-001/control-001/cores/collection1/data/
   [junit4]   2> 52586 WARN  (OldIndexDirectoryCleanupThreadForCore-collection1) [n:127.0.0.1:36203_ c:control_collection s:shard1 r:core_node1 x:collection1] o.a.s.c.DirectoryFactory /home/jenkins/workspace/Lucene-Solr-trunk-Linux/solr/build/solr-solrj/test/J2/../../../../../../../../../home/jenkins/workspace/Lucene-Solr-trunk-Linux/solr/build/solr-solrj/test/J2/temp/solr.client.solrj.impl.CloudSolrClientTest_6F219DEA398C246-001/control-001/cores/collection1/data/ does not point to a valid data directory; skipping clean-up of old index directories.
   [junit4]   2> 52592 INFO  (coreLoadExecutor-101-thread-1-processing-n:127.0.0.1:36203_) [n:127.0.0.1:36203_ c:control_collection s:shard1 r:core_node1 x:collection1] o.a.s.c.SolrCore no updateRequestProcessorChain defined as default, creating implicit default
   [junit4]   2> 52593 INFO  (coreLoadExecutor-101-thread-1-processing-n:127.0.0.1:36203_) [n:127.0.0.1:36203_ c:control_collection s:shard1 r:core_node1 x:collection1] o.a.s.h.l.XMLLoader xsltCacheLifetimeSeconds=60
   [junit4]   2> 52595 INFO  (coreLoadExecutor-101-thread-1-processing-n:127.0.0.1:36203_) [n:127.0.0.1:36203_ c:control_collection s:shard1 r:core_node1 x:collection1] o.a.s.h.l.XMLLoader xsltCacheLifetimeSeconds=60
   [junit4]   2> 52596 INFO  (coreLoadExecutor-101-thread-1-processing-n:127.0.0.1:36203_) [n:127.0.0.1:36203_ c:control_collection s:shard1 r:core_node1 x:collection1] o.a.s.h.l.XMLLoader xsltCacheLifetimeSeconds=60
   [junit4]   2> 52597 INFO  (coreLoadExecutor-101-thread-1-processing-n:127.0.0.1:36203_) [n:127.0.0.1:36203_ c:control_collection s:shard1 r:core_node1 x:collection1] o.a.s.h.l.XMLLoader xsltCacheLifetimeSeconds=60
   [junit4]   2> 52600 INFO  (coreLoadExecutor-101-thread-1-processing-n:127.0.0.1:36203_) [n:127.0.0.1:36203_ c:control_collection s:shard1 r:core_node1 x:collection1] o.a.s.c.RequestHandlers Registered paths: /admin/mbeans,standard,,/update/csv,/update/json/docs,/admin/luke,/admin/segments,/get,/admin/system,/replication,/admin/properties,/config,/schema,/admin/plugins,/admin/logging,/update/json,/admin/threads,/admin/ping,/update,/admin/file
   [junit4]   2> 52601 INFO  (coreLoadExecutor-101-thread-1-processing-n:127.0.0.1:36203_) [n:127.0.0.1:36203_ c:control_collection s:shard1 r:core_node1 x:collection1] o.a.s.c.SolrCore Using default statsCache cache: org.apache.solr.search.stats.LocalStatsCache
   [junit4]   2> 52601 INFO  (coreLoadExecutor-101-thread-1-processing-n:127.0.0.1:36203_) [n:127.0.0.1:36203_ c:control_collection s:shard1 r:core_node1 x:collection1] o.a.s.u.UpdateHandler Using UpdateLog implementation: org.apache.solr.update.UpdateLog
   [junit4]   2> 52601 INFO  (coreLoadExecutor-101-thread-1-processing-n:127.0.0.1:36203_) [n:127.0.0.1:36203_ c:control_collection s:shard1 r:core_node1 x:collection1] o.a.s.u.UpdateLog Initializing UpdateLog: dataDir= defaultSyncLevel=FLUSH numRecordsToKeep=100 maxNumLogsToKeep=10 numVersionBuckets=65536
   [junit4]   2> 52602 INFO  (coreLoadExecutor-101-thread-1-processing-n:127.0.0.1:36203_) [n:127.0.0.1:36203_ c:control_collection s:shard1 r:core_node1 x:collection1] o.a.s.c.SolrCore Hard AutoCommit: disabled
   [junit4]   2> 52602 INFO  (coreLoadExecutor-101-thread-1-processing-n:127.0.0.1:36203_) [n:127.0.0.1:36203_ c:control_collection s:shard1 r:core_node1 x:collection1] o.a.s.c.SolrCore Soft AutoCommit: disabled
   [junit4]   2> 52603 INFO  (coreLoadExecutor-101-thread-1-processing-n:127.0.0.1:36203_) [n:127.0.0.1:36203_ c:control_collection s:shard1 r:core_node1 x:collection1] o.a.s.c.SolrCore SolrDeletionPolicy.onInit: commits: num=1
   [junit4]   2> 	commit{dir=MockDirectoryWrapper(RAMDirectory@6c0e70b1 lockFactory=org.apache.lucene.store.SingleInstanceLockFactory@33d23e11),segFN=segments_1,generation=1}
   [junit4]   2> 52603 INFO  (coreLoadExecutor-101-thread-1-processing-n:127.0.0.1:36203_) [n:127.0.0.1:36203_ c:control_collection s:shard1 r:core_node1 x:collection1] o.a.s.c.SolrCore newest commit generation = 1
   [junit4]   2> 52603 INFO  (coreLoadExecutor-101-thread-1-processing-n:127.0.0.1:36203_) [n:127.0.0.1:36203_ c:control_collection s:shard1 r:core_node1 x:collection1] o.a.s.s.SolrIndexSearcher Opening Searcher@18f47a7b[collection1] main
   [junit4]   2> 52603 INFO  (coreLoadExecutor-101-thread-1-processing-n:127.0.0.1:36203_) [n:127.0.0.1:36203_ c:control_collection s:shard1 r:core_node1 x:collection1] o.a.s.c.c.ZkStateReader Load collection config from:/collections/control_collection
   [junit4]   2> 52604 INFO  (coreLoadExecutor-101-thread-1-processing-n:127.0.0.1:36203_) [n:127.0.0.1:36203_ c:control_collection s:shard1 r:core_node1 x:collection1] o.a.s.c.c.ZkStateReader path=/collections/control_collection configName=conf1 specified config exists in ZooKeeper
   [junit4]   2> 52604 INFO  (coreLoadExecutor-101-thread-1-processing-n:127.0.0.1:36203_) [n:127.0.0.1:36203_ c:control_collection s:shard1 r:core_node1 x:collection1] o.a.s.r.ManagedResourceStorage Setting up ZooKeeper-based storage for the RestManager with znodeBase: /configs/conf1
   [junit4]   2> 52604 INFO  (coreLoadExecutor-101-thread-1-processing-n:127.0.0.1:36203_) [n:127.0.0.1:36203_ c:control_collection s:shard1 r:core_node1 x:collection1] o.a.s.r.ManagedResourceStorage Configured ZooKeeperStorageIO with znodeBase: /configs/conf1
   [junit4]   2> 52604 INFO  (coreLoadExecutor-101-thread-1-processing-n:127.0.0.1:36203_) [n:127.0.0.1:36203_ c:control_collection s:shard1 r:core_node1 x:collection1] o.a.s.r.RestManager Initializing RestManager with initArgs: {}
   [junit4]   2> 52604 INFO  (coreLoadExecutor-101-thread-1-processing-n:127.0.0.1:36203_) [n:127.0.0.1:36203_ c:control_collection s:shard1 r:core_node1 x:collection1] o.a.s.r.ManagedResourceStorage Reading _rest_managed.json using ZooKeeperStorageIO:path=/configs/conf1
   [junit4]   2> 52604 INFO  (coreLoadExecutor-101-thread-1-processing-n:127.0.0.1:36203_) [n:127.0.0.1:36203_ c:control_collection s:shard1 r:core_node1 x:collection1] o.a.s.r.ManagedResourceStorage No data found for znode /configs/conf1/_rest_managed.json
   [junit4]   2> 52604 INFO  (coreLoadExecutor-101-thread-1-processing-n:127.0.0.1:36203_) [n:127.0.0.1:36203_ c:control_collection s:shard1 r:core_node1 x:collection1] o.a.s.r.ManagedResourceStorage Loaded null at path _rest_managed.json using ZooKeeperStorageIO:path=/configs/conf1
   [junit4]   2> 52604 INFO  (coreLoadExecutor-101-thread-1-processing-n:127.0.0.1:36203_) [n:127.0.0.1:36203_ c:control_collection s:shard1 r:core_node1 x:collection1] o.a.s.r.RestManager Initializing 0 registered ManagedResources
   [junit4]   2> 52605 INFO  (coreLoadExecutor-101-thread-1-processing-n:127.0.0.1:36203_) [n:127.0.0.1:36203_ c:control_collection s:shard1 r:core_node1 x:collection1] o.a.s.h.ReplicationHandler Commits will be reserved for  10000
   [junit4]   2> 52605 INFO  (coreLoadExecutor-101-thread-1-processing-n:127.0.0.1:36203_) [n:127.0.0.1:36203_ c:control_collection s:shard1 r:core_node1 x:collection1] o.a.s.u.UpdateLog Looking up max value of version field to seed version buckets
   [junit4]   2> 52605 INFO  (coreLoadExecutor-101-thread-1-processing-n:127.0.0.1:36203_) [n:127.0.0.1:36203_ c:control_collection s:shard1 r:core_node1 x:collection1] o.a.s.u.VersionInfo Refreshing highest value of _version_ for 65536 version buckets from index
   [junit4]   2> 52605 INFO  (coreLoadExecutor-101-thread-1-processing-n:127.0.0.1:36203_) [n:127.0.0.1:36203_ c:control_collection s:shard1 r:core_node1 x:collection1] o.a.s.u.VersionInfo No terms found for _version_, cannot seed version bucket highest value from index
   [junit4]   2> 52605 INFO  (coreLoadExecutor-101-thread-1-processing-n:127.0.0.1:36203_) [n:127.0.0.1:36203_ c:control_collection s:shard1 r:core_node1 x:collection1] o.a.s.u.UpdateLog Could not find max version in index or recent updates, using new clock 1512088822620356608
   [junit4]   2> 52605 INFO  (searcherExecutor-102-thread-1-processing-n:127.0.0.1:36203_ x:collection1 s:shard1 c:control_collection r:core_node1) [n:127.0.0.1:36203_ c:control_collection s:shard1 r:core_node1 x:collection1] o.a.s.c.SolrCore [collection1] Registered new searcher Searcher@18f47a7b[collection1] main{ExitableDirectoryReader(UninvertingDirectoryReader())}
   [junit4]   2> 52607 INFO  (coreLoadExecutor-101-thread-1-processing-n:127.0.0.1:36203_) [n:127.0.0.1:36203_ c:control_collection s:shard1 r:core_node1 x:collection1] o.a.s.u.UpdateLog Took 2.0ms to seed version buckets with highest version 1512088822620356608
   [junit4]   2> 52607 INFO  (coreLoadExecutor-101-thread-1-processing-n:127.0.0.1:36203_) [n:127.0.0.1:36203_ c:control_collection s:shard1 r:core_node1 x:collection1] o.a.s.c.ZkController watch zkdir /configs/conf1
   [junit4]   2> 52608 INFO  (coreLoadExecutor-101-thread-1-processing-n:127.0.0.1:36203_) [n:127.0.0.1:36203_ c:control_collection s:shard1 r:core_node1 x:collection1] o.a.s.c.CoreContainer registering core: collection1
   [junit4]   2> 52608 INFO  (coreZkRegister-95-thread-1-processing-n:127.0.0.1:36203_ x:collection1 s:shard1 c:control_collection r:core_node1) [n:127.0.0.1:36203_ c:control_collection s:shard1 r:core_node1 x:collection1] o.a.s.c.ZkController Register replica - core:collection1 address:https://127.0.0.1:36203 collection:control_collection shard:shard1
   [junit4]   2> 52608 INFO  (coreZkRegister-95-thread-1-processing-n:127.0.0.1:36203_ x:collection1 s:shard1 c:control_collection r:core_node1) [n:127.0.0.1:36203_ c:control_collection s:shard1 r:core_node1 x:collection1] o.a.s.c.c.SolrZkClient makePath: /collections/control_collection/leader_elect/shard1/election
   [junit4]   2> 52611 INFO  (coreZkRegister-95-thread-1-processing-n:127.0.0.1:36203_ x:collection1 s:shard1 c:control_collection r:core_node1) [n:127.0.0.1:36203_ c:control_collection s:shard1 r:core_node1 x:collection1] o.a.s.c.LeaderElector Joined leadership election with path: /collections/control_collection/leader_elect/shard1/election/94505551309963269-core_node1-n_0000000000
   [junit4]   2> 52611 INFO  (coreZkRegister-95-thread-1-processing-n:127.0.0.1:36203_ x:collection1 s:shard1 c:control_collection r:core_node1) [n:127.0.0.1:36203_ c:control_collection s:shard1 r:core_node1 x:collection1] o.a.s.c.ShardLeaderElectionContext Running the leader process for shard shard1
   [junit4]   2> 52612 INFO  (coreZkRegister-95-thread-1-processing-n:127.0.0.1:36203_ x:collection1 s:shard1 c:control_collection r:core_node1) [n:127.0.0.1:36203_ c:control_collection s:shard1 r:core_node1 x:collection1] o.a.s.c.ShardLeaderElectionContext Enough replicas found to continue.
   [junit4]   2> 52612 INFO  (coreZkRegister-95-thread-1-processing-n:127.0.0.1:36203_ x:collection1 s:shard1 c:control_collection r:core_node1) [n:127.0.0.1:36203_ c:control_collection s:shard1 r:core_node1 x:collection1] o.a.s.c.ShardLeaderElectionContext I may be the new leader - try and sync
   [junit4]   2> 52613 INFO  (coreZkRegister-95-thread-1-processing-n:127.0.0.1:36203_ x:collection1 s:shard1 c:control_collection r:core_node1) [n:127.0.0.1:36203_ c:control_collection s:shard1 r:core_node1 x:collection1] o.a.s.c.SyncStrategy Sync replicas to https://127.0.0.1:36203/collection1/
   [junit4]   2> 52613 INFO  (coreZkRegister-95-thread-1-processing-n:127.0.0.1:36203_ x:collection1 s:shard1 c:control_collection r:core_node1) [n:127.0.0.1:36203_ c:control_collection s:shard1 r:core_node1 x:collection1] o.a.s.c.SyncStrategy Sync Success - now sync replicas to me
   [junit4]   2> 52613 INFO  (coreZkRegister-95-thread-1-processing-n:127.0.0.1:36203_ x:collection1 s:shard1 c:control_collection r:core_node1) [n:127.0.0.1:36203_ c:control_collection s:shard1 r:core_node1 x:collection1] o.a.s.c.SyncStrategy https://127.0.0.1:36203/collection1/ has no replicas
   [junit4]   2> 52613 INFO  (coreZkRegister-95-thread-1-processing-n:127.0.0.1:36203_ x:collection1 s:shard1 c:control_collection r:core_node1) [n:127.0.0.1:36203_ c:control_collection s:shard1 r:core_node1 x:collection1] o.a.s.c.ShardLeaderElectionContext I am the new leader: https://127.0.0.1:36203/collection1/ shard1
   [junit4]   2> 52613 INFO  (coreZkRegister-95-thread-1-processing-n:127.0.0.1:36203_ x:collection1 s:shard1 c:control_collection r:core_node1) [n:127.0.0.1:36203_ c:control_collection s:shard1 r:core_node1 x:collection1] o.a.s.c.c.SolrZkClient makePath: /collections/control_collection/leaders/shard1
   [junit4]   2> 52613 INFO  (OverseerStateUpdate-94505551309963269-127.0.0.1:36203_-n_0000000000) [n:127.0.0.1:36203_    ] o.a.s.c.Overseer processMessage: queueSize: 1, message = {
   [junit4]   2>   "operation":"leader",
   [junit4]   2>   "shard":"shard1",
   [junit4]   2>   "collection":"control_collection"} current state version: 1
   [junit4]   2> 52615 INFO  (coreZkRegister-95-thread-1-processing-n:127.0.0.1:36203_ x:collection1 s:shard1 c:control_collection r:core_node1) [n:127.0.0.1:36203_ c:control_collection s:shard1 r:core_node1 x:collection1] o.a.s.c.ShardLeaderElectionContextBase Creating leader registration node
   [junit4]   2> 52619 INFO  (OverseerStateUpdate-94505551309963269-127.0.0.1:36203_-n_0000000000) [n:127.0.0.1:36203_    ] o.a.s.c.Overseer processMessage: queueSize: 1, message = {
   [junit4]   2>   "operation":"leader",
   [junit4]   2>   "shard":"shard1",
   [junit4]   2>   "collection":"control_collection",
   [junit4]   2>   "base_url":"https://127.0.0.1:36203",
   [junit4]   2>   "core":"collection1",
   [junit4]   2>   "state":"active"} current state version: 1
   [junit4]   2> 52721 INFO  (zkCallback-149-thread-1-processing-n:127.0.0.1:36203_) [n:127.0.0.1:36203_    ] o.a.s.c.c.ZkStateReader A cluster state change: WatchedEvent state:SyncConnected type:NodeDataChanged path:/clusterstate.json, has occurred - updating... (live nodes size: 1)
   [junit4]   2> 52770 INFO  (coreZkRegister-95-thread-1-processing-n:127.0.0.1:36203_ x:collection1 s:shard1 c:control_collection r:core_node1) [n:127.0.0.1:36203_ c:control_collection s:shard1 r:core_node1 x:collection1] o.a.s.c.ZkController We are https://127.0.0.1:36203/collection1/ and leader is https://127.0.0.1:36203/collection1/
   [junit4]   2> 52770 INFO  (coreZkRegister-95-thread-1-processing-n:127.0.0.1:36203_ x:collection1 s:shard1 c:control_collection r:core_node1) [n:127.0.0.1:36203_ c:control_collection s:shard1 r:core_node1 x:collection1] o.a.s.c.ZkController No LogReplay needed for core=collection1 baseURL=https://127.0.0.1:36203
   [junit4]   2> 52770 INFO  (coreZkRegister-95-thread-1-processing-n:127.0.0.1:36203_ x:collection1 s:shard1 c:control_collection r:core_node1) [n:127.0.0.1:36203_ c:control_collection s:shard1 r:core_node1 x:collection1] o.a.s.c.ZkController I am the leader, no recovery necessary
   [junit4]   2> 52770 INFO  (coreZkRegister-95-thread-1-processing-n:127.0.0.1:36203_ x:collection1 s:shard1 c:control_collection r:core_node1) [n:127.0.0.1:36203_ c:control_collection s:shard1 r:core_node1 x:collection1] o.a.s.c.ZkController publishing state=active
   [junit4]   2> 52770 INFO  (coreZkRegister-95-thread-1-processing-n:127.0.0.1:36203_ x:collection1 s:shard1 c:control_collection r:core_node1) [n:127.0.0.1:36203_ c:control_collection s:shard1 r:core_node1 x:collection1] o.a.s.c.ZkController numShards not found on descriptor - reading it from system property
   [junit4]   2> 52772 INFO  (OverseerStateUpdate-94505551309963269-127.0.0.1:36203_-n_0000000000) [n:127.0.0.1:36203_    ] o.a.s.c.Overseer processMessage: queueSize: 1, message = {
   [junit4]   2>   "core":"collection1",
   [junit4]   2>   "core_node_name":"core_node1",
   [junit4]   2>   "roles":null,
   [junit4]   2>   "base_url":"https://127.0.0.1:36203",
   [junit4]   2>   "node_name":"127.0.0.1:36203_",
   [junit4]   2>   "numShards":"1",
   [junit4]   2>   "state":"active",
   [junit4]   2>   "shard":"shard1",
   [junit4]   2>   "collection":"control_collection",
   [junit4]   2>   "operation":"state"} current state version: 2
   [junit4]   2> 52773 INFO  (OverseerStateUpdate-94505551309963269-127.0.0.1:36203_-n_0000000000) [n:127.0.0.1:36203_    ] o.a.s.c.o.ReplicaMutator Update state numShards=1 message={
   [junit4]   2>   "core":"collection1",
   [junit4]   2>   "core_node_name":"core_node1",
   [junit4]   2>   "roles":null,
   [junit4]   2>   "base_url":"https://127.0.0.1:36203",
   [junit4]   2>   "node_name":"127.0.0.1:36203_",
   [junit4]   2>   "numShards":"1",
   [junit4]   2>   "state":"active",
   [junit4]   2>   "shard":"shard1",
   [junit4]   2>   "collection":"control_collection",
   [junit4]   2>   "operation":"state"}
   [junit4]   2> 52878 INFO  (zkCallback-149-thread-1-processing-n:127.0.0.1:36203_) [n:127.0.0.1:36203_    ] o.a.s.c.c.ZkStateReader A cluster state change: WatchedEvent state:SyncConnected type:NodeDataChanged path:/clusterstate.json, has occurred - updating... (live nodes size: 1)
   [junit4]   2> 52928 INFO  (TEST-CloudSolrClientTest.test-seed#[6F219DEA398C246]) [    ] o.a.s.c.c.SolrZkClient Using default ZkCredentialsProvider
   [junit4]   2> 52928 INFO  (TEST-CloudSolrClientTest.test-seed#[6F219DEA398C246]) [    ] o.a.s.c.c.ConnectionManager Waiting for client to connect to ZooKeeper
   [junit4]   2> 52930 INFO  (zkCallback-151-thread-1) [    ] o.a.s.c.c.ConnectionManager Watcher org.apache.solr.common.cloud.ConnectionManager@1768a079 name:ZooKeeperConnection Watcher:127.0.0.1:34565/solr got event WatchedEvent state:SyncConnected type:None path:null path:null type:None
   [junit4]   2> 52930 INFO  (TEST-CloudSolrClientTest.test-seed#[6F219DEA398C246]) [    ] o.a.s.c.c.ConnectionManager Client is connected to ZooKeeper
   [junit4]   2> 52930 INFO  (TEST-CloudSolrClientTest.test-seed#[6F219DEA398C246]) [    ] o.a.s.c.c.SolrZkClient Using default ZkACLProvider
   [junit4]   2> 52931 INFO  (TEST-CloudSolrClientTest.test-seed#[6F219DEA398C246]) [    ] o.a.s.c.c.ZkStateReader Updating cluster state from ZooKeeper... 
   [junit4]   2> 52932 INFO  (TEST-CloudSolrClientTest.test-seed#[6F219DEA398C246]) [    ] o.a.s.c.ChaosMonkey monkey: init - expire sessions:false cause connection loss:false
   [junit4]   2> 52944 INFO  (TEST-CloudSolrClientTest.test-seed#[6F219DEA398C246]) [    ] o.a.s.SolrTestCaseJ4 Writing core.properties file to /home/jenkins/workspace/Lucene-Solr-trunk-Linux/solr/build/solr-solrj/test/J2/temp/solr.client.solrj.impl.CloudSolrClientTest_6F219DEA398C246-001/shard-1-001/cores/collection1
   [junit4]   2> 52945 INFO  (TEST-CloudSolrClientTest.test-seed#[6F219DEA398C246]) [    ] o.a.s.c.AbstractFullDistribZkTestBase create jetty 1 in directory /home/jenkins/workspace/Lucene-Solr-trunk-Linux/solr/build/solr-solrj/test/J2/temp/solr.client.solrj.impl.CloudSolrClientTest_6F219DEA398C246-001/shard-1-001
   [junit4]   2> 52945 INFO  (TEST-CloudSolrClientTest.test-seed#[6F219DEA398C246]) [    ] o.e.j.s.Server jetty-9.2.13.v20150730
   [junit4]   2> 52947 INFO  (TEST-CloudSolrClientTest.test-seed#[6F219DEA398C246]) [    ] o.e.j.s.h.ContextHandler Started o.e.j.s.ServletContextHandler@39a37e8c{/,null,AVAILABLE}
   [junit4]   2> 52964 INFO  (TEST-CloudSolrClientTest.test-seed#[6F219DEA398C246]) [    ] o.e.j.s.ServerConnector Started ServerConnector@4be40946{SSL-http/1.1}{127.0.0.1:46957}
   [junit4]   2> 52964 INFO  (TEST-CloudSolrClientTest.test-seed#[6F219DEA398C246]) [    ] o.e.j.s.Server Started @55252ms
   [junit4]   2> 52964 INFO  (TEST-CloudSolrClientTest.test-seed#[6F219DEA398C246]) [    ] o.a.s.c.s.e.JettySolrRunner Jetty properties: {solr.data.dir=/home/jenkins/workspace/Lucene-Solr-trunk-Linux/solr/build/solr-solrj/test/J2/temp/solr.client.solrj.impl.CloudSolrClientTest_6F219DEA398C246-001/tempDir-001/jetty1, solrconfig=solrconfig.xml, hostContext=/, hostPort=46957, coreRootDirectory=/home/jenkins/workspace/Lucene-Solr-trunk-Linux/solr/build/solr-solrj/test/J2/../../../../../../../../../home/jenkins/workspace/Lucene-Solr-trunk-Linux/solr/build/solr-solrj/test/J2/temp/solr.client.solrj.impl.CloudSolrClientTest_6F219DEA398C246-001/shard-1-001/cores}
   [junit4]   2> 52965 INFO  (TEST-CloudSolrClientTest.test-seed#[6F219DEA398C246]) [    ] o.a.s.s.SolrDispatchFilter SolrDispatchFilter.init(): sun.misc.Launcher$AppClassLoader@659e0bfd
   [junit4]   2> 52965 INFO  (TEST-CloudSolrClientTest.test-seed#[6F219DEA398C246]) [    ] o.a.s.c.SolrResourceLoader new SolrResourceLoader for directory: '/home/jenkins/workspace/Lucene-Solr-trunk-Linux/solr/build/solr-solrj/test/J2/../../../../../../../../../home/jenkins/workspace/Lucene-Solr-trunk-Linux/solr/build/solr-solrj/test/J2/temp/solr.client.solrj.impl.CloudSolrClientTest_6F219DEA398C246-001/shard-1-001/'
   [junit4]   2> 52978 INFO  (TEST-CloudSolrClientTest.test-seed#[6F219DEA398C246]) [    ] o.a.s.c.c.SolrZkClient Using default ZkCredentialsProvider
   [junit4]   2> 52979 INFO  (TEST-CloudSolrClientTest.test-seed#[6F219DEA398C246]) [    ] o.a.s.c.c.ConnectionManager Waiting for client to connect to ZooKeeper
   [junit4]   2> 52980 INFO  (zkCallback-152-thread-1) [    ] o.a.s.c.c.ConnectionManager Watcher org.apache.solr.common.cloud.ConnectionManager@26da61e8 name:ZooKeeperConnection Watcher:127.0.0.1:34565/solr got event WatchedEvent state:SyncConnected type:None path:null path:null type:None
   [junit4]   2> 52981 INFO  (TEST-CloudSolrClientTest.test-seed#[6F219DEA398C246]) [    ] o.a.s.c.c.ConnectionManager Client is connected to ZooKeeper
   [junit4]   2> 52981 INFO  (TEST-CloudSolrClientTest.test-seed#[6F219DEA398C246]) [    ] o.a.s.c.c.SolrZkClient Using default ZkACLProvider
   [junit4]   2> 52982 INFO  (TEST-CloudSolrClientTest.test-seed#[6F219DEA398C246]) [    ] o.a.s.s.SolrDispatchFilter Loading solr.xml from SolrHome (not found in ZooKeeper)
   [junit4]   2> 52982 INFO  (TEST-CloudSolrClientTest.test-seed#[6F219DEA398C246]) [    ] o.a.s.c.SolrXmlConfig Loading container configuration from /home/jenkins/workspace/Lucene-Solr-trunk-Linux/solr/build/solr-solrj/test/J2/../../../../../../../../../home/jenkins/workspace/Lucene-Solr-trunk-Linux/solr/build/solr-solrj/test/J2/temp/solr.client.solrj.impl.CloudSolrClientTest_6F219DEA398C246-001/shard-1-001/solr.xml
   [junit4]   2> 52988 INFO  (TEST-CloudSolrClientTest.test-seed#[6F219DEA398C246]) [    ] o.a.s.c.CoresLocator Config-defined core root directory: /home/jenkins/workspace/Lucene-Solr-trunk-Linux/solr/build/solr-solrj/test/J2/../../../../../../../../../home/jenkins/workspace/Lucene-Solr-trunk-Linux/solr/build/solr-solrj/test/J2/temp/solr.client.solrj.impl.CloudSolrClientTest_6F219DEA398C246-001/shard-1-001/cores
   [junit4]   2> 52989 INFO  (TEST-CloudSolrClientTest.test-seed#[6F219DEA398C246]) [    ] o.a.s.c.CoreContainer New CoreContainer 1655819295
   [junit4]   2> 52989 INFO  (TEST-CloudSolrClientTest.test-seed#[6F219DEA398C246]) [    ] o.a.s.c.CoreContainer Loading cores into CoreContainer [instanceDir=/home/jenkins/workspace/Lucene-Solr-trunk-Linux/solr/build/solr-solrj/test/J2/../../../../../../../../../home/jenkins/workspace/Lucene-Solr-trunk-Linux/solr/build/solr-solrj/test/J2/temp/solr.client.solrj.impl.CloudSolrClientTest_6F219DEA398C246-001/shard-1-001/]
   [junit4]   2> 52989 INFO  (TEST-CloudSolrClientTest.test-seed#[6F219DEA398C246]) [    ] o.a.s.c.CoreContainer loading shared library: /home/jenkins/workspace/Lucene-Solr-trunk-Linux/solr/build/solr-solrj/test/J2/../../../../../../../../../home/jenkins/workspace/Lucene-Solr-trunk-Linux/solr/build/solr-solrj/test/J2/temp/solr.client.solrj.impl.CloudSolrClientTest_6F219DEA398C246-001/shard-1-001/lib
   [junit4]   2> 52989 WARN  (TEST-CloudSolrClientTest.test-seed#[6F219DEA398C246]) [    ] o.a.s.c.SolrResourceLoader Can't find (or read) directory to add to classloader: lib (resolved as: /home/jenkins/workspace/Lucene-Solr-trunk-Linux/solr/build/solr-solrj/test/J2/../../../../../../../../../home/jenkins/workspace/Lucene-Solr-trunk-Linux/solr/build/solr-solrj/test/J2/temp/solr.client.solrj.impl.CloudSolrClientTest_6F219DEA398C246-001/shard-1-001/lib).
   [junit4]   2> 52996 INFO  (TEST-CloudSolrClientTest.test-seed#[6F219DEA398C246]) [    ] o.a.s.h.c.HttpShardHandlerFactory created with socketTimeout : 90000,urlScheme : ,connTimeout : 15000,maxConnectionsPerHost : 20,maxConnections : 10000,corePoolSize : 0,maximumPoolSize : 2147483647,maxThreadIdleTime : 5,sizeOfQueue : -1,fairnessPolicy : false,useRetries : false,
   [junit4]   2> 53001 INFO  (TEST-CloudSolrClientTest.test-seed#[6F219DEA398C246]) [    ] o.a.s.u.UpdateShardHandler Creating UpdateShardHandler HTTP client with params: socketTimeout=340000&connTimeout=45000&retry=true
   [junit4]   2> 53003 INFO  (TEST-CloudSolrClientTest.test-seed#[6F219DEA398C246]) [    ] o.a.s.l.LogWatcher SLF4J impl is org.slf4j.impl.Log4jLoggerFactory
   [junit4]   2> 53003 INFO  (TEST-CloudSolrClientTest.test-seed#[6F219DEA398C246]) [    ] o.a.s.l.LogWatcher Registering Log Listener [Log4j (org.slf4j.impl.Log4jLoggerFactory)]
   [junit4]   2> 53003 INFO  (TEST-CloudSolrClientTest.test-seed#[6F219DEA398C246]) [    ] o.a.s.c.ZkContainer Zookeeper client=127.0.0.1:34565/solr
   [junit4]   2> 53003 INFO  (TEST-CloudSolrClientTest.test-seed#[6F219DEA398C246]) [    ] o.a.s.c.ZkController zkHost includes chroot
   [junit4]   2> 53003 INFO  (TEST-CloudSolrClientTest.test-seed#[6F219DEA398C246]) [    ] o.a.s.c.c.SolrZkClient Using default ZkCredentialsProvider
   [junit4]   2> 53005 INFO  (TEST-CloudSolrClientTest.test-seed#[6F219DEA398C246]) [    ] o.a.s.c.c.ConnectionManager Waiting for client to connect to ZooKeeper
   [junit4]   2> 53005 INFO  (zkCallback-154-thread-1) [    ] o.a.s.c.c.ConnectionManager Watcher org.apache.solr.common.cloud.ConnectionManager@37371ec7 name:ZooKeeperConnection Watcher:127.0.0.1:34565 got event WatchedEvent state:SyncConnected type:None path:null path:null type:None
   [junit4]   2> 53006 INFO  (TEST-CloudSolrClientTest.test-seed#[6F219DEA398C246]) [    ] o.a.s.c.c.ConnectionManager Client is connected to ZooKeeper
   [junit4]   2> 53006 INFO  (TEST-CloudSolrClientTest.test-seed#[6F219DEA398C246]) [    ] o.a.s.c.c.SolrZkClient Using default ZkACLProvider
   [junit4]   2> 53007 INFO  (TEST-CloudSolrClientTest.test-seed#[6F219DEA398C246]) [n:127.0.0.1:46957_    ] o.a.s.c.c.ConnectionManager Waiting for client to connect to ZooKeeper
   [junit4]   2> 53008 INFO  (zkCallback-155-thread-1-processing-n:127.0.0.1:46957_) [n:127.0.0.1:46957_    ] o.a.s.c.c.ConnectionManager Watcher org.apache.solr.common.cloud.ConnectionManager@c088eda name:ZooKeeperConnection Watcher:127.0.0.1:34565/solr got event WatchedEvent state:SyncConnected type:None path:null path:null type:None
   [junit4]   2> 53008 INFO  (TEST-CloudSolrClientTest.test-seed#[6F219DEA398C246]) [n:127.0.0.1:46957_    ] o.a.s.c.c.ConnectionManager Client is connected to ZooKeeper
   [junit4]   2> 53011 INFO  (TEST-CloudSolrClientTest.test-seed#[6F219DEA398C246]) [n:127.0.0.1:46957_    ] o.a.s.c.c.ZkStateReader Updating cluster state from ZooKeeper... 
   [junit4]   2> 54014 INFO  (TEST-CloudSolrClientTest.test-seed#[6F219DEA398C246]) [n:127.0.0.1:46957_    ] o.a.s.c.ZkController Register node as live in ZooKeeper:/live_nodes/127.0.0.1:46957_
   [junit4]   2> 54020 INFO  (TEST-CloudSolrClientTest.test-seed#[6F219DEA398C246]) [n:127.0.0.1:46957_    ] o.a.s.c.c.SolrZkClient makePath: /live_nodes/127.0.0.1:46957_
   [junit4]   2> 54021 INFO  (zkCallback-149-thread-1-processing-n:127.0.0.1:36203_) [n:127.0.0.1:36203_    ] o.a.s.c.c.ZkStateReader A live node change: WatchedEvent state:SyncConnected type:NodeChildrenChanged path:/live_nodes, has occurred - updating... (live nodes size: 1)
   [junit4]   2> 54021 INFO  (zkCallback-155-thread-1-processing-n:127.0.0.1:46957_) [n:127.0.0.1:46957_    ] o.a.s.c.c.ZkStateReader A live node change: WatchedEvent state:SyncConnected type:NodeChildrenChanged path:/live_nodes, has occurred - updating... (live nodes size: 1)
   [junit4]   2> 54022 INFO  (zkCallback-151-thread-1) [    ] o.a.s.c.c.ZkStateReader A live node change: WatchedEvent state:SyncConnected type:NodeChildrenChanged path:/live_nodes, has occurred - updating... (live nodes size: 1)
   [junit4]   2> 54023 INFO  (TEST-CloudSolrClientTest.test-seed#[6F219DEA398C246]) [n:127.0.0.1:46957_    ] o.a.s.c.Overseer Overseer (id=null) closing
   [junit4]   2> 54023 INFO  (TEST-CloudSolrClientTest.test-seed#[6F219DEA398C246]) [n:127.0.0.1:46957_    ] o.a.s.c.LeaderElector Joined leadership election with path: /overseer_elect/election/94505551309963273-127.0.0.1:46957_-n_0000000001
   [junit4]   2> 54024 INFO  (TEST-CloudSolrClientTest.test-seed#[6F219DEA398C246]) [n:127.0.0.1:46957_    ] o.a.s.c.LeaderElector Watching path /overseer_elect/election/94505551309963269-127.0.0.1:36203_-n_0000000000 to know if I could be the leader
   [junit4]   2> 54060 INFO  (TEST-CloudSolrClientTest.test-seed#[6F219DEA398C246]) [n:127.0.0.1:46957_    ] o.a.s.c.CoreContainer Security conf doesn't exist. Skipping setup for authorization module.
   [junit4]   2> 54060 INFO  (TEST-CloudSolrClientTest.test-seed#[6F219DEA398C246]) [n:127.0.0.1:46957_    ] o.a.s.c.CoreContainer No authentication plugin used.
   [junit4]   2> 54061 INFO  (TEST-CloudSolrClientTest.test-seed#[6F219DEA398C246]) [n:127.0.0.1:46957_    ] o.a.s.c.CoresLocator Looking for core definitions underneath /home/jenkins/workspace/Lucene-Solr-trunk-Linux/solr/build/solr-solrj/test/J2/../../../../../../../../../home/jenkins/workspace/Lucene-Solr-trunk-Linux/solr/build/solr-solrj/test/J2/temp/solr.client.solrj.impl.CloudSolrClientTest_6F219DEA398C246-001/shard-1-001/cores
   [junit4]   2> 54062 INFO  (TEST-CloudSolrClientTest.test-seed#[6F219DEA398C246]) [n:127.0.0.1:46957_    ] o.a.s.c.SolrCore Created CoreDescriptor: {name=collection1, config=solrconfig.xml, transient=false, schema=schema.xml, loadOnStartup=true, configSetProperties=configsetprops.json, instanceDir=/home/jenkins/workspace/Lucene-Solr-trunk-Linux/solr/build/solr-solrj/test/J2/../../../../../../../../../home/jenkins/workspace/Lucene-Solr-trunk-Linux/solr/build/solr-solrj/test/J2/temp/solr.client.solrj.impl.CloudSolrClientTest_6F219DEA398C246-001/shard-1-001/cores/collection1, collection=collection1, absoluteInstDir=/home/jenkins/workspace/Lucene-Solr-trunk-Linux/solr/build/solr-solrj/test/J2/../../../../../../../../../home/jenkins/workspace/Lucene-Solr-trunk-Linux/solr/build/solr-solrj/test/J2/temp/solr.client.solrj.impl.CloudSolrClientTest_6F219DEA398C246-001/shard-1-001/cores/collection1/, coreNodeName=, dataDir=data/, shard=}
   [junit4]   2> 54062 INFO  (TEST-CloudSolrClientTest.test-seed#[6F219DEA398C246]) [n:127.0.0.1:46957_    ] o.a.s.c.CoresLocator Found core collection1 in /home/jenkins/workspace/Lucene-Solr-trunk-Linux/solr/build/solr-solrj/test/J2/../../../../../../../../../home/jenkins/workspace/Lucene-Solr-trunk-Linux/solr/build/solr-solrj/test/J2/temp/solr.client.solrj.impl.CloudSolrClientTest_6F219DEA398C246-001/shard-1-001/cores/collection1/
   [junit4]   2> 54062 INFO  (TEST-CloudSolrClientTest.test-seed#[6F219DEA398C246]) [n:127.0.0.1:46957_    ] o.a.s.c.CoresLocator Found 1 core definitions
   [junit4]   2> 54075 INFO  (TEST-CloudSolrClientTest.test-seed#[6F219DEA398C246]) [n:127.0.0.1:46957_    ] o.a.s.s.SolrDispatchFilter user.dir=/home/jenkins/workspace/Lucene-Solr-trunk-Linux/solr/build/solr-solrj/test/J2
   [junit4]   2> 54075 INFO  (coreLoadExecutor-112-thread-1-processing-n:127.0.0.1:46957_) [n:127.0.0.1:46957_ c:collection1   x:collection1] o.a.s.c.ZkController publishing state=down
   [junit4]   2> 54075 INFO  (coreLoadExecutor-112-thread-1-processing-n:127.0.0.1:46957_) [n:127.0.0.1:46957_ c:collection1   x:collection1] o.a.s.c.ZkController numShards not found on descriptor - reading it from system property
   [junit4]   2> 54075 INFO  (TEST-CloudSolrClientTest.test-seed#[6F219DEA398C246]) [n:127.0.0.1:46957_    ] o.a.s.s.SolrDispatchFilter SolrDispatchFilter.init() done
   [junit4]   2> 54077 INFO  (coreLoadExecutor-112-thread-1-processing-n:127.0.0.1:46957_) [n:127.0.0.1:46957_ c:collection1   x:collection1] o.a.s.c.ZkController look for our core node name
   [junit4]   2> 54077 INFO  (OverseerStateUpdate-94505551309963269-127.0.0.1:36203_-n_0000000000) [n:127.0.0.1:36203_    ] o.a.s.c.Overseer processMessage: queueSize: 1, message = {
   [junit4]   2>   "core":"collection1",
   [junit4]   2>   "roles":null,
   [junit4]   2>   "base_url":"https://127.0.0.1:46957",
   [junit4]   2>   "node_name":"127.0.0.1:46957_",
   [junit4]   2>   "numShards":"2",
   [junit4]   2>   "state":"down",
   [junit4]   2>   "shard":null,
   [junit4]   2>   "collection":"collection1",
   [junit4]   2>   "operation":"state"} current state version: 3
   [junit4]   2> 54077 INFO  (OverseerStateUpdate-94505551309963269-127.0.0.1:36203_-n_0000000000) [n:127.0.0.1:36203_    ] o.a.s.c.o.ReplicaMutator Update state numShards=2 message={
   [junit4]   2>   "core":"collection1",
   [junit4]   2>   "roles":null,
   [junit4]   2>   "base_url":"https://127.0.0.1:46957",
   [junit4]   2>   "node_name":"127.0.0.1:46957_",
   [junit4]   2>   "numShards":"2",
   [junit4]   2>   "state":"down",
   [junit4]   2>   "shard":null,
   [junit4]   2>   "collection":"collection1",
   [junit4]   2>   "operation":"state"}
   [junit4]   2> 54077 INFO  (OverseerStateUpdate-94505551309963269-127.0.0.1:36203_-n_0000000000) [n:127.0.0.1:36203_    ] o.a.s.c.o.ClusterStateMutator building a new cName: collection1
   [junit4]   2> 54078 INFO  (OverseerStateUpdate-94505551309963269-127.0.0.1:36203_-n_0000000000) [n:127.0.0.1:36203_    ] o.a.s.c.o.ReplicaMutator Assigning new node to shard shard=shard2
   [junit4]   2> 54182 INFO  (zkCallback-151-thread-1) [    ] o.a.s.c.c.ZkStateReader A cluster state change: WatchedEvent state:SyncConnected type:NodeDataChanged path:/clusterstate.json, has occurred - updating... (live nodes size: 2)
   [junit4]   2> 54182 INFO  (zkCallback-149-thread-1-processing-n:127.0.0.1:36203_) [n:127.0.0.1:36203_    ] o.a.s.c.c.ZkStateReader A cluster state change: WatchedEvent state:SyncConnected type:NodeDataChanged path:/clusterstate.json, has occurred - updating... (live nodes size: 2)
   [junit4]   2> 54182 INFO  (zkCallback-155-thread-1-processing-n:127.0.0.1:46957_) [n:127.0.0.1:46957_    ] o.a.s.c.c.ZkStateReader A cluster state change: WatchedEvent state:SyncConnected type:NodeDataChanged path:/clusterstate.json, has occurred - updating... (live nodes size: 2)
   [junit4]   2> 55077 INFO  (coreLoadExecutor-112-thread-1-processing-n:127.0.0.1:46957_) [n:127.0.0.1:46957_ c:collection1   x:collection1] o.a.s.c.ZkController waiting to find shard id in clusterstate for collection1
   [junit4]   2> 55077 INFO  (coreLoadExecutor-112-thread-1-processing-n:127.0.0.1:46957_) [n:127.0.0.1:46957_ c:collection1   x:collection1] o.a.s.c.ZkController Check for collection zkNode:collection1
   [junit4]   2> 55078 INFO  (coreLoadExecutor-112-thread-1-processing-n:127.0.0.1:46957_) [n:127.0.0.1:46957_ c:collection1   x:collection1] o.a.s.c.ZkController Collection zkNode exists
   [junit4]   2> 55078 INFO  (coreLoadExecutor-112-thread-1-processing-n:127.0.0.1:46957_) [n:127.0.0.1:46957_ c:collection1   x:collection1] o.a.s.c.c.ZkStateReader Load collection config from:/collections/collection1
   [junit4]   2> 55078 INFO  (coreLoadExecutor-112-thread-1-processing-n:127.0.0.1:46957_) [n:127.0.0.1:46957_ c:collection1   x:collection1] o.a.s.c.c.ZkStateReader path=/collections/collection1 configName=conf1 specified config exists in ZooKeeper
   [junit4]   2> 55079 INFO  (coreLoadExecutor-112-thread-1-processing-n:127.0.0.1:46957_) [n:127.0.0.1:46957_ c:collection1   x:collection1] o.a.s.c.SolrResourceLoader new SolrResourceLoader for directory: '/home/jenkins/workspace/Lucene-Solr-trunk-Linux/solr/build/solr-solrj/test/J2/../../../../../../../../../home/jenkins/workspace/Lucene-Solr-trunk-Linux/solr/build/solr-solrj/test/J2/temp/solr.client.solrj.impl.CloudSolrClientTest_6F219DEA398C246-001/shard-1-001/cores/collection1/'
   [junit4]   2> 55090 INFO  (coreLoadExecutor-112-thread-1-processing-n:127.0.0.1:46957_) [n:127.0.0.1:46957_ c:collection1   x:collection1] o.a.s.c.Config loaded config solrconfig.xml with version 0 
   [junit4]   2> 55095 INFO  (coreLoadExecutor-112-thread-1-processing-n:127.0.0.1:46957_) [n:127.0.0.1:46957_ c:collection1   x:collection1] o.a.s.c.SolrConfig current version of requestparams : -1
   [junit4]   2> 55098 INFO  (coreLoadExecutor-112-thread-1-processing-n:127.0.0.1:46957_) [n:127.0.0.1:46957_ c:collection1   x:collection1] o.a.s.c.SolrConfig Using Lucene MatchVersion: 6.0.0
   [junit4]   2> 55104 INFO  (coreLoadExecutor-112-thread-1-processing-n:127.0.0.1:46957_) [n:127.0.0.1:46957_ c:collection1   x:collection1] o.a.s.c.Config Loaded SolrConfig: solrconfig.xml
   [junit4]   2> 55105 INFO  (coreLoadExecutor-112-thread-1-processing-n:127.0.0.1:46957_) [n:127.0.0.1:46957_ c:collection1   x:collection1] o.a.s.s.IndexSchema Reading Solr Schema from /configs/conf1/schema.xml
   [junit4]   2> 55112 INFO  (coreLoadExecutor-112-thread-1-processing-n:127.0.0.1:46957_) [n:127.0.0.1:46957_ c:collection1   x:collection1] o.a.s.s.IndexSchema [collection1] Schema name=test
   [junit4]   2> 55206 INFO  (coreLoadExecutor-112-thread-1-processing-n:127.0.0.1:46957_) [n:127.0.0.1:46957_ c:collection1   x:collection1] o.a.s.s.IndexSchema default search field in schema is text
   [junit4]   2> 55207 INFO  (coreLoadExecutor-112-thread-1-processing-n:127.0.0.1:46957_) [n:127.0.0.1:46957_ c:collection1   x:collection1] o.a.s.s.IndexSchema unique key field: id
   [junit4]   2> 55209 WARN  (coreLoadExecutor-112-thread-1-processing-n:127.0.0.1:46957_) [n:127.0.0.1:46957_ c:collection1   x:collection1] o.a.s.s.IndexSchema Field lowerfilt1and2 is not multivalued and destination for multiple copyFields (2)
   [junit4]   2> 55209 WARN  (coreLoadExecutor-112-thread-1-processing-n:127.0.0.1:46957_) [n:127.0.0.1:46957_ c:collection1   x:collection1] o.a.s.s.IndexSchema Field text is not multivalued and destination for multiple copyFields (3)
   [junit4]   2> 55211 INFO  (coreLoadExecutor-112-thread-1-processing-n:127.0.0.1:46957_) [n:127.0.0.1:46957_ c:collection1   x:collection1] o.a.s.c.ConfigSetProperties Did not find ConfigSet properties, assuming default properties: Can't find resource 'configsetprops.json' in classpath or '/configs/conf1', cwd=/home/jenkins/workspace/Lucene-Solr-trunk-Linux/solr/build/solr-solrj/test/J2
   [junit4]   2> 55211 INFO  (coreLoadExecutor-112-thread-1-processing-n:127.0.0.1:46957_) [n:127.0.0.1:46957_ c:collection1   x:collection1] o.a.s.c.CoreContainer Creating SolrCore 'collection1' using configuration from collection collection1
   [junit4]   2> 55212 INFO  (coreLoadExecutor-112-thread-1-processing-n:127.0.0.1:46957_) [n:127.0.0.1:46957_ c:collection1 s:shard2 r:core_node1 x:collection1] o.a.s.c.SolrCore org.apache.solr.core.MockDirectoryFactory
   [junit4]   2> 55212 INFO  (coreLoadExecutor-112-thread-1-processing-n:127.0.0.1:46957_) [n:127.0.0.1:46957_ c:collection1 s:shard2 r:core_node1 x:collection1] o.a.s.c.SolrCore [[collection1] ] Opening new SolrCore at [/home/jenkins/workspace/Lucene-Solr-trunk-Linux/solr/build/solr-solrj/test/J2/../../../../../../../../../home/jenkins/workspace/Lucene-Solr-trunk-Linux/solr/build/solr-solrj/test/J2/temp/solr.client.solrj.impl.CloudSolrClientTest_6F219DEA398C246-001/shard-1-001/cores/collection1/], dataDir=[null]
   [junit4]   2> 55212 INFO  (coreLoadExecutor-112-thread-1-processing-n:127.0.0.1:46957_) [n:127.0.0.1:46957_ c:collection1 s:shard2 r:core_node1 x:collection1] o.a.s.c.SolrCore JMX monitoring not detected for core: collection1
   [junit4]   2> 55213 INFO  (coreLoadExecutor-112-thread-1-processing-n:127.0.0.1:46957_) [n:127.0.0.1:46957_ c:collection1 s:shard2 r:core_node1 x:collection1] o.a.s.c.CachingDirectoryFactory return new directory for /home/jenkins/workspace/Lucene-Solr-trunk-Linux/solr/build/solr-solrj/test/J2/../../../../../../../../../home/jenkins/workspace/Lucene-Solr-trunk-Linux/solr/build/solr-solrj/test/J2/temp/solr.client.solrj.impl.CloudSolrClientTest_6F219DEA398C246-001/shard-1-001/cores/collection1/data
   [junit4]   2> 55213 INFO  (coreLoadExecutor-112-thread-1-processing-n:127.0.0.1:46957_) [n:127.0.0.1:46957_ c:collection1 s:shard2 r:core_node1 x:collection1] o.a.s.c.SolrCore New index directory detected: old=null new=/home/jenkins/workspace/Lucene-Solr-trunk-Linux/solr/build/solr-solrj/test/J2/../../../../../../../../../home/jenkins/workspace/Lucene-Solr-trunk-Linux/solr/build/solr-solrj/test/J2/temp/solr.client.solrj.impl.CloudSolrClientTest_6F219DEA398C246-001/shard-1-001/cores/collection1/data/index/
   [junit4]   2> 55214 WARN  (coreLoadExecutor-112-thread-1-processing-n:127.0.0.1:46957_) [n:127.0.0.1:46957_ c:collection1 s:shard2 r:core_node1 x:collection1] o.a.s.c.SolrCore [collection1] Solr index directory '/home/jenkins/workspace/Lucene-Solr-trunk-Linux/solr/build/solr-solrj/test/J2/../../../../../../../../../home/jenkins/workspace/Lucene-Solr-trunk-Linux/solr/build/solr-solrj/test/J2/temp/solr.client.solrj.impl.CloudSolrClientTest_6F219DEA398C246-001/shard-1-001/cores/collection1/data/index' doesn't exist. Creating new index...
   [junit4]   2> 55214 INFO  (coreLoadExecutor-112-thread-1-processing-n:127.0.0.1:46957_) [n:127.0.0.1:46957_ c:collection1 s:shard2 r:core_node1 x:collection1] o.a.s.c.CachingDirectoryFactory return new directory for /home/jenkins/workspace/Lucene-Solr-trunk-Linux/solr/build/solr-solrj/test/J2/../../../../../../../../../home/jenkins/workspace/Lucene-Solr-trunk-Linux/solr/build/solr-solrj/test/J2/temp/solr.client.solrj.impl.CloudSolrClientTest_6F219DEA398C246-001/shard-1-001/cores/collection1/data/index
   [junit4]   2> 55216 INFO  (coreLoadExecutor-112-thread-1-processing-n:127.0.0.1:46957_) [n:127.0.0.1:46957_ c:collection1 s:shard2 r:core_node1 x:collection1] o.a.s.c.SolrCore SolrDeletionPolicy.onCommit: commits: num=1
   [junit4]   2> 	commit{dir=MockDirectoryWrapper(RAMDirectory@7fe7de03 lockFactory=org.apache.lucene.store.SingleInstanceLockFactory@5434c951),segFN=segments_1,generation=1}
   [junit4]   2> 55216 INFO  (coreLoadExecutor-112-thread-1-processing-n:127.0.0.1:46957_) [n:127.0.0.1:46957_ c:collection1 s:shard2 r:core_node1 x:collection1] o.a.s.c.SolrCore newest commit generation = 1
   [junit4]   2> 55223 INFO  (OldIndexDirectoryCleanupThreadForCore-collection1) [n:127.0.0.1:46957_ c:collection1 s:shard2 r:core_node1 x:collection1] o.a.s.c.SolrCore Looking for old index directories to cleanup for core collection1 in /home/jenkins/workspace/Lucene-Solr-trunk-Linux/solr/build/solr-solrj/test/J2/../../../../../../../../../home/jenkins/workspace/Lucene-Solr-trunk-Linux/solr/build/solr-solrj/test/J2/temp/solr.client.solrj.impl.CloudSolrClientTest_6F219DEA398C246-001/shard-1-001/cores/collection1/data/
   [junit4]   2> 55223 INFO  (coreLoadExecutor-112-thread-1-processing-n:127.0.0.1:46957_) [n:127.0.0.1:46957_ c:collection1 s:shard2 r:core_node1 x:collection1] o.a.s.c.SolrCore no updateRequestProcessorChain defined as default, creating implicit default
   [junit4]   2> 55226 INFO  (coreLoadExecutor-112-thread-1-processing-n:127.0.0.1:46957_) [n:127.0.0.1:46957_ c:collection1 s:shard2 r:core_node1 x:collection1] o.a.s.h.l.XMLLoader xsltCacheLifetimeSeconds=60
   [junit4]   2> 55227 INFO  (coreLoadExecutor-112-thread-1-processing-n:127.0.0.1:46957_) [n:127.0.0.1:46957_ c:collection1 s:shard2 r:core_node1 x:collection1] o.a.s.h.l.XMLLoader xsltCacheLifetimeSeconds=60
   [junit4]   2> 55228 WARN  (OldIndexDirectoryCleanupThreadForCore-collection1) [n:127.0.0.1:46957_ c:collection1 s:shard2 r:core_node1 x:collection1] o.a.s.c.DirectoryFactory /home/jenkins/workspace/Lucene-Solr-trunk-Linux/solr/build/solr-solrj/test/J2/../../../../../../../../../home/jenkins/workspace/Lucene-Solr-trunk-Linux/solr/build/solr-solrj/test/J2/temp/solr.client.solrj.impl.CloudSolrClientTest_6F219DEA398C246-001/shard-1-001/cores/collection1/data/ does not point to a valid data directory; skipping clean-up of old index directories.
   [junit4]   2> 55228 INFO  (coreLoadExecutor-112-thread-1-processing-n:127.0.0.1:46957_) [n:127.0.0.1:46957_ c:collection1 s:shard2 r:core_node1 x:collection1] o.a.s.h.l.XMLLoader xsltCacheLifetimeSeconds=60
   [junit4]   2> 55235 INFO  (coreLoadExecutor-112-thread-1-processing-n:127.0.0.1:46957_) [n:127.0.0.1:46957_ c:collection1 s:shard2 r:core_node1 x:collection1] o.a.s.h.l.XMLLoader xsltCacheLifetimeSeconds=60
   [junit4]   2> 55239 INFO  (coreLoadExecutor-112-thread-1-processing-n:127.0.0.1:46957_) [n:127.0.0.1:46957_ c:collection1 s:shard2 r:core_node1 x:collection1] o.a.s.c.RequestHandlers Registered paths: /admin/mbeans,standard,,/update/csv,/update/json/docs,/admin/luke,/admin/segments,/get,/admin/system,/replication,/admin/properties,/config,/schema,/admin/plugins,/admin/logging,/update/json,/admin/threads,/admin/ping,/update,/admin/file
   [junit4]   2> 55239 INFO  (coreLoadExecutor-112-thread-1-processing-n:127.0.0.1:46957_) [n:127.0.0.1:46957_ c:collection1 s:shard2 r:core_node1 x:collection1] o.a.s.c.SolrCore Using default statsCache cache: org.apache.solr.search.stats.LocalStatsCache
   [junit4]   2> 55240 INFO  (coreLoadExecutor-112-thread-1-processing-n:127.0.0.1:46957_) [n:127.0.0.1:46957_ c:collection1 s:shard2 r:core_node1 x:collection1] o.a.s.u.UpdateHandler Using UpdateLog implementation: org.apache.solr.update.UpdateLog
   [junit4]   2> 55240 INFO  (coreLoadExecutor-112-thread-1-processing-n:127.0.0.1:46957_) [n:127.0.0.1:46957_ c:collection1 s:shard2 r:core_node1 x:collection1] o.a.s.u.UpdateLog Initializing UpdateLog: dataDir= defaultSyncLevel=FLUSH numRecordsToKeep=100 maxNumLogsToKeep=10 numVersionBuckets=65536
   [junit4]   2> 55241 INFO  (coreLoadExecutor-112-thread-1-processing-n:127.0.0.1:46957_) [n:127.0.0.1:46957_ c:collection1 s:shard2 r:core_node1 x:collection1] o.a.s.c.SolrCore Hard AutoCommit: disabled
   [junit4]   2> 55242 INFO  (coreLoadExecutor-112-thread-1-processing-n:127.0.0.1:46957_) [n:127.0.0.1:46957_ c:collection1 s:shard2 r:core_node1 x:collection1] o.a.s.c.SolrCore Soft AutoCommit: disabled
   [junit4]   2> 55243 INFO  (coreLoadExecutor-112-thread-1-processing-n:127.0.0.1:46957_) [n:127.0.0.1:46957_ c:collection1 s:shard2 r:core_node1 x:collection1] o.a.s.c.SolrCore SolrDeletionPolicy.onInit: commits: num=1
   [junit4]   2> 	commit{dir=MockDirectoryWrapper(RAMDirectory@7fe7de03 lockFactory=org.apache.lucene.store.SingleInstanceLockFactory@5434c951),segFN=segments_1,generation=1}
   [junit4]   2> 55244 INFO  (coreLoadExecutor-112-thread-1-processing-n:127.0.0.1:46957_) [n:127.0.0.1:46957_ c:collection1 s:shard2 r:core_node1 x:collection1] o.a.s.c.SolrCore newest commit generation = 1
   [junit4]   2> 55245 INFO  (coreLoadExecutor-112-thread-1-processing-n:127.0.0.1:46957_) [n:127.0.0.1:46957_ c:collection1 s:shard2 r:core_node1 x:collection1] o.a.s.s.SolrIndexSearcher Opening Searcher@5916a2d4[collection1] main
   [junit4]   2> 55245 INFO  (coreLoadExecutor-112-thread-1-processing-n:127.0.0.1:46957_) [n:127.0.0.1:46957_ c:collection1 s:shard2 r:core_node1 x:collection1] o.a.s.c.c.ZkStateReader Load collection config from:/collections/collection1
   [junit4]   2> 55246 INFO  (coreLoadExecutor-112-thread-1-processing-n:127.0.0.1:46957_) [n:127.0.0.1:46957_ c:collection1 s:shard2 r:core_node1 x:collection1] o.a.s.c.c.ZkStateReader path=/collections/collection1 configName=conf1 specified config exists in ZooKeeper
   [junit4]   2> 55246 INFO  (coreLoadExecutor-112-thread-1-processing-n:127.0.0.1:46957_) [n:127.0.0.1:46957_ c:collection1 s:shard2 r:core_node1 x:collection1] o.a.s.r.ManagedResourceStorage Setting up ZooKeeper-based storage for the RestManager with znodeBase: /configs/conf1
   [junit4]   2> 55246 INFO  (coreLoadExecutor-112-thread-1-processing-n:127.0.0.1:46957_) [n:127.0.0.1:46957_ c:collection1 s:shard2 r:core_node1 x:collection1] o.a.s.r.ManagedResourceStorage Configured ZooKeeperStorageIO with znodeBase: /configs/conf1
   [junit4]   2> 55246 INFO  (coreLoadExecutor-112-thread-1-processing-n:127.0.0.1:46957_) [n:127.0.0.1:46957_ c:collection1 s:shard2 r:core_node1 x:collection1] o.a.s.r.RestManager Initializing RestManager with initArgs: {}
   [junit4]   2> 55246 INFO  (coreLoadExecutor-112-thread-1-processing-n:127.0.0.1:46957_) [n:127.0.0.1:46957_ c:collection1 s:shard2 r:core_node1 x:collection1] o.a.s.r.ManagedResourceStorage Reading _rest_managed.json using ZooKeeperStorageIO:path=/configs/conf1
   [junit4]   2> 55247 INFO  (coreLoadExecutor-112-thread-1-processing-n:127.0.0.1:46957_) [n:127.0.0.1:46957_ c:collection1 s:shard2 r:core_node1 x:collection1] o.a.s.r.ManagedResourceStorage No data found for znode /configs/conf1/_rest_managed.json
   [junit4]   2> 55247 INFO  (coreLoadExecutor-112-thread-1-processing-n:127.0.0.1:46957_) [n:127.0.0.1:46957_ c:collection1 s:shard2 r:core_node1 x:collection1] o.a.s.r.ManagedResourceStorage Loaded null at path _rest_managed.json using ZooKeeperStorageIO:path=/configs/conf1
   [junit4]   2> 55247 INFO  (coreLoadExecutor-112-thread-1-processing-n:127.0.0.1:46957_) [n:127.0.0.1:46957_ c:collection1 s:shard2 r:core_node1 x:collection1] o.a.s.r.RestManager Initializing 0 registered ManagedResources
   [junit4]   2> 55247 INFO  (coreLoadExecutor-112-thread-1-processing-n:127.0.0.1:46957_) [n:127.0.0.1:46957_ c:collection1 s:shard2 r:core_node1 x:collection1] o.a.s.h.ReplicationHandler Commits will be reserved for  10000
   [junit4]   2> 55247 INFO  (coreLoadExecutor-112-thread-1-processing-n:127.0.0.1:46957_) [n:127.0.0.1:46957_ c:collection1 s:shard2 r:core_node1 x:collection1] o.a.s.u.UpdateLog Looking up max value of version field to seed version buckets
   [junit4]   2> 55247 INFO  (coreLoadExecutor-112-thread-1-processing-n:127.0.0.1:46957_) [n:127.0.0.1:46957_ c:collection1 s:shard2 r:core_node1 x:collection1] o.a.s.u.VersionInfo Refreshing highest value of _version_ for 65536 version buckets from index
   [junit4]   2> 55248 INFO  (coreLoadExecutor-112-thread-1-processing-n:127.0.0.1:46957_) [n:127.0.0.1:46957_ c:collection1 s:shard2 r:core_node1 x:collection1] o.a.s.u.VersionInfo No terms found for _version_, cannot seed version bucket highest value from index
   [junit4]   2> 55248 INFO  (coreLoadExecutor-112-thread-1-processing-n:127.0.0.1:46957_) [n:127.0.0.1:46957_ c:collection1 s:shard2 r:core_node1 x:collection1] o.a.s.u.UpdateLog Could not find max version in index or recent updates, using new clock 1512088825391742976
   [junit4]   2> 55250 INFO  (coreLoadExecutor-112-thread-1-processing-n:127.0.0.1:46957_) [n:127.0.0.1:46957_ c:collection1 s:shard2 r:core_node1 x:collection1] o.a.s.u.UpdateLog Took 2.

[...truncated too long message...]

sing MockDirectoryFactory - 2 directories currently being tracked
   [junit4]   2> 138477 INFO  (zkCallback-229-thread-1-processing-n:127.0.0.1:55555_) [n:127.0.0.1:55555_ c:collection1 s:shard2 r:core_node3 x:collection1] o.a.s.c.CachingDirectoryFactory looking to close /home/jenkins/workspace/Lucene-Solr-trunk-Linux/solr/build/solr-solrj/test/J2/temp/solr.client.solrj.impl.CloudSolrClientTest_6F219DEA398C246-001/shard-3-003/cores/collection1/data [CachedDir<<refCount=0;path=/home/jenkins/workspace/Lucene-Solr-trunk-Linux/solr/build/solr-solrj/test/J2/temp/solr.client.solrj.impl.CloudSolrClientTest_6F219DEA398C246-001/shard-3-003/cores/collection1/data;done=false>>]
   [junit4]   2> 138478 INFO  (zkCallback-229-thread-1-processing-n:127.0.0.1:55555_) [n:127.0.0.1:55555_ c:collection1 s:shard2 r:core_node3 x:collection1] o.a.s.c.CachingDirectoryFactory Closing directory: /home/jenkins/workspace/Lucene-Solr-trunk-Linux/solr/build/solr-solrj/test/J2/temp/solr.client.solrj.impl.CloudSolrClientTest_6F219DEA398C246-001/shard-3-003/cores/collection1/data
   [junit4]   2> 138478 INFO  (zkCallback-229-thread-1-processing-n:127.0.0.1:55555_) [n:127.0.0.1:55555_ c:collection1 s:shard2 r:core_node3 x:collection1] o.a.s.c.CachingDirectoryFactory looking to close /home/jenkins/workspace/Lucene-Solr-trunk-Linux/solr/build/solr-solrj/test/J2/temp/solr.client.solrj.impl.CloudSolrClientTest_6F219DEA398C246-001/shard-3-003/cores/collection1/data/index [CachedDir<<refCount=0;path=/home/jenkins/workspace/Lucene-Solr-trunk-Linux/solr/build/solr-solrj/test/J2/temp/solr.client.solrj.impl.CloudSolrClientTest_6F219DEA398C246-001/shard-3-003/cores/collection1/data/index;done=false>>]
   [junit4]   2> 138478 INFO  (zkCallback-229-thread-1-processing-n:127.0.0.1:55555_) [n:127.0.0.1:55555_ c:collection1 s:shard2 r:core_node3 x:collection1] o.a.s.c.CachingDirectoryFactory Closing directory: /home/jenkins/workspace/Lucene-Solr-trunk-Linux/solr/build/solr-solrj/test/J2/temp/solr.client.solrj.impl.CloudSolrClientTest_6F219DEA398C246-001/shard-3-003/cores/collection1/data/index
   [junit4]   2> 138478 WARN  (zkCallback-229-thread-1-processing-n:127.0.0.1:55555_) [n:127.0.0.1:55555_ c:collection1 s:shard2 r:core_node3 x:collection1] o.a.s.c.LeaderElector 
   [junit4]   2> org.apache.solr.common.SolrException: org.apache.zookeeper.KeeperException$SessionExpiredException: KeeperErrorCode = Session expired for /overseer/queue
   [junit4]   2> 	at org.apache.solr.cloud.DistributedQueue.<init>(DistributedQueue.java:110)
   [junit4]   2> 	at org.apache.solr.cloud.Overseer.getInQueue(Overseer.java:897)
   [junit4]   2> 	at org.apache.solr.cloud.Overseer.getInQueue(Overseer.java:892)
   [junit4]   2> 	at org.apache.solr.cloud.ShardLeaderElectionContext.runLeaderProcess(ElectionContext.java:287)
   [junit4]   2> 	at org.apache.solr.cloud.LeaderElector.runIamLeaderProcess(LeaderElector.java:197)
   [junit4]   2> 	at org.apache.solr.cloud.LeaderElector.checkIfIamLeader(LeaderElector.java:157)
   [junit4]   2> 	at org.apache.solr.cloud.LeaderElector.joinElection(LeaderElector.java:346)
   [junit4]   2> 	at org.apache.solr.cloud.LeaderElector.joinElection(LeaderElector.java:255)
   [junit4]   2> 	at org.apache.solr.cloud.ShardLeaderElectionContext.rejoinLeaderElection(ElectionContext.java:547)
   [junit4]   2> 	at org.apache.solr.cloud.ShardLeaderElectionContext.runLeaderProcess(ElectionContext.java:311)
   [junit4]   2> 	at org.apache.solr.cloud.LeaderElector.runIamLeaderProcess(LeaderElector.java:197)
   [junit4]   2> 	at org.apache.solr.cloud.LeaderElector.checkIfIamLeader(LeaderElector.java:157)
   [junit4]   2> 	at org.apache.solr.cloud.LeaderElector.access$200(LeaderElector.java:58)
   [junit4]   2> 	at org.apache.solr.cloud.LeaderElector$ElectionWatcher.process(LeaderElector.java:388)
   [junit4]   2> 	at org.apache.solr.common.cloud.SolrZkClient$3$1.run(SolrZkClient.java:269)
   [junit4]   2> 	at java.util.concurrent.Executors$RunnableAdapter.call(Executors.java:511)
   [junit4]   2> 	at java.util.concurrent.FutureTask.run(FutureTask.java:266)
   [junit4]   2> 	at org.apache.solr.common.util.ExecutorUtil$MDCAwareThreadPoolExecutor$1.run(ExecutorUtil.java:231)
   [junit4]   2> 	at java.util.concurrent.ThreadPoolExecutor.runWorker(ThreadPoolExecutor.java:1142)
   [junit4]   2> 	at java.util.concurrent.ThreadPoolExecutor$Worker.run(ThreadPoolExecutor.java:617)
   [junit4]   2> 	at java.lang.Thread.run(Thread.java:745)
   [junit4]   2> Caused by: org.apache.zookeeper.KeeperException$SessionExpiredException: KeeperErrorCode = Session expired for /overseer/queue
   [junit4]   2> 	at org.apache.zookeeper.KeeperException.create(KeeperException.java:127)
   [junit4]   2> 	at org.apache.zookeeper.KeeperException.create(KeeperException.java:51)
   [junit4]   2> 	at org.apache.zookeeper.ZooKeeper.exists(ZooKeeper.java:1045)
   [junit4]   2> 	at org.apache.solr.common.cloud.SolrZkClient$5.execute(SolrZkClient.java:319)
   [junit4]   2> 	at org.apache.solr.common.cloud.SolrZkClient$5.execute(SolrZkClient.java:316)
   [junit4]   2> 	at org.apache.solr.common.cloud.ZkCmdExecutor.retryOperation(ZkCmdExecutor.java:61)
   [junit4]   2> 	at org.apache.solr.common.cloud.SolrZkClient.exists(SolrZkClient.java:316)
   [junit4]   2> 	at org.apache.solr.common.cloud.ZkCmdExecutor.ensureExists(ZkCmdExecutor.java:90)
   [junit4]   2> 	at org.apache.solr.common.cloud.ZkCmdExecutor.ensureExists(ZkCmdExecutor.java:84)
   [junit4]   2> 	at org.apache.solr.cloud.DistributedQueue.<init>(DistributedQueue.java:108)
   [junit4]   2> 	... 20 more
   [junit4]   2> 138480 INFO  (TEST-CloudSolrClientTest.testShutdown-seed#[6F219DEA398C246]) [    ] o.e.j.s.ServerConnector Stopped ServerConnector@4e8c706e{SSL-http/1.1}{127.0.0.1:0}
   [junit4]   2> 138480 INFO  (TEST-CloudSolrClientTest.testShutdown-seed#[6F219DEA398C246]) [    ] o.e.j.s.h.ContextHandler Stopped o.e.j.s.ServletContextHandler@1118a66c{/,null,UNAVAILABLE}
   [junit4]   2> 138481 INFO  (TEST-CloudSolrClientTest.testShutdown-seed#[6F219DEA398C246]) [n:127.0.0.1:55555_ c:collection1 s:shard2 r:core_node3 x:collection1] o.a.s.c.ChaosMonkey monkey: stop shard! 35221
   [junit4]   2> 138481 INFO  (TEST-CloudSolrClientTest.testShutdown-seed#[6F219DEA398C246]) [n:127.0.0.1:55555_ c:collection1 s:shard2 r:core_node3 x:collection1] o.a.s.c.ZkTestServer connecting to 127.0.0.1:57267 57267
   [junit4]   2> 138516 INFO  (Thread-280) [n:127.0.0.1:39586_ c:collection1 s:shard2 r:core_node3 x:collection1] o.a.s.c.ZkTestServer connecting to 127.0.0.1:57267 57267
   [junit4]   2> 138517 WARN  (Thread-280) [n:127.0.0.1:39586_ c:collection1 s:shard2 r:core_node3 x:collection1] o.a.s.c.ZkTestServer Watch limit violations: 
   [junit4]   2> Maximum concurrent create/delete watches above limit:
   [junit4]   2> 
   [junit4]   2> 	5	/solr/aliases.json
   [junit4]   2> 	4	/solr/security.json
   [junit4]   2> 	4	/solr/configs/conf1
   [junit4]   2> 
   [junit4]   2> Maximum concurrent data watches above limit:
   [junit4]   2> 
   [junit4]   2> 	5	/solr/clusterstate.json
   [junit4]   2> 	3	/solr/collections/collection1/state.json
   [junit4]   2> 
   [junit4]   2> Maximum concurrent children watches above limit:
   [junit4]   2> 
   [junit4]   2> 	5	/solr/live_nodes
   [junit4]   2> 	5	/solr/collections
   [junit4]   2> 	3	/solr/overseer/queue
   [junit4]   2> 	3	/solr/overseer/collection-queue-work
   [junit4]   2> 	2	/solr/overseer/queue-work
   [junit4]   2> 
   [junit4]   2> 138518 INFO  (SUITE-CloudSolrClientTest-seed#[6F219DEA398C246]-worker) [n:127.0.0.1:55555_ c:collection1 s:shard2 r:core_node3 x:collection1] o.a.s.SolrTestCaseJ4 ###deleteCore
   [junit4]   2> NOTE: leaving temporary files on disk at: /home/jenkins/workspace/Lucene-Solr-trunk-Linux/solr/build/solr-solrj/test/J2/temp/solr.client.solrj.impl.CloudSolrClientTest_6F219DEA398C246-001
   [junit4]   2> Sep 12, 2015 6:46:00 AM com.carrotsearch.randomizedtesting.ThreadLeakControl checkThreadLeaks
   [junit4]   2> WARNING: Will linger awaiting termination of 2 leaked thread(s).
   [junit4]   2> NOTE: test params are: codec=Asserting(Lucene53): {_version_=FST50, multiDefault=PostingsFormat(name=Memory doPackFST= true), a_t=FST50, intDefault=FST50, id=BlockTreeOrds(blocksize=128), text=Lucene50(blocksize=128), range_facet_l=FST50, timestamp=FST50}, docValues:{}, sim=DefaultSimilarity, locale=nl, timezone=Africa/Maseru
   [junit4]   2> NOTE: Linux 3.19.0-26-generic amd64/Oracle Corporation 1.8.0_60 (64-bit)/cpus=12,threads=1,free=309759912,total=521142272
   [junit4]   2> NOTE: All tests run in this JVM: [SolrExampleJettyTest, StreamExpressionTest, TestBatchUpdate, SolrExampleBinaryTest, SolrExceptionTest, ClientUtilsTest, CloudSolrClientTest]
   [junit4] Completed [63/67] on J2 in 88.56s, 3 tests, 1 failure <<< FAILURES!

[...truncated 23 lines...]
BUILD FAILED
/home/jenkins/workspace/Lucene-Solr-trunk-Linux/build.xml:775: The following error occurred while executing this line:
/home/jenkins/workspace/Lucene-Solr-trunk-Linux/build.xml:719: The following error occurred while executing this line:
/home/jenkins/workspace/Lucene-Solr-trunk-Linux/build.xml:59: The following error occurred while executing this line:
/home/jenkins/workspace/Lucene-Solr-trunk-Linux/solr/build.xml:246: The following error occurred while executing this line:
/home/jenkins/workspace/Lucene-Solr-trunk-Linux/solr/common-build.xml:514: The following error occurred while executing this line:
/home/jenkins/workspace/Lucene-Solr-trunk-Linux/lucene/common-build.xml:1432: The following error occurred while executing this line:
/home/jenkins/workspace/Lucene-Solr-trunk-Linux/lucene/common-build.xml:987: There were test failures: 67 suites, 467 tests, 1 failure

Total time: 46 minutes 13 seconds
Build step 'Invoke Ant' marked build as failure
Archiving artifacts
[WARNINGS] Skipping publisher since build result is FAILURE
Recording test results
Email was triggered for: Failure - Any
Sending email for trigger: Failure - Any